USD|13235.0|13215.0
SGD|9511.4|9491.4
EUR|13930.96|13830.96
AUD|10129.36|10049.36
DKK|1896.18|1826.18
SEK|1550.99|1480.99
CAD|10368.0|10288.0
CHF|13203.98|13103.98
NZD|9734.22|9664.22
GBP|19583.49|19443.49
HKD|1713.05|1693.05
JPY|110.45|107.45
SAR|3561.12|3491.12
CNY|2132.82|2092.82
remotelastupdate|16 Mar 2015 / 08:01 WIB