/home/keeper/workspace/om2m/org.keeper.iot/src/test/java/org/keeper/iot/wsn/plc/observer/PlcBrokerTest.java
/home/keeper/workspace/om2m/org.keeper.iot/src/test/java/org/keeper/iot/wsn/plc/messages/MessageTest.java
/home/keeper/workspace/om2m/org.keeper.iot/src/test/java/org/keeper/iot/wsn/plc/router/PlcMessageRouterTest.java
/home/keeper/workspace/om2m/org.keeper.iot/src/test/java/org/keeper/iot/wsn/plc/messages/sys/SysGetFirmwareVersionRequestTest.java
/home/keeper/workspace/om2m/org.keeper.iot/src/test/java/org/keeper/iot/wsn/plc/handler/AppDeviceResourceHolderTest.java
/home/keeper/workspace/om2m/org.keeper.iot/src/test/java/org/keeper/iot/wsn/plc/messages/PlcMessageFactoryTest.java
/home/keeper/workspace/om2m/org.keeper.iot/src/test/java/org/keeper/iot/wsn/plc/messages/appdevice/AppDeviceGetVersionRequestTest.java
/home/keeper/workspace/om2m/org.keeper.iot/src/test/java/org/keeper/iot/wsn/plc/handler/GenericHandlerTest.java
/home/keeper/workspace/om2m/org.keeper.iot/src/test/java/org/keeper/iot/wsn/plc/messages/appgenerics/AppGenericsGetCapabilitiesResponseTest.java
/home/keeper/workspace/om2m/org.keeper.iot/src/test/java/org/keeper/iot/wsn/plc/messages/sys/SysGetModelIdResponseTest.java
/home/keeper/workspace/om2m/org.keeper.iot/src/test/java/org/keeper/iot/wsn/plc/messages/sys/SysGetManufacturerIdResponseTest.java
/home/keeper/workspace/om2m/org.keeper.iot/src/test/java/org/keeper/iot/wsn/plc/router/ResourceHolderTest.java
/home/keeper/workspace/om2m/org.keeper.iot/src/test/java/org/keeper/iot/wsn/plc/messages/sys/SysGetSerialRequestTest.java
/home/keeper/workspace/om2m/org.keeper.iot/src/test/java/org/keeper/iot/wsn/plc/messages/appdevice/AppDeviceGetVersionResponseTest.java
/home/keeper/workspace/om2m/org.keeper.iot/src/test/java/org/keeper/iot/wsn/plc/resources/AppDeviceResourceManagerTest.java
/home/keeper/workspace/om2m/org.keeper.iot/src/test/java/org/keeper/iot/wsn/plc/handler/resources/ResourceHelpersTest.java
/home/keeper/workspace/om2m/org.keeper.iot/src/test/java/org/keeper/iot/wsn/plc/observer/KeyTest.java
/home/keeper/workspace/om2m/org.keeper.iot/src/test/java/org/keeper/iot/wsn/plc/messages/sys/SysGetSerialResponseTest.java
/home/keeper/workspace/om2m/org.keeper.iot/src/test/java/org/keeper/iot/wsn/plc/messages/sys/SysGetModelIdRequestTest.java
/home/keeper/workspace/om2m/org.keeper.iot/src/test/java/org/keeper/iot/wsn/plc/messages/sys/SysGetManufacturerIdRequestTest.java
