[
    {
        "id": "lFmuWU0tv4M",
        "created_at": "2018-09-07T10:15:09-04:00",
        "updated_at": "2022-02-20T11:04:30-05:00",
        "promoted_at": "2018-09-08T05:11:50-04:00",
        "width": 2848,
        "height": 2848,
        "color": "#f3c0d9",
        "blur_hash": "LJRUt6cB#ZR9~CXSInxBD5rExvbc",
        "description": "White page with color chart for your ideas!",
        "alt_description": "white notebook",
        "urls": {
            "raw": "https://images.unsplash.com/photo-1536329583941-14287ec6fc4e?ixid=Mnw3Njc0MHwxfDF8YWxsfDF8fHx8fHwyfHwxNjQ1NDI4MTU3&ixlib=rb-1.2.1",
            "full": "https://images.unsplash.com/photo-1536329583941-14287ec6fc4e?crop=entropy&cs=srgb&fm=jpg&ixid=Mnw3Njc0MHwxfDF8YWxsfDF8fHx8fHwyfHwxNjQ1NDI4MTU3&ixlib=rb-1.2.1&q=85",
            "regular": "https://images.unsplash.com/photo-1536329583941-14287ec6fc4e?crop=entropy&cs=tinysrgb&fit=max&fm=jpg&ixid=Mnw3Njc0MHwxfDF8YWxsfDF8fHx8fHwyfHwxNjQ1NDI4MTU3&ixlib=rb-1.2.1&q=80&w=1080",
            "small": "https://images.unsplash.com/photo-1536329583941-14287ec6fc4e?crop=entropy&cs=tinysrgb&fit=max&fm=jpg&ixid=Mnw3Njc0MHwxfDF8YWxsfDF8fHx8fHwyfHwxNjQ1NDI4MTU3&ixlib=rb-1.2.1&q=80&w=400",
            "thumb": "https://images.unsplash.com/photo-1536329583941-14287ec6fc4e?crop=entropy&cs=tinysrgb&fit=max&fm=jpg&ixid=Mnw3Njc0MHwxfDF8YWxsfDF8fHx8fHwyfHwxNjQ1NDI4MTU3&ixlib=rb-1.2.1&q=80&w=200",
            "small_s3": "https://s3.us-west-2.amazonaws.com/images.unsplash.com/small/photo-1536329583941-14287ec6fc4e"
        },
        "links": {
            "self": "https://api.unsplash.com/photos/lFmuWU0tv4M",
            "html": "https://unsplash.com/photos/lFmuWU0tv4M",
            "download": "https://unsplash.com/photos/lFmuWU0tv4M/download?ixid=Mnw3Njc0MHwxfDF8YWxsfDF8fHx8fHwyfHwxNjQ1NDI4MTU3",
            "download_location": "https://api.unsplash.com/photos/lFmuWU0tv4M/download?ixid=Mnw3Njc0MHwxfDF8YWxsfDF8fHx8fHwyfHwxNjQ1NDI4MTU3"
        },
        "categories": [],
        "likes": 2728,
        "liked_by_user": false,
        "current_user_collections": [],
        "sponsorship": {
            "impression_urls": [
                "https://ad.doubleclick.net/ddm/trackimpi/N1224323.3286893UNSPLASH/B25600467.324553021;dc_trk_aid=517636252;dc_trk_cid=157730382;ord=[timestamp];dc_lat=;dc_rdid=;tag_for_child_directed_treatment=;tfua=;ltd=?",
                "https://tag.researchnow.com/t/beacon?pr=285833&adn=1&ca=25600467&si=6303199&pl=313643359&cr=506404219&did=176&ord=[timestamp]&gdpr=${GDPR}&gdpr_consent=${GDPR_CONSENT_110}&us_privacy=${US_PRIVACY}"
            ],
            "tagline": "Try our Creative Assistant for free",
            "tagline_url": "https://ad.doubleclick.net/ddm/trackclk/N1224323.3286893UNSPLASH/B25600467.324553021;dc_trk_aid=517636252;dc_trk_cid=157730382;dc_lat=;dc_rdid=;tag_for_child_directed_treatment=;tfua=;ltd=",
            "sponsor": {
                "id": "D-bxv1Imc-o",
                "updated_at": "2022-02-20T09:46:40-05:00",
                "username": "mailchimp",
                "name": "Mailchimp",
                "first_name": "Mailchimp",
                "last_name": null,
                "twitter_username": "Mailchimp",
                "portfolio_url": "https://mailchimp.com/",
                "bio": "The all-in-one Marketing Platform built for growing businesses.",
                "location": null,
                "links": {
                    "self": "https://api.unsplash.com/users/mailchimp",
                    "html": "https://unsplash.com/@mailchimp",
                    "photos": "https://api.unsplash.com/users/mailchimp/photos",
                    "likes": "https://api.unsplash.com/users/mailchimp/likes",
                    "portfolio": "https://api.unsplash.com/users/mailchimp/portfolio",
                    "following": "https://api.unsplash.com/users/mailchimp/following",
                    "followers": "https://api.unsplash.com/users/mailchimp/followers"
                },
                "profile_image": {
                    "small": "https://images.unsplash.com/profile-1609545740442-928866556c38image?ixlib=rb-1.2.1&q=80&fm=jpg&crop=faces&cs=tinysrgb&fit=crop&h=32&w=32",
                    "medium": "https://images.unsplash.com/profile-1609545740442-928866556c38image?ixlib=rb-1.2.1&q=80&fm=jpg&crop=faces&cs=tinysrgb&fit=crop&h=64&w=64",
                    "large": "https://images.unsplash.com/profile-1609545740442-928866556c38image?ixlib=rb-1.2.1&q=80&fm=jpg&crop=faces&cs=tinysrgb&fit=crop&h=128&w=128"
                },
                "instagram_username": "mailchimp",
                "total_collections": 0,
                "total_likes": 19,
                "total_photos": 0,
                "accepted_tos": false,
                "for_hire": false,
                "social": {
                    "instagram_username": "mailchimp",
                    "portfolio_url": "https://mailchimp.com/",
                    "twitter_username": "Mailchimp",
                    "paypal_email": null
                }
            }
        },
        "topic_submissions": {
            "business-work": {
                "status": "approved",
                "approved_on": "2021-06-01T09:58:11-04:00"
            },
            "arts-culture": {
                "status": "approved",
                "approved_on": "2021-06-01T09:58:08-04:00"
            }
        },
        "user": {
            "id": "VCA9IfCfNMo",
            "updated_at": "2022-02-21T02:07:41-05:00",
            "username": "keilahoetzel",
            "name": "Keila Hötzel",
            "first_name": "Keila",
            "last_name": "Hötzel",
            "twitter_username": "keilahoetzel",
            "portfolio_url": "http://www.theresponsiblecreatives.com",
            "bio": "The german half of The Responsible Creatives, who enjoys shooting styled images and helping brands create their unique identity!  Let's connect @keilahoetzel & @responsiblecreatives. ",
            "location": "Bayern, Germany",
            "links": {
                "self": "https://api.unsplash.com/users/keilahoetzel",
                "html": "https://unsplash.com/@keilahoetzel",
                "photos": "https://api.unsplash.com/users/keilahoetzel/photos",
                "likes": "https://api.unsplash.com/users/keilahoetzel/likes",
                "portfolio": "https://api.unsplash.com/users/keilahoetzel/portfolio",
                "following": "https://api.unsplash.com/users/keilahoetzel/following",
                "followers": "https://api.unsplash.com/users/keilahoetzel/followers"
            },
            "profile_image": {
                "small": "https://images.unsplash.com/profile-1607516942909-bd6cc51a8fc7image?ixlib=rb-1.2.1&q=80&fm=jpg&crop=faces&cs=tinysrgb&fit=crop&h=32&w=32",
                "medium": "https://images.unsplash.com/profile-1607516942909-bd6cc51a8fc7image?ixlib=rb-1.2.1&q=80&fm=jpg&crop=faces&cs=tinysrgb&fit=crop&h=64&w=64",
                "large": "https://images.unsplash.com/profile-1607516942909-bd6cc51a8fc7image?ixlib=rb-1.2.1&q=80&fm=jpg&crop=faces&cs=tinysrgb&fit=crop&h=128&w=128"
            },
            "instagram_username": "keilahoetzel",
            "total_collections": 2,
            "total_likes": 329,
            "total_photos": 22,
            "accepted_tos": true,
            "for_hire": true,
            "social": {
                "instagram_username": "keilahoetzel",
                "portfolio_url": "http://www.theresponsiblecreatives.com",
                "twitter_username": "keilahoetzel",
                "paypal_email": null
            }
        }
    },
    {
        "id": "mDW4dvY_qpU",
        "created_at": "2022-02-20T16:01:21-05:00",
        "updated_at": "2022-02-21T02:08:02-05:00",
        "promoted_at": "2022-02-21T02:08:01-05:00",
        "width": 3864,
        "height": 5796,
        "color": "#d9d9d9",
        "blur_hash": "LfKxSRxu.8of_NM{IUofRitRayRj",
        "description": null,
        "alt_description": null,
        "urls": {
            "raw": "https://images.unsplash.com/photo-1645390747760-5adce30c8683?ixid=Mnw3Njc0MHwwfDF8YWxsfDJ8fHx8fHwyfHwxNjQ1NDI4MTU3&ixlib=rb-1.2.1",
            "full": "https://images.unsplash.com/photo-1645390747760-5adce30c8683?crop=entropy&cs=srgb&fm=jpg&ixid=Mnw3Njc0MHwwfDF8YWxsfDJ8fHx8fHwyfHwxNjQ1NDI4MTU3&ixlib=rb-1.2.1&q=85",
            "regular": "https://images.unsplash.com/photo-1645390747760-5adce30c8683?crop=entropy&cs=tinysrgb&fit=max&fm=jpg&ixid=Mnw3Njc0MHwwfDF8YWxsfDJ8fHx8fHwyfHwxNjQ1NDI4MTU3&ixlib=rb-1.2.1&q=80&w=1080",
            "small": "https://images.unsplash.com/photo-1645390747760-5adce30c8683?crop=entropy&cs=tinysrgb&fit=max&fm=jpg&ixid=Mnw3Njc0MHwwfDF8YWxsfDJ8fHx8fHwyfHwxNjQ1NDI4MTU3&ixlib=rb-1.2.1&q=80&w=400",
            "thumb": "https://images.unsplash.com/photo-1645390747760-5adce30c8683?crop=entropy&cs=tinysrgb&fit=max&fm=jpg&ixid=Mnw3Njc0MHwwfDF8YWxsfDJ8fHx8fHwyfHwxNjQ1NDI4MTU3&ixlib=rb-1.2.1&q=80&w=200",
            "small_s3": "https://s3.us-west-2.amazonaws.com/images.unsplash.com/photo-1645390747760-5adce30c8683"
        },
        "links": {
            "self": "https://api.unsplash.com/photos/mDW4dvY_qpU",
            "html": "https://unsplash.com/photos/mDW4dvY_qpU",
            "download": "https://unsplash.com/photos/mDW4dvY_qpU/download?ixid=Mnw3Njc0MHwwfDF8YWxsfDJ8fHx8fHwyfHwxNjQ1NDI4MTU3",
            "download_location": "https://api.unsplash.com/photos/mDW4dvY_qpU/download?ixid=Mnw3Njc0MHwwfDF8YWxsfDJ8fHx8fHwyfHwxNjQ1NDI4MTU3"
        },
        "categories": [],
        "likes": 0,
        "liked_by_user": false,
        "current_user_collections": [],
        "sponsorship": null,
        "topic_submissions": {},
        "user": {
            "id": "jXeJTKrc7Mo",
            "updated_at": "2022-02-21T02:13:50-05:00",
            "username": "theshuttervision",
            "name": "Jonathan Cooper",
            "first_name": "Jonathan",
            "last_name": "Cooper",
            "twitter_username": null,
            "portfolio_url": null,
            "bio": "Donations greatly appreciated, Dont forget to follow me on Instagram for more of my work!",
            "location": "Newfoundland, Canada",
            "links": {
                "self": "https://api.unsplash.com/users/theshuttervision",
                "html": "https://unsplash.com/@theshuttervision",
                "photos": "https://api.unsplash.com/users/theshuttervision/photos",
                "likes": "https://api.unsplash.com/users/theshuttervision/likes",
                "portfolio": "https://api.unsplash.com/users/theshuttervision/portfolio",
                "following": "https://api.unsplash.com/users/theshuttervision/following",
                "followers": "https://api.unsplash.com/users/theshuttervision/followers"
            },
            "profile_image": {
                "small": "https://images.unsplash.com/profile-1632367295735-90e2eb5d633eimage?ixlib=rb-1.2.1&q=80&fm=jpg&crop=faces&cs=tinysrgb&fit=crop&h=32&w=32",
                "medium": "https://images.unsplash.com/profile-1632367295735-90e2eb5d633eimage?ixlib=rb-1.2.1&q=80&fm=jpg&crop=faces&cs=tinysrgb&fit=crop&h=64&w=64",
                "large": "https://images.unsplash.com/profile-1632367295735-90e2eb5d633eimage?ixlib=rb-1.2.1&q=80&fm=jpg&crop=faces&cs=tinysrgb&fit=crop&h=128&w=128"
            },
            "instagram_username": "theshuttervision",
            "total_collections": 0,
            "total_likes": 0,
            "total_photos": 1803,
            "accepted_tos": true,
            "for_hire": true,
            "social": {
                "instagram_username": "theshuttervision",
                "portfolio_url": null,
                "twitter_username": null,
                "paypal_email": null
            }
        }
    },
    {
        "id": "HTGOE0_whew",
        "created_at": "2022-02-20T15:50:50-05:00",
        "updated_at": "2022-02-21T01:56:08-05:00",
        "promoted_at": "2022-02-21T01:56:02-05:00",
        "width": 3712,
        "height": 5568,
        "color": "#262626",
        "blur_hash": "L68zZ4019^r?_2D%%MIVEgIV?Gxa",
        "description": null,
        "alt_description": null,
        "urls": {
            "raw": "https://images.unsplash.com/photo-1645389692136-4b344532362f?ixid=Mnw3Njc0MHwwfDF8YWxsfDN8fHx8fHwyfHwxNjQ1NDI4MTU3&ixlib=rb-1.2.1",
            "full": "https://images.unsplash.com/photo-1645389692136-4b344532362f?crop=entropy&cs=srgb&fm=jpg&ixid=Mnw3Njc0MHwwfDF8YWxsfDN8fHx8fHwyfHwxNjQ1NDI4MTU3&ixlib=rb-1.2.1&q=85",
            "regular": "https://images.unsplash.com/photo-1645389692136-4b344532362f?crop=entropy&cs=tinysrgb&fit=max&fm=jpg&ixid=Mnw3Njc0MHwwfDF8YWxsfDN8fHx8fHwyfHwxNjQ1NDI4MTU3&ixlib=rb-1.2.1&q=80&w=1080",
            "small": "https://images.unsplash.com/photo-1645389692136-4b344532362f?crop=entropy&cs=tinysrgb&fit=max&fm=jpg&ixid=Mnw3Njc0MHwwfDF8YWxsfDN8fHx8fHwyfHwxNjQ1NDI4MTU3&ixlib=rb-1.2.1&q=80&w=400",
            "thumb": "https://images.unsplash.com/photo-1645389692136-4b344532362f?crop=entropy&cs=tinysrgb&fit=max&fm=jpg&ixid=Mnw3Njc0MHwwfDF8YWxsfDN8fHx8fHwyfHwxNjQ1NDI4MTU3&ixlib=rb-1.2.1&q=80&w=200",
            "small_s3": "https://s3.us-west-2.amazonaws.com/images.unsplash.com/small/photo-1645389692136-4b344532362f"
        },
        "links": {
            "self": "https://api.unsplash.com/photos/HTGOE0_whew",
            "html": "https://unsplash.com/photos/HTGOE0_whew",
            "download": "https://unsplash.com/photos/HTGOE0_whew/download?ixid=Mnw3Njc0MHwwfDF8YWxsfDN8fHx8fHwyfHwxNjQ1NDI4MTU3",
            "download_location": "https://api.unsplash.com/photos/HTGOE0_whew/download?ixid=Mnw3Njc0MHwwfDF8YWxsfDN8fHx8fHwyfHwxNjQ1NDI4MTU3"
        },
        "categories": [],
        "likes": 3,
        "liked_by_user": false,
        "current_user_collections": [],
        "sponsorship": null,
        "topic_submissions": {},
        "user": {
            "id": "KDR8srk_NsU",
            "updated_at": "2022-02-21T02:18:53-05:00",
            "username": "gaspo3",
            "name": "Gaspar Zaldo",
            "first_name": "Gaspar",
            "last_name": "Zaldo",
            "twitter_username": "GasparZaldo",
            "portfolio_url": "https://www.instagram.com/gaspo3/?hl=es-la",
            "bio": "I am an Argentine photographer from a small town located in the province of Chubut. if you like my work, support me via donate.",
            "links": {
                "self": "https://api.unsplash.com/users/gaspo3",
                "html": "https://unsplash.com/@gaspo3",
                "photos": "https://api.unsplash.com/users/gaspo3/photos",
                "likes": "https://api.unsplash.com/users/gaspo3/likes",
                "portfolio": "https://api.unsplash.com/users/gaspo3/portfolio",
                "following": "https://api.unsplash.com/users/gaspo3/following",
                "followers": "https://api.unsplash.com/users/gaspo3/followers"
            },
            "profile_image": {
                "small": "https://images.unsplash.com/profile-1640416368135-c6785bb8800aimage?ixlib=rb-1.2.1&q=80&fm=jpg&crop=faces&cs=tinysrgb&fit=crop&h=32&w=32",
                "medium": "https://images.unsplash.com/profile-1640416368135-c6785bb8800aimage?ixlib=rb-1.2.1&q=80&fm=jpg&crop=faces&cs=tinysrgb&fit=crop&h=64&w=64",
                "large": "https://images.unsplash.com/profile-1640416368135-c6785bb8800aimage?ixlib=rb-1.2.1&q=80&fm=jpg&crop=faces&cs=tinysrgb&fit=crop&h=128&w=128"
            },
            "instagram_username": "gaspo3",
            "total_collections": 0,
            "total_likes": 0,
            "total_photos": 1536,
            "accepted_tos": true,
            "for_hire": true,
            "social": {
                "instagram_username": "gaspo3",
                "portfolio_url": "https://www.instagram.com/gaspo3/?hl=es-la",
                "twitter_username": "GasparZaldo",
                "paypal_email": null
            }
        }
    }
]
