{
  "mongoURI": "mongodb://localhost:27017/issue-poll",
  "port": 8000,
  "auth": {
    "secret": "seekret",
    "service": "users",
    "local": {
      "usernameField": "\\username",
      "idField": "_id"
    }
  }
}