{
  "Medications": [
    {
      "id": 1,
      "DoseMg": 500,
      "Indication": "Pain Relief",
      "Name": "Paracetamol",
      "Route": "Po"
    },
    {
      "id": 2,
      "DoseMg": 200,
      "Indication": "Pain Relief11",
      "Name": "Ibuprofen",
      "Route": "Po2"
    },
    {
      "id": 3,
      "DoseMg": 10,
      "Indication": "Cardiac",
      "Name": "DigoxinA",
      "Route": "Po"
    },
    {
      "id": 6,
      "DoseMg": 150,
      "Indication": "Infection",
      "Name": "Pen V",
      "Route": "Po"
    },
    {
      "id": 7,
      "DoseMg": 200,
      "Indication": "Dry Skin",
      "Name": "Betnovate",
      "Route": "Topical"
    },
    {
      "id": 8,
      "DoseMg": "wereq",
      "Indication": "qwer",
      "Name": "qwer",
      "Route": "qwerty"
    },
    {
      "id": 9,
      "DoseMg": "10",
      "Indication": "wer",
      "Name": "qwer",
      "Route": "qwer",
      "patientId": 2
    }
  ],
  "Problems": [
    {
      "id": 1,
      "CodeD": "X500",
      "Description": "Pain in Knee",
      "Name": "Arthritis",
      "Days": "8"
    },
    {
      "id": 2,
      "CodeD": "200X22",
      "Description": "Earache mild",
      "Name": "Otitis",
      "Days": "6"
    },
    {
      "id": 3,
      "CodeD": "10D11",
      "Description": "Cardiac congestion",
      "Name": "CCF",
      "Days": "5"
    },
    {
      "id": 4,
      "CodeD": "S500",
      "Description": "wheezy",
      "Name": "Asthma",
      "Days": "123"
    },
    {
      "id": 5,
      "CodeD": "UL500",
      "Description": "Red Eye",
      "Name": "Eye Infection3 - mild",
      "Days": "62"
    },
    {
      "id": 7,
      "CodeD": "F564",
      "Description": "Dry Skin",
      "Name": "Alopecia Areata",
      "Days": "14"
    }
  ],
  "Adverse_Events": [
    {
      "id": 1,
      "CodeD": "XD500",
      "Description": "Swelling in Knee",
      "Type": "Trauma",
      "Name": "Haematoma",
      "Days": "6"
    },
    {
      "id": 2,
      "CodeD": "20L0X22",
      "Description": "Earache after ear procedure",
      "Type": "Infection",
      "Name": "Otitis Externa",
      "Days": "6"
    },
    {
      "id": 4,
      "CodeD": "S5ER00",
      "Description": "wheezy after taking her meds",
      "Type": "Allergy",
      "Name": "Bronchospasm",
      "Days": "123"
    },
    {
      "id": 5,
      "CodeD": "UL56500",
      "Description": "Red Eye",
      "Type": "Infection",
      "Name": "Swimming Infection",
      "Days": "62"
    },
    {
      "id": 7,
      "CodeD": "F55664",
      "Description": "Skin Rash",
      "Type": "Drug Toxic",
      "Name": "Analphylaxis",
      "Days": "10"
    },
    {
      "id": 8,
      "CodeD": "34hHR",
      "Description": "Skin Rash from Latex",
      "Type": "Allergy ",
      "Name": "Dermatitis",
      "Days": "11"
    }
  ],
  "Terms": [
    {
      "id": 1,
      "idN": 1,
      "Term": "New",
      "Subset": 10,
      "Code": "test"
    }
  ],
  "Patients": [
    {
      "id": 1,
      "idN": 1,
      "FirstName": "John",
      "LastName": "Doe",
      "Sex": "M",
      "Age": 10,
      "Address": "10200 DC"
    },
    {
      "id": 2,
      "FirstName": "TestP",
      "LastName": "DF",
      "Sex": "M",
      "Age": "345",
      "Address": "sdfgsdfg"
    }
  ],
  "Users": [
    {
      "id": 1,
      "username": "tony",
      "password": "1c5c79e8b349fdb1dab6b5aecb4eb2c6",
      "ok": true,
      "auth_ok": true,
      "message": "Authentificated",
      "require_password_change": false,
      "require_otp": false,
      "require_bat": false
    }
  ]

}
