payment_date,client_mapping,initial_count,payment_init_count,user_processing_count,failed_count,expired_count,cancel_count,success_count,churn_count,total_txn_count
2021-08-18,Seller Center,24,22,178,0,0,0,6023,224,6247
2021-08-13,Shopee Credit,0,0,0,0,0,3,62,3,65
2021-08-20,Shopee Credit,66,20,271,0,0,0,7139,357,7496
2021-08-16,Shopee Play,12,169,4168,2,0,0,158017,4351,162368
2021-08-19,Shopee Credit,233,301,1041,0,0,0,32605,1575,34180
2021-08-12,Credit,37,29,227,0,0,0,5303,293,5596
2021-08-05,DP,484,867,7487,595,0,7562,711828,17001,728829
2021-08-05,Shopee Credit,679,1270,3616,0,0,0,72428,5565,77993
2021-08-10,Shopee Play,3,57,3058,2,0,0,146926,3120,150046
2021-08-07,Shopee Credit,237,0,0,0,0,35,2965,272,3237
2021-08-13,Shopee Credit,40,6,247,0,0,0,5566,293,5859
2021-08-17,Shopee Credit,296,0,0,0,0,65,5619,361,5980
2021-08-05,Shopee Credit,325,0,1,0,0,78,3657,404,4061
2021-08-04,Mitra,0,0,0,0,15139,0,307572,15139,322711
2021-08-21,Marketplace,0,0,0,24,168,51670,1234804,51862,1286542
2021-08-05,Marketplace,0,0,0,9,170,66476,1424251,66653,1490769
2021-08-07,Foody,10,71,1991,0,0,0,40727,2072,42799
2021-08-03,Seller Center,32,29,214,0,0,0,6605,275,6880
2021-08-16,Foody,19,96,1914,0,0,0,37842,2029,39871
2021-08-23,Marketplace,1,2,53,0,0,18,615,74,689
2021-08-17,Mitra,0,0,0,0,20929,0,304923,20929,325852
2021-08-15,Seller Center,14,22,203,0,0,0,5966,239,6205
2021-08-19,Shopee Credit,154,0,0,0,0,28,2568,182,2750
2021-08-22,Shopee Credit,1,0,0,0,0,2,103,3,106
2021-08-16,DP,289,353,6250,1254,0,6163,601557,14321,615878
2021-08-08,DP,0,0,10,0,0,8,775,18,793
2021-08-09,DP,0,0,8,0,0,5,613,13,626
2021-08-15,Marketplace,0,0,0,16,168,56552,1290723,56735,1347315
2021-08-04,Seller Center,25,32,221,0,0,0,6532,278,6810
2021-08-22,DP,389,395,7991,133,0,5118,658344,14027,672371
2021-08-14,DP,335,281,6563,948,0,5590,537593,13729,551322
2021-08-08,Seller Center,64,54,332,2,0,0,10274,452,10726
2021-08-20,Shopee Credit,187,0,0,0,0,27,2520,214,2734
2021-08-06,Marketplace,0,0,0,7,200,72484,1514523,72691,1587004
2021-08-12,Mitra,0,0,0,0,15265,0,311909,15265,327174
2021-08-02,Shopee Credit,242,0,0,0,0,42,3471,284,3755
2021-08-10,DP,295,242,5930,1862,0,5545,589990,13887,603877
2021-08-23,Shopee Credit,0,0,0,0,0,0,4,0,4
2021-08-21,Foody,6,60,1990,0,0,0,35697,2056,37753
2021-08-11,Shopee Credit,26,14,214,0,0,0,5439,254,5693
2021-08-10,Seller Center,19,21,166,0,0,0,6315,206,6521
2021-08-21,Shopee Play,5,57,2869,0,0,0,113677,2931,116608
2021-08-08,Shopee Credit,1,0,0,0,0,0,31,1,32
2021-08-07,Seller Center,28,46,291,0,0,0,8466,365,8831
2021-08-11,Shopee Credit,262,0,0,0,0,33,3167,295,3462
2021-08-07,Shopee Credit,274,362,1497,0,0,0,44243,2133,46376
2021-08-07,Foody,22,408,7107,2,0,8506,546750,16045,562795
2021-08-08,Credit,39,19,192,0,0,0,5271,250,5521
2021-08-08,DP,425,482,12334,1309,0,15233,1182898,29795,1212693
2021-08-18,Shopee Credit,0,0,1,0,0,0,37,1,38
2021-08-20,Foody,21,287,6071,0,0,6781,469540,13160,482700
2021-08-10,Shopee Credit,477,501,2378,0,0,0,73315,3356,76671
2021-08-16,Marketplace,0,0,0,14,151,59346,1276542,59511,1335901
2021-08-16,Credit,23,39,255,0,0,0,5646,317,5963
2021-08-21,Mitra,0,0,0,0,16876,0,323572,16876,340448
2021-08-12,Shopee Credit,0,0,0,0,0,2,77,2,79
2021-08-11,Shopee Credit,0,0,0,0,0,0,37,0,37
2021-08-22,Mitra,26,76,5,0,13324,0,310692,13431,324123
2021-08-23,Shopee Credit,0,0,0,0,0,0,21,0,21
2021-08-20,Shopee Credit,224,271,1277,0,0,0,39032,1772,40804
2021-08-21,DP,0,1,11,0,0,10,734,22,756
2021-08-11,Marketplace,0,0,0,25,184,58531,1334673,58740,1393285
2021-08-14,DP,1,0,6,0,0,2,391,9,400
2021-08-23,Mitra,1,1,0,0,0,0,50,2,52
2021-08-06,Foody,13,100,1968,0,0,0,38856,2081,40937
2021-08-22,Credit,44,21,158,0,0,0,5936,223,6159
2021-08-18,Credit,38,27,198,0,0,0,5411,263,5674
2021-08-16,Shopee Credit,408,570,1731,0,0,0,44804,2709,47513
2021-08-08,Shopee Credit,0,0,0,0,0,1,83,1,84
2021-08-02,DP,446,378,7210,620,0,6849,733344,15507,748851
2021-08-23,Shopee Credit,0,0,0,0,0,0,14,0,14
2021-08-19,Shopee Credit,0,0,1,0,0,6,95,7,102
2021-08-04,Shopee Credit,268,0,0,0,0,45,3833,313,4146
2021-08-05,DP,1,5,17,0,0,8,874,31,905
2021-08-16,Marketplace,0,0,0,0,0,7,20,7,27
2021-08-11,DP,0,0,8,0,0,9,543,17,560
2021-08-15,Shopee Credit,188,0,0,0,0,36,2441,224,2665
2021-08-19,Shopee Play,2,97,2468,4,0,0,99634,2571,102205
2021-08-13,DP,1,1,11,0,0,4,364,17,381
2021-08-17,Shopee Credit,0,2,2,0,0,0,33,4,37
2021-08-12,DP,1,2,6,0,0,6,413,15,428
2021-08-17,Foody,93,788,8820,19,0,9481,587000,19201,606201
2021-08-16,Shopee Credit,2,0,4,0,0,0,53,6,59
2021-08-23,Credit,0,0,0,0,0,0,21,0,21
2021-08-20,Shopee Credit,0,1,0,0,0,0,33,1,34
2021-08-06,Shopee Credit,281,0,0,0,0,48,3609,329,3938
2021-08-04,DP,1,0,16,0,0,6,654,23,677
2021-08-17,Credit,42,49,244,0,0,0,4856,335,5191
2021-08-19,Credit,52,21,223,0,0,0,5679,296,5975
2021-08-20,Marketplace,0,0,0,0,0,8,24,8,32
2021-08-23,Credit,0,0,0,0,0,0,4,0,4
2021-08-09,Credit,44,21,232,0,0,0,6037,297,6334
2021-08-21,Shopee Credit,0,0,0,0,0,3,120,3,123
2021-08-07,Marketplace,0,0,0,9,182,63202,1276977,63393,1340198
2021-08-06,Seller Center,18,35,218,0,0,0,6324,271,6595
2021-08-10,Shopee Credit,47,18,217,0,0,0,6699,282,6981
2021-08-11,Shopee Credit,0,0,0,0,0,6,80,6,86
2021-08-10,Marketplace,0,0,0,0,0,10,13,10,23
2021-08-04,DP,425,276,6618,425,0,6151,638295,13898,652193
2021-08-08,Shopee Credit,39,19,192,0,0,0,5271,250,5521
2021-08-16,Mitra,0,0,0,0,18172,0,325847,18172,344019
2021-08-03,Shopee Play,6,104,2531,0,0,0,105947,2641,108588
2021-08-07,DP,0,0,7,0,0,5,601,12,613
2021-08-13,Shopee Credit,203,0,0,0,0,35,2853,238,3091
2021-08-19,Foody,10,81,1840,0,0,0,33637,1931,35568
2021-08-23,Seller Center,0,0,0,0,0,0,32,0,32
2021-08-09,Shopee Credit,0,0,0,0,0,7,111,7,118
2021-08-19,Shopee Credit,52,21,223,0,0,0,5679,296,5975
2021-08-13,Shopee Play,2,48,2833,1,0,0,141729,2884,144613
2021-08-17,Shopee Play,23,299,4144,4,0,0,146330,4470,150800
2021-08-14,Shopee Play,2,68,3174,0,0,0,154718,3244,157962
2021-08-11,Seller Center,15,18,226,3,0,0,7039,262,7301
2021-08-02,Shopee Credit,313,161,1338,0,0,0,38785,1812,40597
2021-08-07,Mitra,0,0,0,0,15802,0,320603,15802,336405
2021-08-10,Marketplace,0,0,0,10,151,57850,1320438,58011,1378309
2021-08-09,Mitra,0,0,0,0,14940,0,317360,14940,332300
2021-08-03,Shopee Credit,0,2,6,0,0,0,304,8,312
2021-08-12,Seller Center,13,29,196,0,0,0,6347,238,6585
2021-08-14,Shopee Credit,161,0,1,0,0,43,2615,205,2820
2021-08-03,Shopee Credit,253,0,0,1,0,43,3616,297,3913
2021-08-08,Foody,11,69,2135,0,0,0,44077,2215,46292
2021-08-20,Seller Center,10,12,199,0,0,0,6138,221,6359
2021-08-13,Seller Center,13,18,225,0,0,0,6489,256,6745
2021-08-15,Shopee Credit,191,281,1130,0,0,0,33309,1602,34911
2021-08-10,Foody,10,48,1979,0,0,0,39661,2037,41698
2021-08-12,Foody,10,70,2090,0,0,0,38915,2170,41085
2021-08-10,Credit,47,18,217,0,0,0,6699,282,6981
2021-08-13,Marketplace,0,0,0,12,171,64063,1361506,64245,1425608
2021-08-21,Shopee Credit,35,41,253,0,0,0,6629,329,6958
2021-08-21,Foody,26,301,6354,6,0,7250,483948,13937,497885
2021-08-14,Shopee Credit,0,0,1,0,0,0,26,1,27
2021-08-02,Shopee Play,6,82,2906,1,0,0,132476,2995,135471
2021-08-02,Seller Center,22,19,213,1,0,0,6249,255,6504
2021-08-15,Shopee Credit,39,27,166,0,0,0,4447,232,4679
2021-08-18,Shopee Credit,204,0,1,0,0,54,3091,259,3350
2021-08-15,Credit,39,27,166,0,0,0,4447,232,4679
2021-08-18,Marketplace,0,0,0,12,185,59360,1322423,59556,1381558
2021-08-14,Foody,44,390,8906,6,0,10286,679167,19632,698799
2021-08-22,DP,1,0,8,0,0,1,457,10,467
2021-08-14,Shopee Credit,19,13,208,0,0,0,4697,240,4937
2021-08-12,Shopee Credit,37,29,227,0,0,0,5303,293,5596
2021-08-15,Shopee Credit,0,0,0,0,0,0,22,0,22
2021-08-13,Shopee Credit,0,0,0,0,0,0,34,0,34
2021-08-02,Credit,313,161,1338,0,0,0,38785,1812,40597
2021-08-06,Marketplace,0,0,0,0,0,9,18,9,27
2021-08-12,Shopee Credit,237,226,1239,0,0,0,32160,1702,33862
2021-08-16,Foody,52,490,7753,6,0,8709,563314,17010,580324
2021-08-06,Shopee Credit,679,762,2590,0,0,0,60256,4031,64287
2021-08-18,Foody,43,607,6524,18,0,7209,476578,14401,490979
2021-08-02,Shopee Credit,0,0,0,0,0,0,71,0,71
2021-08-15,Shopee Credit,0,0,0,0,0,1,63,1,64
2021-08-20,DP,0,0,20,0,0,4,1123,24,1147
2021-08-21,Credit,35,41,253,0,0,0,6629,329,6958
2021-08-10,Foody,31,272,7759,17,0,8836,598966,16915,615881
2021-08-09,Seller Center,18,20,195,0,0,0,5665,233,5898
2021-08-21,Seller Center,16,28,195,1,0,0,6193,240,6433
2021-08-22,Shopee Credit,44,21,158,0,0,0,5936,223,6159
2021-08-07,Credit,41,21,300,0,0,0,6893,362,7255
2021-08-15,DP,321,297,5970,1395,0,5080,523039,13070,536109
2021-08-02,Shopee Credit,642,1120,4375,0,0,0,137600,6137,143737
2021-08-09,DP,313,239,5914,1281,0,5810,608973,13573,622546
2021-08-05,Foody,20,116,1931,0,0,0,37798,2067,39865
2021-08-23,Shopee Credit,1,0,2,0,0,0,119,3,122
2021-08-19,DP,0,0,8,0,0,5,779,13,792
2021-08-15,Foody,15,93,2275,0,0,0,43948,2383,46331
2021-08-12,Marketplace,0,0,0,12,228,60777,1431789,61016,1492635
2021-08-17,DP,1,2,9,0,0,5,553,17,570
2021-08-22,Shopee Play,5,54,2993,2,0,0,108333,3054,111387
2021-08-09,Shopee Play,6,93,2901,1,0,0,138895,3001,141896
2021-08-19,DP,350,433,5200,2367,0,4954,567685,13325,581010
2021-08-05,Shopee Credit,2,3,22,0,0,0,374,27,401
2021-08-08,Shopee Play,6,118,3044,1,0,0,123890,3169,127059
2021-08-14,Shopee Credit,138,216,917,0,0,0,24527,1271,25798
2021-08-10,Mitra,0,0,0,0,14791,0,315330,14791,330121
2021-08-02,DP,0,1,16,0,0,9,752,26,778
2021-08-11,Mitra,0,0,0,0,14792,0,307532,14792,322324
2021-08-22,Shopee Credit,144,0,0,0,0,23,2297,167,2464
2021-08-09,Marketplace,0,0,0,16,177,60501,1320365,60692,1380491
2021-08-10,Shopee Credit,0,0,2,0,0,0,43,2,45
2021-08-22,Foody,11,63,1768,0,0,0,37703,1842,39545
2021-08-17,Marketplace,0,0,0,0,0,19,56,19,75
2021-08-11,Foody,18,339,8041,35,0,9599,620846,18032,638878
2021-08-16,Seller Center,20,34,229,0,0,0,6873,283,7156
2021-08-10,Shopee Credit,0,0,0,0,0,7,90,7,97
2021-08-02,Mitra,0,0,0,0,15391,0,328427,15391,343818
2021-08-21,Marketplace,0,0,0,0,0,6,18,6,24
2021-08-15,Shopee Play,6,89,3324,1,0,0,163386,3420,166806
2021-08-05,Marketplace,0,0,0,0,0,6,24,6,30
2021-08-04,Credit,458,267,2300,0,0,0,56170,3025,59195
2021-08-13,Shopee Credit,153,149,986,0,0,0,27198,1288,28486
2021-08-02,Shopee Credit,1,1,4,0,0,0,179,6,185
2021-08-07,Shopee Play,2,78,2561,0,0,0,106403,2641,109044
2021-08-20,Credit,66,20,271,0,0,0,7139,357,7496
2021-08-02,Foody,9,72,1731,0,0,0,34761,1812,36573
2021-08-03,Marketplace,0,0,0,0,0,8,14,8,22
2021-08-04,Foody,8,56,1745,0,0,0,37052,1809,38861
2021-08-12,Shopee Credit,0,0,0,0,0,0,29,0,29
2021-08-05,Shopee Play,3,188,2304,1,0,0,94316,2496,96812
2021-08-17,Shopee Credit,0,0,0,0,0,4,88,4,92
2021-08-03,Foody,46,371,6645,10,0,7770,477718,14842,492560
2021-08-06,Shopee Credit,0,0,10,0,0,0,95,10,105
2021-08-03,DP,407,377,7039,490,0,6543,664325,14864,679189
2021-08-23,Shopee Credit,1,0,0,0,0,0,14,1,15
2021-08-20,Marketplace,0,0,0,11,143,51416,1227652,51569,1279091
2021-08-11,Shopee Credit,553,618,2794,0,0,0,73348,3965,77313
2021-08-23,Foody,0,0,1,0,0,0,75,1,76
2021-08-04,Shopee Credit,0,0,3,0,0,0,349,3,352
2021-08-15,Foody,39,480,9929,6,0,12033,792405,22487,814892
2021-08-07,Shopee Credit,0,0,0,0,0,1,73,1,74
2021-08-19,Shopee Credit,0,0,0,0,0,0,38,0,38
2021-08-14,Shopee Credit,0,0,0,0,0,1,79,1,80
2021-08-18,Marketplace,0,0,0,0,0,5,24,5,29
2021-08-17,Marketplace,0,0,0,30,426,175650,3714018,176106,3889473
2021-08-23,Foody,0,0,13,0,0,16,628,29,657
2021-08-09,Marketplace,0,0,0,0,0,10,18,10,28
2021-08-03,Credit,382,242,1851,0,0,0,41584,2475,44059
2021-08-16,Shopee Credit,23,39,255,0,0,0,5646,317,5963
2021-08-20,DP,343,369,6351,13309,0,5331,628546,25816,654362
2021-08-04,Foody,20,255,6675,8,0,7497,487527,14455,501982
2021-08-10,Shopee Credit,228,0,0,0,0,39,3232,267,3499
2021-08-16,DP,0,0,10,0,0,4,466,14,480
2021-08-08,Marketplace,0,0,0,14,636,265432,5317525,266077,5582610
2021-08-12,Shopee Play,2,59,2843,1,0,0,133870,2905,136775
2021-08-15,Mitra,0,0,0,0,15113,0,306179,15113,321292
2021-08-13,DP,340,259,7539,947,0,6191,553319,15286,568605
2021-08-05,Foody,76,1112,6949,3,0,7525,479379,15665,495044
2021-08-20,Foody,11,57,1801,0,0,0,34811,1869,36680
2021-08-14,Foody,9,81,2160,1,0,0,42963,2251,45214
2021-08-23,DP,5,22,221,0,0,45,11349,293,11642
2021-08-08,Mitra,0,0,0,0,15513,0,301972,15513,317485
2021-08-17,Shopee Credit,42,49,244,0,0,0,4856,335,5191
2021-08-12,Marketplace,0,0,0,0,0,2,19,2,21
2021-08-08,Foody,42,447,7599,6,0,9471,597179,17565,614744
2021-08-06,Mitra,0,0,0,0,17751,0,308955,17751,326706
2021-08-12,Foody,27,383,7824,2,0,9231,595752,17467,613219
2021-08-06,Credit,151,102,831,0,0,0,15402,1084,16486
2021-08-20,Mitra,0,0,0,0,14233,0,290623,14233,304856
2021-08-11,DP,273,251,5691,1190,0,5430,554971,12843,567814
2021-08-23,Foody,0,1,5,0,0,0,84,6,90
2021-08-16,Shopee Credit,156,0,0,0,0,23,2471,179,2650
2021-08-18,Shopee Play,7,127,2884,14,0,0,95062,3032,98094
2021-08-18,Shopee Credit,0,0,0,0,0,12,102,12,114
2021-08-05,Shopee Credit,0,0,0,0,0,4,86,4,90
2021-08-09,Shopee Credit,202,0,0,0,0,43,3321,245,3566
2021-08-06,DP,0,0,17,0,0,9,639,26,665
2021-08-19,Mitra,0,0,0,0,16559,0,324195,16559,340754
2021-08-21,DP,299,336,6224,159,0,5501,585067,12519,597586
2021-08-22,Shopee Credit,208,259,985,0,0,0,37557,1452,39009
2021-08-18,Shopee Credit,238,479,1128,0,0,0,32542,1845,34387
2021-08-04,Marketplace,0,0,0,0,0,5,17,5,22
2021-08-18,Mitra,0,0,0,0,16041,0,311068,16041,327109
2021-08-23,Shopee Play,0,0,3,0,0,0,87,3,90
2021-08-12,Shopee Credit,210,0,0,0,0,38,3194,248,3442
2021-08-04,Shopee Play,3,68,2339,0,0,0,99170,2410,101580
2021-08-02,Marketplace,0,0,0,7,193,68401,1505403,68601,1573828
2021-08-17,Foody,23,123,2205,0,0,0,41425,2351,43776
2021-08-08,Shopee Credit,245,449,1365,0,0,0,46546,2059,48605
2021-08-22,Seller Center,15,16,150,0,0,0,5724,181,5905
2021-08-19,Marketplace,0,0,0,0,0,6,25,6,31
2021-08-06,Shopee Credit,0,0,0,0,0,8,64,8,72
2021-08-20,Shopee Play,4,62,2555,11,0,0,114887,2632,117519
2021-08-07,Shopee Credit,0,0,2,0,0,0,36,2,38
2021-08-07,DP,282,279,6506,3015,0,6024,610821,16143,626964
2021-08-14,Mitra,0,0,0,0,15812,0,314321,15812,330133
2021-08-18,DP,0,0,6,0,0,6,584,12,596
2021-08-23,Seller Center,0,0,0,0,0,0,2,0,2
2021-08-02,Foody,26,367,6442,3,0,7471,471060,14309,485369
2021-08-08,Shopee Credit,524,0,0,0,0,117,7694,641,8335
2021-08-03,DP,1,0,10,0,0,1,681,12,693
2021-08-14,Marketplace,0,0,0,0,0,13,25,13,36
2021-08-07,Marketplace,0,0,0,0,0,9,18,9,27
2021-08-10,DP,0,0,9,0,0,6,672,15,687
2021-08-03,Shopee Credit,0,0,0,0,0,9,76,9,85
2021-08-21,Shopee Credit,0,0,1,0,0,0,42,1,43
2021-08-06,DP,314,369,6751,383,0,6583,650823,14406,665229
2021-08-03,Foody,11,73,1961,0,0,0,35518,2045,37563
2021-08-06,Shopee Play,2,91,2287,1,0,0,102170,2381,104551
2021-08-05,Seller Center,77,120,234,0,0,0,6449,431,6880
2021-08-18,Foody,17,87,1724,0,0,0,33754,1828,35582
2021-08-09,Shopee Credit,0,0,2,0,0,0,22,2,24
2021-08-15,DP,1,1,5,0,0,3,370,10,380
2021-08-09,Shopee Credit,315,357,1755,0,0,0,54024,2427,56451
2021-08-11,Marketplace,0,0,0,0,0,4,23,4,27
2021-08-19,Foody,29,531,6489,13,0,6996,472015,14058,486073
2021-08-04,Marketplace,0,0,0,15,167,68263,1496689,68445,1565013
2021-08-13,Marketplace,0,0,0,0,0,8,29,8,37
2021-08-05,Credit,679,1270,3616,0,0,0,72428,5565,77993
2021-08-04,Shopee Credit,0,0,0,0,0,7,66,7,73
2021-08-05,Shopee Credit,1695,4585,7782,0,0,0,170804,14062,184866
2021-08-11,Credit,26,14,214,0,0,0,5439,254,5693
2021-08-16,Shopee Credit,0,0,0,0,0,5,78,5,83
2021-08-04,Shopee Credit,458,267,2300,0,0,0,56170,3025,59195
2021-08-23,Shopee Play,0,0,30,0,0,0,1602,30,1632
2021-08-18,DP,265,375,5420,1531,0,5062,533705,12668,546373
2021-08-21,Shopee Credit,248,342,1477,0,0,0,39974,2067,42041
2021-08-22,Foody,29,299,5780,9,0,7160,507428,13277,520705
2021-08-23,DP,0,0,5,0,0,2,307,7,314
2021-08-22,Marketplace,33,19,733,9,128,51694,1264697,52615,1317209
2021-08-03,Mitra,0,0,0,0,20209,0,309908,20209,330117
2021-08-14,Credit,19,13,208,0,0,0,4697,240,4937
2021-08-02,Marketplace,0,0,0,0,0,6,18,6,24
2021-08-11,Shopee Play,3,62,3024,92,0,0,149670,3181,152851
2021-08-22,Marketplace,0,0,0,0,0,8,22,8,30
2021-08-17,Seller Center,69,69,279,0,0,0,8905,417,9322
2021-08-11,Foody,9,65,2175,0,0,0,41757,2249,44006
2021-08-19,Marketplace,0,0,0,19,159,50933,1220063,51110,1271028
2021-08-08,Marketplace,0,0,0,0,0,17,67,17,82
2021-08-23,Marketplace,42,16,545,0,0,379,8654,982,9636
2021-08-06,Foody,44,496,7286,2,0,8059,517557,15887,533444
2021-08-21,Shopee Credit,172,0,0,0,0,37,2443,209,2652
2021-08-05,Mitra,0,0,0,0,20003,0,308582,20003,328585
2021-08-12,DP,277,277,5634,966,0,4807,529033,11970,541003
2021-08-13,Foody,14,72,2038,1,0,0,41653,2125,43778
2021-08-14,Marketplace,0,0,0,5,166,59625,1329033,59796,1388717
2021-08-09,Foody,5,64,1821,0,0,0,36895,1890,38785
2021-08-20,Shopee Credit,0,0,0,0,0,3,106,3,109
2021-08-13,Mitra,0,0,0,0,15457,0,303971,15457,319428
2021-08-17,DP,424,569,8885,1235,0,7848,726556,18964,745520
2021-08-13,Credit,40,6,247,0,0,0,5566,293,5859
2021-08-17,Shopee Credit,473,714,1274,0,0,0,33862,2461,36323
2021-08-13,Foody,36,306,8113,21,0,9429,615672,17905,633577
2021-08-18,Shopee Credit,38,27,198,0,0,0,5411,263,5674
2021-08-03,Shopee Credit,382,242,1851,0,0,0,41584,2475,44059
2021-08-22,Shopee Credit,0,2,2,0,0,0,40,4,44
2021-08-09,Shopee Credit,44,21,232,0,0,0,6037,297,6334
2021-08-23,Mitra,6,11,1,0,0,0,559,18,577
2021-08-03,Marketplace,0,0,0,21,156,68949,1511464,69126,1580478
2021-08-15,Marketplace,0,0,0,0,0,7,20,7,26
2021-08-19,Seller Center,39,35,178,0,0,0,5977,252,6229
2021-08-04,Shopee Credit,1071,1231,5695,0,0,0,149243,7997,157240
2021-08-03,Shopee Credit,910,1465,5536,22,0,0,142502,7933,150435
2021-08-07,Shopee Credit,41,21,300,0,0,0,6893,362,7255
2021-08-06,Shopee Credit,151,102,831,0,0,0,15402,1084,16486
2021-08-09,Foody,31,309,7281,17,0,8446,533551,16084,549635
2021-08-14,Seller Center,13,28,202,0,0,0,6373,243,6616
