<?xml version="1.0" encoding="UTF-8"?>
<svg xmlns="http://www.w3.org/2000/svg" xmlns:xlink="http://www.w3.org/1999/xlink" width="85pt" height="85pt" viewBox="0 0 85 85" version="1.1">
<g id="surface1">
<path style=" stroke:none;fill-rule:nonzero;fill:rgb(94.117647%,39.607843%,16.470588%);fill-opacity:1;" d="M 75.703125 42.5 C 75.703125 60.839844 60.839844 75.703125 42.5 75.703125 C 24.160156 75.703125 9.296875 60.839844 9.296875 42.5 C 9.296875 24.160156 24.160156 9.296875 42.5 9.296875 C 60.839844 9.296875 75.703125 24.160156 75.703125 42.5 Z M 75.703125 42.5 "/>
<path style=" stroke:none;fill-rule:nonzero;fill:rgb(100%,100%,100%);fill-opacity:1;" d="M 26.699219 25.898438 L 29.550781 58.105469 L 42.433594 61.757812 L 55.382812 58.105469 L 58.300781 25.898438 Z M 52.0625 36.386719 L 36.921875 36.386719 L 37.253906 40.441406 L 51.660156 40.441406 L 50.535156 52.65625 L 42.5 54.851562 L 42.433594 54.851562 L 34.335938 52.597656 L 33.867188 46.417969 L 37.785156 46.417969 L 38.046875 49.539062 L 42.433594 50.734375 L 46.816406 49.539062 L 47.285156 44.425781 L 33.671875 44.425781 L 32.605469 32.472656 L 52.394531 32.472656 Z M 52.0625 36.386719 "/>
</g>
</svg>
