<svg xmlns="http://www.w3.org/2000/svg" width="68.216" height="68.193" viewBox="0 0 68.216 68.193">
  <g id="Groupe_1915" data-name="Groupe 1915" transform="translate(0 0)">
    <circle id="Ellipse_144" data-name="Ellipse 144" cx="6.886" cy="6.886" r="6.886" transform="translate(12.334 42.027)" fill="#0a2540"/>
    <g id="Groupe_1913" data-name="Groupe 1913" transform="translate(16.975 46.529)">
      <rect id="Rectangle_561" data-name="Rectangle 561" width="24.061" height="6.576" rx="2.113" transform="translate(4.65) rotate(45)" fill="#0a2540"/>
    </g>
    <rect id="Rectangle_562" data-name="Rectangle 562" width="24.061" height="6.576" rx="2.113" transform="translate(4.65 29.499) rotate(45)" fill="#0a2540"/>
    <rect id="Rectangle_563" data-name="Rectangle 563" width="23.645" height="6.576" rx="2.847" transform="translate(17.388 16.72) rotate(-45)" fill="#1579db"/>
    <rect id="Rectangle_564" data-name="Rectangle 564" width="23.645" height="6.576" rx="2.847" transform="translate(29.459 63.396) rotate(-45)" fill="#0a2540"/>
    <circle id="Ellipse_145" data-name="Ellipse 145" cx="6.886" cy="6.886" r="6.886" transform="translate(42.11 12.472)" fill="#1579db"/>
    <g id="Groupe_1914" data-name="Groupe 1914" transform="translate(29.577 0.078)">
      <rect id="Rectangle_565" data-name="Rectangle 565" width="24.061" height="6.576" rx="2.847" transform="translate(17.014 21.663) rotate(-135)" fill="#1579db"/>
    </g>
    <rect id="Rectangle_566" data-name="Rectangle 566" width="24.061" height="6.576" rx="2.847" transform="translate(63.566 38.772) rotate(-135)" fill="#1579db"/>
    <path id="Tracé_2232" data-name="Tracé 2232" d="M528.657,686.442h0a3.287,3.287,0,0,0-4.65,0l-12.031,12.031a3.288,3.288,0,0,1,4.65,4.65l12.031-12.031A3.287,3.287,0,0,0,528.657,686.442Z" transform="translate(-462.768 -654.643)" fill="#1579db"/>
    <path id="Tracé_2233" data-name="Tracé 2233" d="M471.554,692.614h0a3.286,3.286,0,0,0,4.649,0l12.031-12.031a3.288,3.288,0,0,1-4.649-4.65l-12.031,12.033A3.286,3.286,0,0,0,471.554,692.614Z" transform="translate(-469.182 -656.123)" fill="#0a2540"/>
  </g>
</svg>
