Place,Name,CyrillicName,BirthYear,WeightClassKg,BodyweightKg,Bench1Kg,Bench2Kg,Bench3Kg,Best3BenchKg,TotalKg,Event,Equipment,Sex,Division
1,Viktoriya Kolodyazhnaya,Виктория Колодяжная,1985,47,46.8,75,80,82.5,82.5,82.5,B,Single-ply,F,Open
2,Sofiya Permyakova,София Пермякова,1985,47,45.5,62.5,65,67.5,67.5,67.5,B,Single-ply,F,Open
3,Mariya Burova,Мария Бурова,1995,47,46,47.5,-50,50,50,50,B,Single-ply,F,Open
4,Anna Kudinova,Анна Кудинова,1992,47,44.8,30,35,-37.5,35,35,B,Single-ply,F,Open
1,Mariya Vlasenkova,Мария Власенкова,1995,52,51.6,42.5,47.5,-50,47.5,47.5,B,Single-ply,F,Open
2,Klavdiya Zhukova,Клавдия Жукова,1991,52,51.1,40,42.5,45,45,45,B,Single-ply,F,Open
3,Viktoriya Rodina,Виктория Родина,1995,52,50.4,40,42.5,-45,42.5,42.5,B,Single-ply,F,Open
4,Yuliya Tsukanova,Юлия Цуканова,1997,52,51,37.5,40,42.5,42.5,42.5,B,Single-ply,F,Open
5,Natalya Dmitrieva,Наталья Дмитриева,1994,52,50.6,30,32.5,35,35,35,B,Single-ply,F,Open
1,Olesya Fyodorova,Олеся Фёдорова,1980,57,54.8,45,50,52.5,52.5,52.5,B,Single-ply,F,Open
1,Marina Burmistrova,Марина Бурмистрова,1979,63,60.7,72.5,77.5,80,80,80,B,Single-ply,F,Open
2,Alyona Shnayder,Алёна Шнайдер,1992,63,63,-70,70,-82.5,70,70,B,Single-ply,F,Open
3,Anastasiya Gubanova,Анастасия Губанова,1991,63,58.3,52.5,57,60,60,60,B,Single-ply,F,Open
4,Antonina Denisova,Антонина Денисова,1995,63,63,45,50,-55,50,50,B,Single-ply,F,Open
1,Maria Dubenskaya,Мария Дубенская,1988,72,63.1,125,132.5,137.5,137.5,137.5,B,Single-ply,F,Open
2,Marina Goryacheva,Марина Горячева,1992,72,71.7,75,80,-85,80,80,B,Single-ply,F,Open
3,Viktoriya Bogachyova,Виктория Богачёва,1992,72,68.7,37.5,-45,45,45,45,B,Single-ply,F,Open
G,Anastasiya Lysenko,Анастасия Лысенко,1994,72,64.9,75,82.5,87.5,87.5,87.5,B,Single-ply,F,Open
1,Mariya Petrunina,Мария Петрунина,1995,84,78.1,95,97.5,-102.5,97.5,97.5,B,Single-ply,F,Open
2,Vera Gubanova,Вера Губанова,1961,84,81.7,90,95,-100,95,95,B,Single-ply,F,Open
3,Natalya Silakova,Наталья Силакова,1971,84,79.4,75,80,87.5,87.5,87.5,B,Single-ply,F,Open
4,Galina Tsukanova,Галина Цуканова,1964,84,73.6,80,82.5,-87.5,82.5,82.5,B,Single-ply,F,Open
1,Olga Kolyada,Ольга Коляда,1974,84+,98.9,93,96,98,98,98,B,Single-ply,F,Open
2,Alla Pasmarnova,Алла Пасмарнова,1972,84+,84.9,85,90,-92.5,90,90,B,Single-ply,F,Open
3,Svetlana Zelinskaya,Светлана Зелинская,1962,84+,85.9,90,95,-97.5,95,95,B,Single-ply,F,Open
1,Dmitriy Pankrushev,Дмитрий Панкрушев,1987,59,55.8,110,120,-130,120,120,B,Single-ply,M,Open
2,Nikolay Aksenov,Николай Аксенов,1957,59,58.6,100,107.5,-110,107.5,107.5,B,Single-ply,M,Open
3,Umardzhon Mukhamadiev,Умарджон Мухамадиев,1995,59,57,75,80,-82.5,80,80,B,Single-ply,M,Open
4,Anatoliy Denisov,Анатолий Денисов,1996,59,59,75,-80,-80,75,75,B,Single-ply,M,Open
1,Nikolay Zhukov,Николай Жуков,1987,66,66,135,142.5,145,145,145,B,Single-ply,M,Open
2,Aleksandr Gapuzin,Александр Гапузин,1980,66,65.2,120,130,135,135,135,B,Single-ply,M,Open
3,Timur Pereverzin,Тимур Переверзин,1993,66,65.6,122.5,127.5,130,130,130,B,Single-ply,M,Open
4,Vladimir Pulnev,Владимир Пульнев,1981,66,64.6,105,110,117.5,117.5,117.5,B,Single-ply,M,Open
5,Evgeniy Vasin,Евгений Васин,1993,66,66,105,110,117.5,117.5,117.5,B,Single-ply,M,Open
6,Aleksandr Mazur,Александр Мазур,1990,66,61.7,100,-102.5,-102.5,100,100,B,Single-ply,M,Open
1,Taras Tarasenko,Тарас Тарасенко,1979,74,73.9,150,155,157.5,157.5,157.5,B,Single-ply,M,Open
2,Sergey Sinyov,Сергей Синёв,1984,74,73.1,140,150,155,155,155,B,Single-ply,M,Open
3,Boris Denisov,Борис Денисов,1987,74,73,-140,145,150,150,150,B,Single-ply,M,Open
4,Dzhobu Zakhidov #2,Джобу Захидов,1988,74,73,125,135,-142.5,135,135,B,Single-ply,M,Open
5,Roman Elovikov,Роман Еловиков,1982,74,73.4,130,135,-140,135,135,B,Single-ply,M,Open
6,Anatoliy Tyoplyy,Анатолий Тёплый,1977,74,70.6,125,130,-140,130,130,B,Single-ply,M,Open
7,Evgeniy Khorsov,Евгений Хорсов,1994,74,71.3,115,-125,125,125,125,B,Single-ply,M,Open
8,Yuriy Ivanchikov,Юрий Иванчиков,,74,70.4,100,110,-112.5,110,110,B,Single-ply,M,Open
9,Konstantin Cherevko,Константин Черевко,1995,74,70.7,75,80,82.5,82.5,82.5,B,Single-ply,M,Open
1,Andrey Vasilev,Андрей Васильев,1984,83,81.2,200,205,207.5,207.5,207.5,B,Single-ply,M,Open
2,Aleksandr Martynov,Александр Мартынов,1978,83,78.7,180,190,195,195,195,B,Single-ply,M,Open
3,Dmitriy Nikultsev,Дмитрий Никульцев,1989,83,83,190,-200,-200,190,190,B,Single-ply,M,Open
4,Aleksey Timoshin,Алексей Тимошин,,83,80.9,160,170,175,175,175,B,Single-ply,M,Open
5,Ivan Vedenkin,Иван Веденкин,1981,83,79.5,170,-175,-180,170,170,B,Single-ply,M,Open
6,Vladimir Lavrukhin,Владимир Лаврухин,1988,83,80.6,170,-177.5,-177.5,170,170,B,Single-ply,M,Open
7,Aleksandr Kolganov,Александр Колганов,1979,83,78.4,145,150,160,160,160,B,Single-ply,M,Open
8,Vladimir Orlov,Владимир Орлов,1985,83,81.2,150,160,-165,160,160,B,Single-ply,M,Open
9,Aleksey Dubinin,Алексей Дубинин,1990,83,80.1,125,130,-132.5,130,130,B,Single-ply,M,Open
10,Aleksey Ogarkov,Алексей Огарков,1982,83,80.7,120,130,-135,130,130,B,Single-ply,M,Open
11,Sergey Nichik,Сергей Ничик,1990,83,80.7,-120,120,-130,120,120,B,Single-ply,M,Open
12,Aleksandr Gorbachyov,Александр Горбачёв,1990,83,80.8,110,115,120,120,120,B,Single-ply,M,Open
1,Anatoliy Kovalyov,Анатолий Ковалёв,1977,93,92.3,232.5,-240,-240,232.5,232.5,B,Single-ply,M,Open
2,Evgeniy Ivashkin,Евгений Ивашкин,1981,93,89.6,-210,210,-215,210,210,B,Single-ply,M,Open
3,Vitaliy Dunaev,Виталий Дунаев,1987,93,92.3,167.5,175,-180,175,175,B,Single-ply,M,Open
4,Mikhail Egorov,Михаил Егоров,1990,93,89.2,140,-150,150,150,150,B,Single-ply,M,Open
DQ,Dmitriy Chamkin,Дмитрий Чамкин,1982,93,88.7,-175,-177.5,-177.5,,,B,Single-ply,M,Open
1,Sergey Vakhrushin,Сергей Вахрушин,1974,105,103.2,230,240,242.5,242.5,242.5,B,Single-ply,M,Open
2,Roman Konin,Роман Конин,1982,105,100,220,230,240,240,240,B,Single-ply,M,Open
3,Roman Zhdanov,Роман Жданов,1983,105,99,210,220,-230,220,220,B,Single-ply,M,Open
4,Dmitriy Kontsevoy,Дмитрий Концевой,1983,105,100.6,190,200,205,205,205,B,Single-ply,M,Open
5,Igor Marichev,Игорь Маричев,1976,105,103.2,192.5,197.5,200,200,200,B,Single-ply,M,Open
6,Andrey Savinkov,Андрей Савинков,1992,105,101.2,150,160,162.5,162.5,162.5,B,Single-ply,M,Open
7,Ilya Danilenko,Илья Даниленко,1975,105,102.7,150,155,160,160,160,B,Single-ply,M,Open
1,Dmitriy Konin,Дмитрий Конин,1975,120,105.1,225,235,245,245,245,B,Single-ply,M,Open
2,Andrey Komissarov,Андрей Комиссаров,1984,120,114.9,207.5,215,225,225,225,B,Single-ply,M,Open
3,Mikhail Antsiferov,Михаил Анциферов,1981,120,105.2,180,185,190,190,190,B,Single-ply,M,Open
4,Aleksey Ulitin,Алексей Улитин,1967,120,105.2,160,175,180,180,180,B,Single-ply,M,Open
5,Maksim Denisov,Максим Денисов,1981,120,116.6,165,175,-182.5,175,175,B,Single-ply,M,Open
6,Vladimir Vasilkov,Владимир Васильков,1965,120,107.1,120,127.5,-130,127.5,127.5,B,Single-ply,M,Open
1,Andrey Shiyanov,Андрей Шиянов,1979,120+,128.9,225,237.5,-250,237.5,237.5,B,Single-ply,M,Open
2,Nikolay Mashtakov,Николай Маштаков,1982,120+,132.3,185,202.5,212.5,212.5,212.5,B,Single-ply,M,Open
3,Sergey Volkov,Сергей Волков,1977,120+,121.8,200,210,-215,210,210,B,Single-ply,M,Open
4,Sergey Yazykov,Сергей Языков,1996,120+,120.1,140,150,-160,150,150,B,Single-ply,M,Open
5,Eduard Martynenko,Эдуард Мартыненко,1981,120+,126.1,135,140,-142.5,140,140,B,Single-ply,M,Open
