Place,Name,Sex,BirthDate,Age,Equipment,Division,BodyweightKg,WeightClassKg,Squat1Kg,Squat2Kg,Squat3Kg,Best3SquatKg,Bench1Kg,Bench2Kg,Bench3Kg,Best3BenchKg,Deadlift1Kg,Deadlift2Kg,Deadlift3Kg,Best3DeadliftKg,TotalKg,Event
1,Maisie MacCormack,F,1998-08-27,23,Raw,F_JR_ABPU,59.1,60,95,105,-107.5,105,50,55,60,60,120,130,140,140,305,SBD
1,Cleary Clifford,F,1975-12-28,46,Raw,F_MR_2_BPU,67,67.5,80,85,90,90,42.5,47.5,50,50,105,115,-120,115,255,SBD
1,Rachel Evans,F,1996-08-26,25,Raw,F_OR_ABPU,63.6,67.5,85,95,100,100,45,52.5,-57.5,52.5,100,110,122.5,122.5,275,SBD
2,Cheska Webb,F,1988-01-04,34,Raw,F_OR_ABPU,63.4,67.5,60,65,70,70,45,50,52.5,52.5,100,105,110,110,232.5,SBD
1,Charlotte Bouvey,F,1987-03-27,34,Raw,F_OR_ABPU,78.2,82.5,100,102.5,105,105,-60,-60,60,60,120,125,132.5,132.5,297.5,SBD
1,Courtney Holwell-Russell,F,2005-07-22,16,Raw,F_TR_2_ABPU,99.9,100,80,90,-95,90,40,45,-47.5,45,130,140,145,145,280,SBD
2,Chardonnay Holwell-Russell,F,2003-10-13,18,Raw,F_TR_3_ABPU,71.4,75,105,115,117.5,117.5,50,55,,55,130,140,,140,312.5,SBD
1,Roxy Jeffries,F,2002-07-19,19,Raw,F_TR_3_ABPU,73.3,75,105,115,122.5,122.5,55,60,65,65,140,150,-160,150,337.5,SBD
1,Phoebe Wing,F,1998-11-06,23,Raw,F_JCR_ABPU,99.3,100,145,155,162.5,162.5,60,65,-70,65,140,152.5,160,160,387.5,SBD
1,Sue Davies,F,1968-11-19,53,Wraps,F_MCR_3_BPU,79.9,82.5,-135,140,-150,140,100,-110,,100,170,180,,180,420,SBD
1,Aneela Rose,F,1971-09-02,50,Wraps,F_MCR_3_ABPU,59.9,60,70,75,80,80,47.5,52.5,55,55,80,90,100,100,235,SBD
1,Catherine Kruger-Stewart,F,1995-08-24,26,Raw,F_OCR_ABPU,65.3,67.5,75,80,87.5,87.5,50,-57.5,-60,50,90,95,100,100,237.5,SBD
1,Rosie Mahe,F,1996-05-16,25,Raw,F_OCR_ABPU,70.4,75,92.5,97.5,102.5,102.5,52.5,-57.5,60,60,100,110,115,115,277.5,SBD
1,Jennifer Harris #4,F,1962-05-13,59,Raw,F_MR_4_ABPU,81.6,82.5,,,,,,,,,75,80,85,85,85,D
1,Danny O'Brien #1,M,1992-07-30,29,Raw,M_OR_BPU,91.4,100,180,190,-200,190,145,155,-160,155,225,,,225,570,SBD
1,Lee Friel,M,1988-11-19,33,Raw,M_OR_BPU,109.4,110,200,220,230,230,130,140,-145,140,230,250,-262.5,250,620,SBD
1,Jacob Jabbari,M,1992-09-18,29,Raw,M_OR_ABPU,86.4,90,157.5,165,172.5,172.5,107.5,115,-120,115,200,210,217.5,217.5,505,SBD
1,Alex Maynard,M,1994-03-29,27,Raw,M_OR_ABPU,106.5,110,220,235,250,250,140,150,157.5,157.5,260,285,-292.5,285,692.5,SBD
2,Benjamin Gough-Stedman,M,1992-03-07,29,Raw,M_OR_ABPU,100.6,110,155,165,180,180,100,-110,-115,100,180,200,-220,200,480,SBD
2,Max Wootten,M,1998-05-03,23,Raw,M_JCR_ABPU,85.9,90,150,160,170,170,100,105,-110,105,200,215,225,225,500,SBD
1,Justin Clark #4,M,1979-01-17,43,Wraps,M_MCR_1_BPU,127.6,140,200,220,230,230,110,120,125,125,270,290,-300,290,645,SBD
1,Hallie Aldred,F,1986-05-02,35,Raw,F_OCR_ABPU,59.5,60,80,87.5,92.5,92.5,50,55,57.5,57.5,110,115,120,120,270,SBD
1,Adrian Potrykus,M,1998-02-27,23,Raw,M_JCR_BPU,124.1,125,300,-320,-320,300,-180,180,-190,180,300,315,325,325,805,SBD
1,Freddie Isherwood,M,2000-01-19,22,Raw,M_JCR_ABPU,90,90,275,-285,-285,275,140,-147.5,150,150,285,-300,-300,285,710,SBD
1,Cameron Morris #2,M,2001-12-15,20,Raw,M_JCR_ABPU,122.4,125,190,200,215,215,115,120,125,125,195,210,220,220,560,SBD
1,Joe Martin #1,M,1979-05-17,42,Wraps,M_MCR_1_BPU,109.5,110,280,295,305,305,185,195,202.5,202.5,285,300,312.5,312.5,820,SBD
1,Karl Williams,M,1980-02-24,42,Wraps,M_MCR_1_ABPU,80.7,82.5,180,190,-195,190,95,100,105,105,200,212.5,220,220,515,SBD
1,Neil Bustin,M,1981-02-04,41,Wraps,M_MCR_1_ABPU,106.5,110,175,185,-195,185,122.5,130,135,135,220,235,245,245,565,SBD
1,Kevin Smith #21,M,1963-05-26,58,Wraps,M_MCR_4_BPU,87.7,90,147.5,157.5,167.5,167.5,102.5,107.5,110,110,200,215,227.5,227.5,505,SBD
DQ,Dean Piggott,M,1994-06-27,27,Raw,M_OCR_BPU,89.9,90,140,,,140,170,180,-187.5,180,,,,,,SBD
1,Luke Dolan #2,M,1988-06-15,33,Wraps,M_OCR_BPU,96,100,160,-175,-175,160,130,140,150,150,195,215,230,230,540,SBD
1,Jack Morecroft,M,1992-06-21,29,Wraps,M_OCR_BPU,118.2,125,270,290,-300,290,157.5,165,-170,165,275,290,300,300,755,SBD
1,Rob Flett,M,1994-12-09,27,Wraps,M_OCR_BPU,133.7,140,305,320,330,330,200,210,,210,300,320,330,330,870,SBD
1,Luke Webb,M,1993-07-18,28,Raw,M_OCR_ABPU,90.8,100,195,-210,210,210,120,127.5,135,135,220,235,-250,235,580,SBD
1,Scott Brodrick,M,1990-02-27,,Wraps,M_OCR_ABPU,115,125,200,220,240,240,110,120,130,130,250,270,280,280,650,SBD
1,Max Cronin,M,2004-06-21,17,Wraps,M_TCR_2_ABPU,65.1,67.5,120,130,140,140,80,85,90,90,150,160,170,170,400,SBD
1,Dan Stewart,M,1993-06-12,28,Multi-ply,M_OEM_BPU,121.1,125,365,405,-440,405,270,285,-292.5,285,310,340,,340,1030,SBD
1,Matthew Provin,M,2001-08-10,20,Raw,M_JR_BPU,71.5,75,,,,,112.5,117.5,122.5,122.5,,,,,122.5,B
1,Danny O'Brien #1,M,1992-07-30,29,Raw,M_OR_BPU,91.4,100,,,,,145,155,-160,155,,,,,155,B
1,James Dwyer,M,1983-04-20,38,Raw,M_OR_ABPU,65.2,67.5,,,,,75,80,-85,80,,,,,80,B
DQ,Mark Towers,M,1998-01-11,24,Raw,M_OR_BPU,95.3,100,,,,,,,,,-240,-265,,,,D
