%!PS-Adobe-3.0 EPSF-3.0
%%Creator: cairo 1.16.0 (https://cairographics.org)
%%CreationDate: Mon Jun  5 08:43:01 2023
%%Pages: 1
%%DocumentData: Clean7Bit
%%LanguageLevel: 2
%%BoundingBox: 0 0 1000 737
%%EndComments
%%BeginProlog
50 dict begin
/q { gsave } bind def
/Q { grestore } bind def
/cm { 6 array astore concat } bind def
/w { setlinewidth } bind def
/J { setlinecap } bind def
/j { setlinejoin } bind def
/M { setmiterlimit } bind def
/d { setdash } bind def
/m { moveto } bind def
/l { lineto } bind def
/c { curveto } bind def
/h { closepath } bind def
/re { exch dup neg 3 1 roll 5 3 roll moveto 0 rlineto
      0 exch rlineto 0 rlineto closepath } bind def
/S { stroke } bind def
/f { fill } bind def
/f* { eofill } bind def
/n { newpath } bind def
/W { clip } bind def
/W* { eoclip } bind def
/BT { } bind def
/ET { } bind def
/BDC { mark 3 1 roll /BDC pdfmark } bind def
/EMC { mark /EMC pdfmark } bind def
/cairo_store_point { /cairo_point_y exch def /cairo_point_x exch def } def
/Tj { show currentpoint cairo_store_point } bind def
/TJ {
  {
    dup
    type /stringtype eq
    { show } { -0.001 mul 0 cairo_font_matrix dtransform rmoveto } ifelse
  } forall
  currentpoint cairo_store_point
} bind def
/cairo_selectfont { cairo_font_matrix aload pop pop pop 0 0 6 array astore
    cairo_font exch selectfont cairo_point_x cairo_point_y moveto } bind def
/Tf { pop /cairo_font exch def /cairo_font_matrix where
      { pop cairo_selectfont } if } bind def
/Td { matrix translate cairo_font_matrix matrix concatmatrix dup
      /cairo_font_matrix exch def dup 4 get exch 5 get cairo_store_point
      /cairo_font where { pop cairo_selectfont } if } bind def
/Tm { 2 copy 8 2 roll 6 array astore /cairo_font_matrix exch def
      cairo_store_point /cairo_font where { pop cairo_selectfont } if } bind def
/g { setgray } bind def
/rg { setrgbcolor } bind def
/d1 { setcachedevice } bind def
/cairo_data_source {
  CairoDataIndex CairoData length lt
    { CairoData CairoDataIndex get /CairoDataIndex CairoDataIndex 1 add def }
    { () } ifelse
} def
/cairo_flush_ascii85_file { cairo_ascii85_file status { cairo_ascii85_file flushfile } if } def
/cairo_image { image cairo_flush_ascii85_file } def
/cairo_imagemask { imagemask cairo_flush_ascii85_file } def
%%EndProlog
%%BeginSetup
%%EndSetup
%%Page: 1 1
%%BeginPageSetup
%%PageBoundingBox: 0 0 1000 737
%%EndPageSetup
q 0 0 1000 737 rectclip
1 0 0 -1 0 737 cm q
Q q
0.27 405 999.73 23 re W n
1 g
10.215 405.355 m 990.328 405.355 l 995.852 405.355 1000.328 409.832 1000.328
 415.355 c 1000.328 417.945 l 1000.328 423.469 995.852 427.945 990.328 427.945
 c 10.215 427.945 l 4.691 427.945 0.211 423.469 0.211 417.945 c 0.211 415.355
 l 0.211 409.832 4.691 405.355 10.215 405.355 c h
10.215 405.355 m f
Q q
2.699 487.086 995.141 249.914 re W n
1 g
71.566 735.086 m 51.031 735.086 36.008 732.887 26.496 728.484 c 16.938 
724.082 10.59 716.75 7.445 706.48 c 4.305 696.215 2.73 680.395 2.73 659.02
 c 2.73 634.922 3.844 612.812 6.062 592.699 c 8.242 572.582 11.219 551.418
 14.992 529.203 c 15.828 524.176 18.406 520.152 22.723 517.137 c 26.996 
514.074 32.488 512.547 39.191 512.547 c 46.316 512.547 51.723 514.266 55.414
 517.699 c 59.059 521.18 60.883 525.852 60.883 531.719 c 60.883 532.977 
60.672 534.863 60.254 537.379 c 55.852 563.152 52.5 585.09 50.195 603.195
 c 47.891 621.344 46.738 640.371 46.738 660.277 c 46.738 670.543 47.219 
678.09 48.184 682.906 c 49.105 687.727 50.992 691.082 53.84 692.965 c 56.648
 694.852 61.09 695.797 67.168 695.797 c 80.16 695.797 102.582 692.863 134.434
 686.992 c 135.48 686.785 136.945 686.68 138.832 686.68 c 144.281 686.68
 148.641 688.711 151.91 692.777 c 155.137 696.883 156.75 701.664 156.75 
707.109 c 156.75 718.215 148.684 725.238 132.547 728.172 c 118.086 730.895
 107.148 732.719 99.73 733.641 c 92.273 734.602 82.883 735.086 71.566 735.086
 c h
219.301 570.066 m 210.918 570.066 204.043 567.383 198.68 562.02 c 193.355
 556.699 190.695 549.949 190.695 541.777 c 190.695 533.605 193.355 526.961
 198.68 521.852 c 204.043 516.695 211.023 514.117 219.613 514.117 c 227.996
 514.117 234.805 516.695 240.043 521.852 c 245.281 526.961 247.902 533.5
 247.902 541.465 c 247.902 549.637 245.219 556.445 239.855 561.895 c 234.535
 567.344 227.68 570.066 219.301 570.066 c h
214.898 732.258 m 208.191 732.258 202.641 730.578 198.238 727.227 c 193.84
 723.875 191.742 719.367 191.953 713.711 c 194.469 597.727 l 194.676 592.07
 196.879 587.605 201.07 584.336 c 205.258 581.109 210.707 579.496 217.414
 579.496 c 224.328 579.496 229.984 581.172 234.387 584.523 c 238.789 587.879
 240.883 592.488 240.672 598.355 c 238.16 714.027 l 237.949 719.684 235.688
 724.148 231.371 727.414 c 227.094 730.645 221.605 732.258 214.898 732.258
 c h
313.91 736.656 m 307.625 736.656 302.281 735.086 297.879 731.941 c 293.48
 728.797 291.277 724.922 291.277 720.312 c 291.277 519.773 l 291.277 514.117
 293.375 509.613 297.566 506.258 c 301.758 502.906 307.102 501.23 313.594
 501.23 c 320.301 501.23 325.793 502.906 330.066 506.258 c 334.383 509.613
 336.543 514.117 336.543 519.773 c 335.914 607.785 l 354.457 595.84 l 374.953
 582.848 389.914 573.523 399.344 567.867 c 403.996 565.141 408.711 564.094
 413.488 564.723 c 417.68 565.352 421.344 567.805 424.488 572.078 c 427.633
 576.395 429.203 580.965 429.203 585.781 c 429.203 589.137 428.387 591.754
 426.75 593.641 c 425.074 595.527 422.227 597.727 418.203 600.242 c 345.344
 645.188 l 421.094 703.023 l 424.656 705.75 426.438 709.836 426.438 715.281
 c 426.438 720.73 424.383 725.238 420.277 728.797 c 416.211 732.359 411.453
 734.141 406.008 734.141 c 400.766 734.141 395.527 732.258 390.289 728.484
 c 382.957 723.035 372.582 714.34 359.172 702.395 c 344.922 690.031 337.168
 683.328 335.914 682.277 c 335.914 719.996 l 335.914 724.816 333.816 728.797
 329.625 731.941 c 325.434 735.086 320.195 736.656 313.91 736.656 c h
604.281 614.699 m 609.309 635.445 611.824 669.184 611.824 715.91 c 611.824
 720.941 609.625 725.027 605.223 728.172 c 600.824 731.312 595.48 732.887
 589.191 732.887 c 582.695 732.887 577.25 731.207 572.848 727.855 c 568.449
 724.504 566.246 719.789 566.246 713.711 c 566.246 687.938 565.996 667.926
 565.492 653.676 c 564.949 639.426 563.629 627.902 561.531 619.102 c 560.066
 613.234 557.863 609.398 554.93 607.598 c 551.996 605.836 548.75 604.957
 545.188 604.957 c 533.664 604.957 525.176 609.293 519.727 617.969 c 514.281
 626.688 511.555 638.066 511.555 652.105 c 511.555 716.855 l 511.555 721.465
 509.355 725.277 504.953 728.297 c 500.555 731.355 495.211 732.887 488.926
 732.887 c 482.637 732.887 477.293 731.312 472.895 728.172 c 468.492 725.027
 466.293 721.148 466.293 716.539 c 466.293 676.309 466.816 636.285 467.863
 596.469 c 468.285 581.59 469.332 558.75 471.008 527.949 c 472.266 505.629
 l 472.684 500.184 474.883 495.719 478.867 492.242 c 482.848 488.805 488.191
 487.086 494.895 487.086 c 501.391 487.086 506.527 488.656 510.297 491.801
 c 514.07 494.945 515.852 499.133 515.641 504.375 c 513.965 529.102 512.5
 555.816 511.242 584.523 c 516.059 580.125 522.031 576.605 529.156 573.965
 c 536.281 571.367 544.348 570.066 553.359 570.066 c 567.398 570.066 578.465
 573.672 586.551 580.879 c 594.598 588.129 600.508 599.402 604.281 614.699
 c h
792.242 699.254 m 796.227 699.883 799.305 701.348 801.484 703.652 c 803.707
 705.957 804.816 710.043 804.816 715.91 c 804.816 720.941 803.52 725.238
 800.918 728.797 c 798.277 732.359 794.758 734.141 790.359 734.141 c 781.348
 734.141 774.434 733.031 769.613 730.809 c 764.793 728.633 760.395 724.609
 756.41 718.742 c 751.801 725.656 745.516 730.516 737.551 733.324 c 729.59
 736.176 720.266 737.602 709.578 737.602 c 685.898 737.602 667.879 730.789
 655.516 717.168 c 643.152 703.547 636.969 684.586 636.969 660.277 c 636.969
 644.352 640.219 630.207 646.715 617.844 c 653.211 605.48 662.281 595.84
 673.934 588.926 c 685.543 582.012 698.891 578.555 713.977 578.555 c 721.523
 578.555 728.543 580.02 735.039 582.953 c 741.535 585.887 746.457 589.766
 749.812 594.582 c 750.438 590.496 l 750.859 587.562 752.535 585.09 755.469
 583.078 c 758.402 581.109 763.012 580.125 769.297 580.125 c 776.004 580.125
 780.93 581.488 784.07 584.211 c 787.215 586.934 788.785 590.395 788.785
 594.582 c 788.785 596.051 788.684 597.203 788.473 598.043 c 787.215 605.164
 785.957 617.109 784.699 633.875 c 784.07 641.629 783.758 651.582 783.758
 663.734 c 783.758 679.449 l 783.758 685.527 784.281 690.18 785.328 693.406
 c 786.375 696.676 788.684 698.625 792.242 699.254 c h
739.754 677.562 m 739.961 668.973 740.066 655.668 740.066 637.645 c 740.066
 630.52 737.719 624.695 733.027 620.168 c 728.289 615.684 722.254 613.441
 714.922 613.441 c 705.492 613.441 697.738 617.781 691.66 626.457 c 685.586
 635.172 682.547 646.344 682.547 659.961 c 682.547 672.953 685.27 683.328
 690.719 691.082 c 696.168 698.832 703.5 702.711 712.723 702.711 c 721.312
 702.711 727.914 700.551 732.523 696.234 c 737.133 691.961 739.543 685.738
 739.754 677.562 c h
985.238 699.254 m 989.219 699.883 992.301 701.348 994.477 703.652 c 996.699
 705.957 997.809 710.043 997.809 715.91 c 997.809 720.941 996.488 725.238
 993.852 728.797 c 991.25 732.359 987.75 734.141 983.352 734.141 c 974.34
 734.141 967.426 733.031 962.605 730.809 c 957.785 728.633 953.387 724.609
 949.406 718.742 c 944.793 725.656 938.508 730.516 930.547 733.324 c 922.582
 736.176 913.258 737.602 902.57 737.602 c 878.891 737.602 860.871 730.789
 848.508 717.168 c 836.145 703.547 829.961 684.586 829.961 660.277 c 829.961
 644.352 833.211 630.207 839.707 617.844 c 846.203 605.48 855.254 595.84
 866.863 588.926 c 878.516 582.012 891.883 578.555 906.973 578.555 c 914.516
 578.555 921.535 580.02 928.031 582.953 c 934.527 585.887 939.453 589.766
 942.805 594.582 c 943.434 590.496 l 943.852 587.562 945.527 585.09 948.461
 583.078 c 951.395 581.109 956.004 580.125 962.293 580.125 c 968.996 580.125
 973.922 581.488 977.066 584.211 c 980.207 586.934 981.781 590.395 981.781
 594.582 c 981.781 596.051 981.676 597.203 981.465 598.043 c 980.207 605.164
 978.949 617.109 977.695 633.875 c 977.066 641.629 976.75 651.582 976.75
 663.734 c 976.75 679.449 l 976.75 685.527 977.273 690.18 978.324 693.406
 c 979.371 696.676 981.676 698.625 985.238 699.254 c h
932.746 677.562 m 932.957 668.973 933.059 655.668 933.059 637.645 c 933.059
 630.52 930.691 624.695 925.957 620.168 c 921.262 615.684 915.25 613.441
 907.914 613.441 c 898.484 613.441 890.73 617.781 884.656 626.457 c 878.578
 635.172 875.539 646.344 875.539 659.961 c 875.539 672.953 878.262 683.328
 883.711 691.082 c 889.16 698.832 896.492 702.711 905.715 702.711 c 914.305
 702.711 920.906 700.551 925.516 696.234 c 930.125 691.961 932.535 685.738
 932.746 677.562 c h
932.746 677.562 m f
Q q
328.672 0.301 343.199 345.914 re W n
1 g
664.98 216.82 m 653.406 216.82 l 653.406 48.367 l 653.387 37.508 644.578
 28.715 633.719 28.715 c 506.461 28.715 l 506.461 6.996 l 506.461 3.133 
503.328 0.004 499.465 0.004 c 495.605 0.004 492.473 3.133 492.473 6.996 
c 492.473 28.715 l 365.215 28.715 l 354.363 28.715 345.562 37.512 345.562
 48.367 c 345.562 216.82 l 335.664 216.82 l 331.805 216.82 328.672 219.949
 328.672 223.812 c 328.672 227.676 331.805 230.809 335.664 230.809 c 426.203
 230.809 l 385.988 336.73 l 384.617 340.344 386.434 344.383 390.043 345.754
 c 393.656 347.125 397.695 345.309 399.066 341.699 c 441.172 230.809 l 492.473
 230.809 l 492.473 297.25 l 492.473 301.113 495.605 304.246 499.465 304.246
 c 503.328 304.246 506.461 301.113 506.461 297.25 c 506.461 230.809 l 565.91
 230.809 l 607.875 341.871 l 608.984 344.582 611.664 346.312 614.59 346.211
 c 615.438 346.215 616.281 346.059 617.07 345.754 c 620.684 344.383 622.5
 340.344 621.129 336.73 c 580.949 230.809 l 664.875 230.809 l 668.738 230.809
 671.871 227.676 671.871 223.812 c 671.871 219.949 668.738 216.82 664.875
 216.82 c h
639.418 216.82 m 620.219 216.82 l 620.219 197.969 l 561.121 197.969 l 561.121
 216.82 l 359.551 216.82 l 359.551 48.367 l 359.57 45.246 362.094 42.723
 365.215 42.703 c 633.719 42.703 l 636.852 42.703 639.398 45.234 639.418
 48.367 c h
639.418 216.82 m f
Q q
1 g
692 321.105 68.859 22.594 re f
239.684 321.105 68.859 22.594 re f
Q Q
showpage
%%Trailer
end
%%EOF
