%!PS-Adobe-3.0 EPSF-3.0
%%Creator: cairo 1.16.0 (https://cairographics.org)
%%CreationDate: Mon Jun  5 08:43:01 2023
%%Pages: 1
%%DocumentData: Clean7Bit
%%LanguageLevel: 2
%%BoundingBox: 0 0 1000 1000
%%EndComments
%%BeginProlog
50 dict begin
/q { gsave } bind def
/Q { grestore } bind def
/cm { 6 array astore concat } bind def
/w { setlinewidth } bind def
/J { setlinecap } bind def
/j { setlinejoin } bind def
/M { setmiterlimit } bind def
/d { setdash } bind def
/m { moveto } bind def
/l { lineto } bind def
/c { curveto } bind def
/h { closepath } bind def
/re { exch dup neg 3 1 roll 5 3 roll moveto 0 rlineto
      0 exch rlineto 0 rlineto closepath } bind def
/S { stroke } bind def
/f { fill } bind def
/f* { eofill } bind def
/n { newpath } bind def
/W { clip } bind def
/W* { eoclip } bind def
/BT { } bind def
/ET { } bind def
/BDC { mark 3 1 roll /BDC pdfmark } bind def
/EMC { mark /EMC pdfmark } bind def
/cairo_store_point { /cairo_point_y exch def /cairo_point_x exch def } def
/Tj { show currentpoint cairo_store_point } bind def
/TJ {
  {
    dup
    type /stringtype eq
    { show } { -0.001 mul 0 cairo_font_matrix dtransform rmoveto } ifelse
  } forall
  currentpoint cairo_store_point
} bind def
/cairo_selectfont { cairo_font_matrix aload pop pop pop 0 0 6 array astore
    cairo_font exch selectfont cairo_point_x cairo_point_y moveto } bind def
/Tf { pop /cairo_font exch def /cairo_font_matrix where
      { pop cairo_selectfont } if } bind def
/Td { matrix translate cairo_font_matrix matrix concatmatrix dup
      /cairo_font_matrix exch def dup 4 get exch 5 get cairo_store_point
      /cairo_font where { pop cairo_selectfont } if } bind def
/Tm { 2 copy 8 2 roll 6 array astore /cairo_font_matrix exch def
      cairo_store_point /cairo_font where { pop cairo_selectfont } if } bind def
/g { setgray } bind def
/rg { setrgbcolor } bind def
/d1 { setcachedevice } bind def
/cairo_data_source {
  CairoDataIndex CairoData length lt
    { CairoData CairoDataIndex get /CairoDataIndex CairoDataIndex 1 add def }
    { () } ifelse
} def
/cairo_flush_ascii85_file { cairo_ascii85_file status { cairo_ascii85_file flushfile } if } def
/cairo_image { image cairo_flush_ascii85_file } def
/cairo_imagemask { imagemask cairo_flush_ascii85_file } def
%%EndProlog
%%BeginSetup
%%EndSetup
%%Page: 1 1
%%BeginPageSetup
%%PageBoundingBox: 0 0 1000 1000
%%EndPageSetup
q 0 0 1000 1000 rectclip
1 0 0 -1 0 1000 cm q
0 g
0 0 1000 1000 rectfill
Q q
150.191 525 700 17 re W n
1 g
157.148 525.797 m 843.23 525.797 l 847.098 525.797 850.23 528.93 850.23
 532.797 c 850.23 534.609 l 850.23 538.477 847.098 541.609 843.23 541.609
 c 157.148 541.609 l 153.285 541.609 150.148 538.477 150.148 534.609 c 150.148
 532.797 l 150.148 528.93 153.285 525.797 157.148 525.797 c h
157.148 525.797 m f
Q q
151.891 583.008 696.598 175.148 re W n
1 g
200.098 756.609 m 185.723 756.609 175.207 755.066 168.547 751.988 c 161.859
 748.906 157.414 743.773 155.211 736.586 c 153.012 729.398 151.914 718.324
 151.914 703.363 c 151.914 686.492 152.691 671.02 154.246 656.938 c 155.77
 642.855 157.852 628.039 160.492 612.492 c 161.078 608.973 162.883 606.156
 165.906 604.043 c 168.898 601.902 172.742 600.828 177.434 600.828 c 182.422
 600.828 186.207 602.031 188.789 604.438 c 191.34 606.875 192.617 610.145
 192.617 614.25 c 192.617 615.133 192.469 616.453 192.176 618.211 c 189.098
 636.254 186.75 651.613 185.137 664.285 c 183.523 676.988 182.715 690.309
 182.715 704.242 c 182.715 711.43 183.055 716.711 183.727 720.082 c 184.375
 723.457 185.695 725.805 187.688 727.125 c 189.652 728.445 192.762 729.105
 197.016 729.105 c 206.113 729.105 221.809 727.051 244.102 722.945 c 244.836
 722.797 245.863 722.723 247.184 722.723 c 250.996 722.723 254.047 724.148
 256.336 726.992 c 258.594 729.867 259.723 733.211 259.723 737.023 c 259.723
 744.801 254.078 749.715 242.781 751.766 c 232.66 753.676 225.004 754.949
 219.812 755.594 c 214.59 756.27 208.02 756.609 200.098 756.609 c h
303.508 641.094 m 297.641 641.094 292.832 639.219 289.074 635.461 c 285.352
 631.734 283.488 627.012 283.488 621.293 c 283.488 615.57 285.352 610.922
 289.074 607.344 c 292.832 603.734 297.715 601.93 303.73 601.93 c 309.598
 601.93 314.363 603.734 318.031 607.344 c 321.699 610.922 323.531 615.5 
323.531 621.07 c 323.531 626.793 321.652 631.559 317.898 635.375 c 314.172
 639.188 309.375 641.094 303.508 641.094 c h
300.43 754.629 m 295.734 754.629 291.848 753.453 288.77 751.105 c 285.688
 748.762 284.219 745.605 284.367 741.645 c 286.129 660.457 l 286.273 656.496
 287.812 653.371 290.75 651.082 c 293.684 648.824 297.496 647.695 302.188
 647.695 c 307.031 647.695 310.992 648.867 314.07 651.215 c 317.152 653.562
 318.617 656.789 318.473 660.898 c 316.711 741.867 l 316.562 745.828 314.98
 748.949 311.957 751.238 c 308.965 753.496 305.121 754.629 300.43 754.629
 c h
369.738 757.707 m 365.336 757.707 361.598 756.609 358.516 754.406 c 355.434
 752.207 353.895 749.492 353.895 746.266 c 353.895 605.891 l 353.895 601.93
 355.363 598.777 358.297 596.43 c 361.23 594.082 364.969 592.91 369.516 
592.91 c 374.211 592.91 378.055 594.082 381.047 596.43 c 384.066 598.777
 385.578 601.93 385.578 605.891 c 385.141 667.496 l 398.121 659.137 l 412.465
 650.043 422.938 643.516 429.539 639.555 c 432.797 637.648 436.098 636.914
 439.441 637.355 c 442.375 637.793 444.941 639.512 447.141 642.504 c 449.344
 645.523 450.441 648.723 450.441 652.098 c 450.441 654.441 449.871 656.277
 448.727 657.598 c 447.551 658.918 445.559 660.457 442.742 662.219 c 391.738
 693.68 l 444.766 734.164 l 447.258 736.07 448.508 738.934 448.508 742.746
 c 448.508 746.559 447.07 749.715 444.195 752.207 c 441.348 754.699 438.02
 755.949 434.203 755.949 c 430.539 755.949 426.871 754.629 423.203 751.988
 c 418.07 748.172 410.809 742.086 401.422 733.727 c 391.445 725.07 386.02
 720.375 385.141 719.645 c 385.141 746.047 l 385.141 749.422 383.672 752.207
 380.738 754.406 c 377.805 756.609 374.137 757.707 369.738 757.707 c h
572.996 672.34 m 576.516 686.859 578.277 710.477 578.277 743.188 c 578.277
 746.707 576.738 749.566 573.656 751.766 c 570.574 753.969 566.836 755.066
 562.434 755.066 c 557.887 755.066 554.074 753.895 550.992 751.547 c 547.914
 749.199 546.371 745.898 546.371 741.645 c 546.371 723.605 546.195 709.594
 545.844 699.621 c 545.465 689.648 544.539 681.578 543.074 675.418 c 542.047
 671.312 540.504 668.625 538.453 667.367 c 536.398 666.133 534.125 665.516
 531.633 665.516 c 523.562 665.516 517.625 668.555 513.809 674.625 c 509.996
 680.727 508.09 688.691 508.09 698.52 c 508.09 743.848 l 508.09 747.074 
506.547 749.742 503.469 751.855 c 500.387 753.996 496.648 755.066 492.246
 755.066 c 487.848 755.066 484.105 753.969 481.027 751.766 c 477.945 749.566
 476.406 746.852 476.406 743.625 c 476.406 715.461 476.773 687.445 477.504
 659.578 c 477.797 649.16 478.531 633.172 479.707 611.609 c 480.586 595.988
 l 480.879 592.176 482.418 589.051 485.207 586.617 c 487.992 584.211 491.734
 583.008 496.426 583.008 c 500.973 583.008 504.566 584.109 507.207 586.309
 c 509.848 588.508 511.094 591.441 510.949 595.109 c 509.777 612.418 508.75
 631.121 507.867 651.215 c 511.242 648.137 515.422 645.672 520.41 643.824
 c 525.398 642.004 531.043 641.094 537.352 641.094 c 547.18 641.094 554.926
 643.617 560.586 648.664 c 566.219 653.738 570.355 661.629 572.996 672.34
 c h
704.57 731.523 m 707.359 731.965 709.516 732.992 711.039 734.605 c 712.594
 736.219 713.371 739.078 713.371 743.188 c 713.371 746.707 712.461 749.715
 710.645 752.207 c 708.797 754.699 706.332 755.949 703.25 755.949 c 696.941
 755.949 692.102 755.172 688.73 753.613 c 685.355 752.09 682.273 749.273
 679.488 745.168 c 676.262 750.008 671.859 753.41 666.285 755.375 c 660.711
 757.371 654.184 758.367 646.703 758.367 c 630.129 758.367 617.516 753.602
 608.859 744.066 c 600.207 734.531 595.879 721.258 595.879 704.242 c 595.879
 693.094 598.152 683.191 602.699 674.539 c 607.246 665.883 613.598 659.137
 621.754 654.297 c 629.879 649.457 639.223 647.035 649.785 647.035 c 655.066
 647.035 659.98 648.062 664.527 650.117 c 669.074 652.168 672.52 654.883
 674.867 658.258 c 675.309 655.395 l 675.602 653.344 676.773 651.613 678.828
 650.203 c 680.883 648.824 684.109 648.137 688.508 648.137 c 693.203 648.137
 696.648 649.09 698.852 650.996 c 701.051 652.902 702.152 655.324 702.152
 658.258 c 702.152 659.281 702.078 660.09 701.93 660.676 c 701.051 665.664
 700.172 674.023 699.289 685.758 c 698.852 691.188 698.629 698.152 698.629
 706.66 c 698.629 717.664 l 698.629 721.918 698.996 725.172 699.73 727.434
 c 700.465 729.719 702.078 731.086 704.57 731.523 c h
667.828 716.344 m 667.973 710.328 668.047 701.016 668.047 688.398 c 668.047
 683.414 666.402 679.336 663.117 676.168 c 659.805 673.027 655.578 671.457
 650.445 671.457 c 643.844 671.457 638.418 674.496 634.164 680.566 c 629.91
 686.668 627.781 694.488 627.781 704.023 c 627.781 713.117 629.688 720.375
 633.504 725.805 c 637.316 731.23 642.449 733.945 648.906 733.945 c 654.918
 733.945 659.539 732.434 662.766 729.414 c 665.992 726.422 667.68 722.062
 667.828 716.344 c h
839.668 731.523 m 842.453 731.965 844.609 732.992 846.137 734.605 c 847.691
 736.219 848.469 739.078 848.469 743.188 c 848.469 746.707 847.543 749.715
 845.695 752.207 c 843.875 754.699 841.426 755.949 838.348 755.949 c 832.039
 755.949 827.199 755.172 823.824 753.613 c 820.449 752.09 817.371 749.273
 814.582 745.168 c 811.355 750.008 806.957 753.41 801.383 755.375 c 795.809
 757.371 789.281 758.367 781.801 758.367 c 765.223 758.367 752.609 753.602
 743.957 744.066 c 735.301 734.531 730.973 721.258 730.973 704.242 c 730.973
 693.094 733.246 683.191 737.793 674.539 c 742.344 665.883 748.68 659.137
 756.805 654.297 c 764.961 649.457 774.32 647.035 784.879 647.035 c 790.16
 647.035 795.074 648.062 799.621 650.117 c 804.168 652.168 807.617 654.883
 809.961 658.258 c 810.402 655.395 l 810.695 653.344 811.871 651.613 813.922
 650.203 c 815.977 648.824 819.203 648.137 823.605 648.137 c 828.297 648.137
 831.746 649.09 833.945 650.996 c 836.145 652.902 837.246 655.324 837.246
 658.258 c 837.246 659.281 837.172 660.09 837.027 660.676 c 836.145 665.664
 835.266 674.023 834.387 685.758 c 833.945 691.188 833.727 698.152 833.727
 706.66 c 833.727 717.664 l 833.727 721.918 834.094 725.172 834.824 727.434
 c 835.559 729.719 837.172 731.086 839.668 731.523 c h
802.922 716.344 m 803.07 710.328 803.141 701.016 803.141 688.398 c 803.141
 683.414 801.484 679.336 798.168 676.168 c 794.883 673.027 790.676 671.457
 785.539 671.457 c 778.938 671.457 773.512 674.496 769.258 680.566 c 765.004
 686.668 762.879 694.488 762.879 704.023 c 762.879 713.117 764.785 720.375
 768.598 725.805 c 772.41 731.23 777.547 733.945 784 733.945 c 790.016 733.945
 794.633 732.434 797.863 729.414 c 801.09 726.422 802.773 722.062 802.922
 716.344 c h
802.922 716.344 m f
Q q
380.07 242.258 240.238 242.141 re W n
1 g
615.488 393.82 m 607.383 393.82 l 607.383 275.906 l 607.371 268.305 601.203
 262.148 593.602 262.148 c 504.523 262.148 l 504.523 246.945 l 504.523 244.242
 502.332 242.051 499.625 242.051 c 496.922 242.051 494.73 244.242 494.73
 246.945 c 494.73 262.148 l 405.652 262.148 l 398.055 262.148 391.895 268.309
 391.895 275.906 c 391.895 393.82 l 384.965 393.82 l 382.262 393.82 380.07
 396.012 380.07 398.719 c 380.07 401.422 382.262 403.613 384.965 403.613
 c 448.344 403.613 l 420.191 477.762 l 419.23 480.289 420.504 483.117 423.031
 484.074 c 425.559 485.035 428.387 483.766 429.348 481.238 c 458.82 403.613
 l 494.73 403.613 l 494.73 450.125 l 494.73 452.828 496.922 455.02 499.625
 455.02 c 502.332 455.02 504.523 452.828 504.523 450.125 c 504.523 403.613
 l 546.137 403.613 l 575.512 481.359 l 576.289 483.254 578.164 484.465 580.211
 484.395 c 580.805 484.398 581.395 484.289 581.949 484.074 c 584.48 483.117
 585.75 480.289 584.789 477.762 c 556.664 403.613 l 615.414 403.613 l 618.117
 403.613 620.309 401.422 620.309 398.719 c 620.309 396.012 618.117 393.82
 615.414 393.82 c h
597.594 393.82 m 584.152 393.82 l 584.152 380.625 l 542.785 380.625 l 542.785
 393.82 l 401.684 393.82 l 401.684 275.906 l 401.699 273.719 403.465 271.953
 405.652 271.938 c 593.602 271.938 l 595.797 271.938 597.578 273.711 597.594
 275.906 c h
597.594 393.82 m f
Q q
1 g
634.398 466.82 48.203 15.816 re f
317.777 466.82 48.203 15.816 re f
Q Q
showpage
%%Trailer
end
%%EOF
