module github.com/tomerop

require (
	github.com/Microsoft/go-winio v0.4.14 // indirect
	github.com/Nvveen/Gotty v0.0.0-20120604004816-cd527374f1e5 // indirect
	github.com/containerd/continuity v0.0.0-20190827140505-75bee3e2ccb6 // indirect
	github.com/docker/go-connections v0.4.0 // indirect
	github.com/docker/go-units v0.4.0 // indirect
	github.com/go-logr/logr v0.1.0
	github.com/go-openapi/spec v0.19.0
	github.com/opencontainers/image-spec v1.0.1 // indirect
	github.com/opencontainers/runc v0.1.1 // indirect
	github.com/openshift/api v3.9.0+incompatible
	github.com/openshift/source-to-image v1.2.0 // indirect
	github.com/operator-framework/operator-sdk v0.12.1-0.20191109110800-382cac373ab2
	github.com/spf13/pflag v1.0.3
	k8s.io/api v0.0.0-20190612125737-db0771252981
	k8s.io/apimachinery v0.0.0-20190612125636-6a5db36e93ad
	k8s.io/client-go v11.0.0+incompatible
	k8s.io/kube-openapi v0.0.0-20190603182131-db7b694dc208
	sigs.k8s.io/controller-runtime v0.1.12
	sigs.k8s.io/controller-tools v0.1.10
)

// Pinned to kubernetes-1.13.4
replace (
	k8s.io/api => k8s.io/api v0.0.0-20190222213804-5cb15d344471
	k8s.io/apiextensions-apiserver => k8s.io/apiextensions-apiserver v0.0.0-20190228180357-d002e88f6236
	k8s.io/apimachinery => k8s.io/apimachinery v0.0.0-20190221213512-86fb29eff628
	k8s.io/client-go => k8s.io/client-go v0.0.0-20190228174230-b40b2a5939e4
)

replace (
	github.com/coreos/prometheus-operator => github.com/coreos/prometheus-operator v0.29.0
	// Pinned to v2.9.2 (kubernetes-1.13.1) so https://proxy.golang.org can
	// resolve it correctly.
	github.com/prometheus/prometheus => github.com/prometheus/prometheus v1.8.2-0.20190424153033-d3245f150225
	k8s.io/kube-state-metrics => k8s.io/kube-state-metrics v1.6.0
	sigs.k8s.io/controller-runtime => sigs.k8s.io/controller-runtime v0.1.12
	sigs.k8s.io/controller-tools => sigs.k8s.io/controller-tools v0.1.11-0.20190411181648-9d55346c2bde
)

replace github.com/operator-framework/operator-sdk => github.com/operator-framework/operator-sdk v0.10.0

go 1.13
