{
    "$schema": "http://json-schema.org/draft-07/schema#",
    "title": "Assets",
    "type": "object",
    "properties": {
        "file_prefix": {
            "type": "string"
        },
        "atlas": {
            "type" : "object",
            "properties": {
                "tiles_per_row": {
                    "type": "integer",
                    "minimum": 1
                },
                "tile_width": {
                    "type": "integer",
                    "minimum": 1
                }
            },
            "required": [
                "tiles_per_row",
                "tile_width"
            ]
        },
        "tiles": {
            "type": "array",
            "minItems": 1,
            "items": 
                {
                    "type": "object",
                    "properties": {
                        "index": {
                            "type": "integer",
                            "minimum": 1
                        },
                        "name": {
                            "type": "string"
                        },
                        "transparent": {
                            "type": "boolean",
                            "default": false
                        },
                        "sides": {
                            "type": "array",
                            "minItems": 1,
                            "maxItems": 6,
                            "items": {
                                "type": "object",
                                "properties": {
                                    "file_name": {
                                        "type": "string"
                                    },
                                    "rotate": {
                                        "type": "integer",
                                        "enum": [0, 1, 2, 3],
                                        "default": 0
                                    },
                                    "mirror": {
                                        "type": "boolean",
                                        "default": false
                                    }
                                },
                                "required": [
                                    "file_name"
                                ]
                            }
                        }
                    },
                    "required": [
                        "index",
                        "name",
                        "sides"
                    ]
                }
            ,
            "additionalItems": false
        }
    },
    "required": [
        "atlas",
        "tiles",
        "file_prefix"
    ]
}
