{
  "$schema": "./voxels.schema.json",
  "comments": [
    "side: 0,1,2,3,4,5 (-x,+x,-y,+y,-z,+z)",
    "rotate: clockwise 0 -> 0°, 1 -> 90°, 2 -> 180°, 3 -> 270°",
    "mirror: false -> no, true -> yes (basically flip on x-axis)",
    "order of operations: 1. perform mirror, 2. perform rotate"
  ],
  "atlas": {
    "tiles_per_row": 8,
    "tile_width": 128
  },
  "file_prefix": "textures/voxel-pack/PNG/Tiles/",
  "voxels": [
    {
      "index": 1,
      "name": "redstone",
      "sides": [
        { "file_name": "redstone.png", "rotate": 0, "mirror": false },
        { "file_name": "redstone.png", "rotate": 0, "mirror": false },
        { "file_name": "redstone.png", "rotate": 0, "mirror": false },
        { "file_name": "redstone.png", "rotate": 0, "mirror": false },
        { "file_name": "redstone.png", "rotate": 0, "mirror": false },
        { "file_name": "redstone.png", "rotate": 0, "mirror": false }
      ]
    },
    {
      "index": 2,
      "name": "stone",
      "sides": [
        { "file_name": "stone.png", "rotate": 0, "mirror": false },
        { "file_name": "stone.png", "rotate": 0, "mirror": false },
        { "file_name": "stone.png", "rotate": 0, "mirror": false },
        { "file_name": "stone.png", "rotate": 0, "mirror": false },
        { "file_name": "stone.png", "rotate": 0, "mirror": false },
        { "file_name": "stone.png", "rotate": 0, "mirror": false }
      ]
    },
    {
      "index": 3,
      "name": "greysand",
      "sides": [
        { "file_name": "greysand.png", "rotate": 0, "mirror": false },
        { "file_name": "greysand.png", "rotate": 0, "mirror": false },
        { "file_name": "greysand.png", "rotate": 0, "mirror": false },
        { "file_name": "greysand.png", "rotate": 0, "mirror": false },
        { "file_name": "greysand.png", "rotate": 0, "mirror": false },
        { "file_name": "greysand.png", "rotate": 0, "mirror": false }
      ]
    },
    {
      "index": 4,
      "name": "dirt_grass",
      "sides": [
        { "file_name": "dirt_grass.png", "rotate": 0, "mirror": false },
        { "file_name": "dirt_grass.png", "rotate": 0, "mirror": false },
        { "file_name": "dirt.png",       "rotate": 0, "mirror": false },
        { "file_name": "grass_top.png",  "rotate": 0, "mirror": false },
        { "file_name": "dirt_grass.png", "rotate": 0, "mirror": false },
        { "file_name": "dirt_grass.png", "rotate": 0, "mirror": false }
      ]
    },
    {
      "index": 5,
      "name": "snow",
      "sides": [
        { "file_name": "dirt_snow.png", "rotate": 0, "mirror": false },
        { "file_name": "dirt_snow.png", "rotate": 0, "mirror": false },
        { "file_name": "dirt.png",      "rotate": 0, "mirror": false },
        { "file_name": "snow.png",      "rotate": 0, "mirror": false },
        { "file_name": "dirt_snow.png", "rotate": 0, "mirror": false },
        { "file_name": "dirt_snow.png", "rotate": 0, "mirror": false }
      ]
    },
    {
      "index": 6,
      "name": "dirt_sand",
      "sides": [
        { "file_name": "dirt_sand.png", "rotate": 0, "mirror": false },
        { "file_name": "dirt_sand.png", "rotate": 0, "mirror": false },
        { "file_name": "dirt.png",      "rotate": 0, "mirror": false },
        { "file_name": "sand.png",      "rotate": 0, "mirror": false },
        { "file_name": "dirt_sand.png", "rotate": 0, "mirror": false },
        { "file_name": "dirt_sand.png", "rotate": 0, "mirror": false }
      ]
    },
    {
      "index": 7,
      "name": "leaves",
      "sides": [
        { "file_name": "leaves.png", "rotate": 0, "mirror": false },
        { "file_name": "leaves.png", "rotate": 0, "mirror": false },
        { "file_name": "leaves.png", "rotate": 0, "mirror": false },
        { "file_name": "leaves.png", "rotate": 0, "mirror": false },
        { "file_name": "leaves.png", "rotate": 0, "mirror": false },
        { "file_name": "leaves.png", "rotate": 0, "mirror": false }
      ]
    },
    {
      "index": 8,
      "name": "leaves_orange",
      "sides": [
        { "file_name": "leaves_orange.png", "rotate": 0, "mirror": false },
        { "file_name": "leaves_orange.png", "rotate": 0, "mirror": false },
        { "file_name": "leaves_orange.png", "rotate": 0, "mirror": false },
        { "file_name": "leaves_orange.png", "rotate": 0, "mirror": false },
        { "file_name": "leaves_orange.png", "rotate": 0, "mirror": false },
        { "file_name": "leaves_orange.png", "rotate": 0, "mirror": false }
      ]
    },
    {
      "index": 9,
      "name": "leaves_transparent",
      "transparent": true,
      "sides": [
        { "file_name": "leaves_transparent.png", "rotate": 0, "mirror": false },
        { "file_name": "leaves_transparent.png", "rotate": 0, "mirror": false },
        { "file_name": "leaves_transparent.png", "rotate": 0, "mirror": false },
        { "file_name": "leaves_transparent.png", "rotate": 0, "mirror": false },
        { "file_name": "leaves_transparent.png", "rotate": 0, "mirror": false },
        { "file_name": "leaves_transparent.png", "rotate": 0, "mirror": false }
      ]
    },
    {
      "index": 10,
      "name": "leaves_orange_transparent",
      "transparent": true,
      "sides": [
        { "file_name": "leaves_orange_transparent.png", "rotate": 0, "mirror": false },
        { "file_name": "leaves_orange_transparent.png", "rotate": 0, "mirror": false },
        { "file_name": "leaves_orange_transparent.png", "rotate": 0, "mirror": false },
        { "file_name": "leaves_orange_transparent.png", "rotate": 0, "mirror": false },
        { "file_name": "leaves_orange_transparent.png", "rotate": 0, "mirror": false },
        { "file_name": "leaves_orange_transparent.png", "rotate": 0, "mirror": false }
      ]
    },
    {
      "index": 11,
      "name": "lava",
      "sides": [
        { "file_name": "lava.png", "rotate": 0, "mirror": false },
        { "file_name": "lava.png", "rotate": 0, "mirror": false },
        { "file_name": "lava.png", "rotate": 0, "mirror": false },
        { "file_name": "lava.png", "rotate": 0, "mirror": false },
        { "file_name": "lava.png", "rotate": 0, "mirror": false },
        { "file_name": "lava.png", "rotate": 0, "mirror": false }
      ]
    },
    {
      "index": 12,
      "name": "ice",
      "sides": [
        { "file_name": "ice.png", "rotate": 0, "mirror": false },
        { "file_name": "ice.png", "rotate": 0, "mirror": false },
        { "file_name": "ice.png", "rotate": 0, "mirror": false },
        { "file_name": "ice.png", "rotate": 0, "mirror": false },
        { "file_name": "ice.png", "rotate": 0, "mirror": false },
        { "file_name": "ice.png", "rotate": 0, "mirror": false }
      ]
    },
    {
      "index": 13,
      "name": "trunk",
      "sides": [
        { "file_name": "trunk_side.png", "rotate": 0, "mirror": false },
        { "file_name": "trunk_side.png", "rotate": 0, "mirror": false },
        { "file_name": "trunk_top.png", "rotate": 0, "mirror": false },
        { "file_name": "trunk_top.png", "rotate": 0, "mirror": false },
        { "file_name": "trunk_side.png", "rotate": 0, "mirror": false },
        { "file_name": "trunk_side.png", "rotate": 0, "mirror": false }
      ]
    },
    {
      "index": 14,
      "name": "trunk_white",
      "sides": [
        { "file_name": "trunk_white_side.png", "rotate": 0, "mirror": false },
        { "file_name": "trunk_white_side.png", "rotate": 0, "mirror": false },
        { "file_name": "trunk_white_top.png",  "rotate": 0, "mirror": false },
        { "file_name": "trunk_white_top.png",  "rotate": 0, "mirror": false },
        { "file_name": "trunk_white_side.png", "rotate": 0, "mirror": false },
        { "file_name": "trunk_white_side.png", "rotate": 0, "mirror": false }
      ]
    },
    {
      "index": 15,
      "name": "greystone",
      "sides": [
        { "file_name": "greystone.png", "rotate": 0, "mirror": false },
        { "file_name": "greystone.png", "rotate": 0, "mirror": false },
        { "file_name": "greystone.png", "rotate": 0, "mirror": false },
        { "file_name": "greystone.png", "rotate": 0, "mirror": false },
        { "file_name": "greystone.png", "rotate": 0, "mirror": false },
        { "file_name": "greystone.png", "rotate": 0, "mirror": false }
      ]
    },
    {
      "index": 16,
      "name": "cotton_blue",
      "sides": [ { "file_name": "cotton_blue.png" } ]
    },
    {
      "index": 17,
      "name": "cotton_green",
      "sides": [ { "file_name": "cotton_green.png" } ]
    },
    {
      "index": 18,
      "name": "cotton_red",
      "sides": [ { "file_name": "cotton_red.png" } ]
    },
    {
      "index": 19,
      "name": "cotton_tan",
      "sides": [ { "file_name": "cotton_tan.png" } ]
    }
  ]
}
