{
  "$schema": "./voxels.schema.json",
  "comments": [
    "side: 0,1,2,3,4,5 (-x,+x,-y,+y,-z,+z)",
    "rotate: clockwise 0 -> 0°, 1 -> 90°, 2 -> 180°, 3 -> 270°",
    "mirror: false -> no, true -> yes (basically flip on x-axis)",
    "order of operations: 1. perform mirror, 2. perform rotate"
  ],
  "atlas": {
    "tiles_per_row": 8,
    "tile_width": 128
  },
  "file_prefix": "textures/",
  "voxels": [
    {
      "index": 1,
      "name": "demo_voxel",
      "sides": [ { "file_name": "demo_voxel.png" } ]
    }
  ]
}
