{
	"id": "e15dc924-ba6f-4a24-a0fc-caac106c05d0",
	"name": "Projekt",
	"values": [
		{
			"key": "url",
			"value": "automationexercise.com",
			"type": "default",
			"enabled": true
		},
		{
			"key": "Zmienna",
			"value": "",
			"type": "any",
			"enabled": true
		},
		{
			"key": "Licznik = ",
			"value": "",
			"type": "any",
			"enabled": true
		},
		{
			"key": "NewUserEmail",
			"value": "NewUser@wp.pl",
			"type": "default",
			"enabled": true
		},
		{
			"key": "NewUserName",
			"value": "NewUser",
			"type": "default",
			"enabled": true
		},
		{
			"key": "NewUserPass",
			"value": "ala",
			"type": "default",
			"enabled": true
		}
	],
	"_postman_variable_scope": "environment",
	"_postman_exported_at": "2023-10-06T19:28:52.444Z",
	"_postman_exported_using": "Postman/10.18.11"
}