{
  "staging_gitlab_com_a": {
    "geo.staging.gitlab.com.": {
      "records": [
        "35.237.177.172"
      ],
      "ttl": 300
    },
    "shared-runners-manager-3.staging.gitlab.com.": {
      "records": [
        "35.229.49.100"
      ],
      "ttl": 300
    },
    "shared-runners-manager-4.staging.gitlab.com.": {
      "records": [
        "35.227.21.133"
      ],
      "ttl": 300
    }
  },
  "staging_gitlab_com_caa": {
  },
  "staging_gitlab_com_mx": {
    "mg.staging.gitlab.com.": {
      "records": [
        {"prio": 10, "value": "mxa.mailgun.org"},
        {"prio": 11, "value": "mxb.mailgun.org"}
      ],
      "ttl": 300
    }
  },
  "staging_gitlab_com_ns": {
  },
  "staging_gitlab_com_soa": {
    "staging.gitlab.com.": {
      "records": [
        "arya.ns.cloudflare.com. dns.cloudflare.com. 2032662372 10000 2400 604800 3600"
      ],
      "ttl": 900
    }
  },
  "staging_gitlab_com_txt": {
    "cloudflare-verify.staging.gitlab.com.": {
      "records": [
        "311625245-149055598"
      ],
      "ttl": 300
    },
    "mg.staging.gitlab.com.": {
      "records": [
        "v=spf1 include:mailgun.org ~all"
      ],
      "ttl": 300
    },
    "mx._domainkey.mg.staging.gitlab.com.": {
      "records": [
        "k=rsa; p=MIGfMA0GCSqGSIb3DQEBAQUAA4GNADCBiQKBgQDCKEkBo5boIOe2freSiYXoPAHmx4McTiasXy2g9pfspIzTCZhqAEMRgQzSa6kyPifP3V41dvVE0ZaQy/9cax25n3B3sSWEdabzYTlObatB8yalIuhtu7ka0MBZtu2FVhlAOsLAoto+2xUL8ztYVUMs5AAMLfTHibmZE784GYCilwIDAQAB"
      ],
      "ttl": 300
    },
    "_gitlab-pages-verification-code.next.staging.gitlab.com.": {
      "records": [
        "gitlab-pages-verification-code=78f9b3872b654f8f80d2a7d8848ccc20"
      ],
      "ttl": 300
    }
  },
  "staging_gitlab_com_cname": {
    "177e082c7d4e349aeee8f5eb8975df2e.staging.gitlab.com.": {
      "records": [
        "3fb3d16754400ae72d482fc68c1caa03d70a163a.comodoca.com."
      ],
      "ttl": 5
    },
    "*.about-src.staging.gitlab.com.": {
      "records": [
        "about-src.staging.gitlab.com."
      ],
      "ttl": 300
    },
    "about.staging.gitlab.com.": {
      "records": [
        "m2.shared.global.fastly.net"
      ],
      "ttl": 300
    },
    "api-internal.staging.gitlab.com.": {
      "records": [
        "backend01.lb.stg.gitlab.com."
      ],
      "ttl": 300
    },
    "auth.staging.gitlab.com.": {
      "records": [
        "staging.gitlab.com"
      ],
      "ttl": 300
    },
    "email.mg.staging.gitlab.com.": {
      "records": [
        "mailgun.org"
      ],
      "ttl": 300
    },
    "next.staging.gitlab.com.": {
      "records": [
        "gitlab-com.staging.gitlab.io."
      ],
      "ttl": 300
    }
  },
  "staging_gitlab_com_aaaa": {
  }
}
