----------------------
Ikony flag:
----------------------
License: Freeware
linki:
http://www.iconarchive.com/show/flag-icons-by-gosquared.10.html
lub
https://www.gosquared.com/resources/2400-flags

-----------------------
Ikony: add_database, console, inne
-----------------------
Link: https://icons8.com