{
    "sources": [
        {
            "author": [
                {
                    "family": "Ozsoyoglu",
                    "given": "Gultekin"
                },
                {
                    "family": "Chung",
                    "given": "JiYong"
                }
            ],
            "container-title": "1986 IEEE second international conference on data engineering",
            "id": "ozsoyoglu1986information",
            "issued": {
                "date-parts": [
                    [
                        1986
                    ]
                ]
            },
            "page": "75-83",
            "publisher": "IEEE",
            "title": "Information loss in the lattice model of summary tables due to cell suppression",
            "type": "paper-conference"
        },
        {
            "URL": "https://scholar.google.it/scholar?oi=bibs&cluster=9220555753877121103&btnI=1&hl=it)",
            "author": [
                {
                    "family": "De Waal",
                    "given": "AG"
                },
                {
                    "family": "Willenborg",
                    "given": "Leon CRJ"
                }
            ],
            "container-title": "Journal of Official Statistics",
            "id": "de1998optimal",
            "issue": "4",
            "issued": {
                "date-parts": [
                    [
                        1998
                    ]
                ]
            },
            "page": "421",
            "publisher": "Statistics Sweden (SCB)",
            "title": "Optimal local suppression in microdata",
            "type": "article-journal",
            "volume": "14"
        },
        {
            "author": [
                {
                    "family": "Hundepool",
                    "given": "Anco"
                },
                {
                    "family": "Domingo-Ferrer",
                    "given": "Josep"
                },
                {
                    "family": "Franconi",
                    "given": "Luisa"
                },
                {
                    "family": "Giessing",
                    "given": "Sarah"
                },
                {
                    "family": "Nordholt",
                    "given": "Eric Schulte"
                },
                {
                    "family": "Spicer",
                    "given": "Keith"
                },
                {
                    "family": "De Wolf",
                    "given": "Peter-Paul"
                }
            ],
            "id": "hundepool2012statistical",
            "issued": {
                "date-parts": [
                    [
                        2012
                    ]
                ]
            },
            "publisher": "John Wiley & Sons",
            "title": "Statistical disclosure control",
            "type": "book"
        },
        {
            "URL": "https://ec.europa.eu/eurostat/documents/3217494/5652105/KS-CR-03-004-1-EN.PDF.pdf/81a84bca-0189-4c94-a690-73923623d210?t=1414771516000",
            "author": [
                {
                    "family": "Shlomo",
                    "given": "Natalie"
                },
                {
                    "family": "Young",
                    "given": "Caroline"
                }
            ],
            "container-title": "Monographs of official statistics – work session on statistical data confidentiality, geneva, 9–11 november 2005",
            "id": "shlomo2006information",
            "issued": {
                "date-parts": [
                    [
                        2006
                    ]
                ]
            },
            "page": "277-289",
            "publisher": "Office for Official Publications of the European Communities",
            "title": "Information loss measures for frequency tables",
            "type": "paper-conference"
        },
        {
            "author": [
                {
                    "family": "Domingo-Ferrer",
                    "given": "Josep"
                },
                {
                    "family": "Mateo-Sanz",
                    "given": "Josep M"
                },
                {
                    "family": "Torra",
                    "given": "Vincenc"
                }
            ],
            "container-title": "Pre-proceedings of ETK-NTTS",
            "id": "domingo2001comparing",
            "issued": {
                "date-parts": [
                    [
                        2001
                    ]
                ]
            },
            "page": "807-826",
            "title": "Comparing SDC methods for microdata on the basis of information loss and disclosure risk",
            "type": "paper-conference",
            "volume": "2"
        },
        {
            "author": [
                {
                    "family": "Młodak",
                    "given": "Andrzej"
                }
            ],
            "container-title": "Wiadomości Statystyczne. The Polish Statistician",
            "id": "mlodak2020strata",
            "issue": "09",
            "issued": {
                "date-parts": [
                    [
                        2020
                    ]
                ]
            },
            "page": "7-27",
            "publisher": "Główny Urząd Statystyczny",
            "title": "Strata informacji wskutek przeprowadzenia kontroli ujawniania danych wynikowych",
            "type": "article-journal",
            "volume": "65"
        },
        {
            "author": [
                {
                    "family": "Młodak",
                    "given": "Andrzej"
                }
            ],
            "container-title": "Przegląd Statystyczny",
            "id": "mlodak2019wykorzystanie",
            "issue": "1",
            "issued": {
                "date-parts": [
                    [
                        2019
                    ]
                ]
            },
            "page": "7-26",
            "publisher": "Główny Urząd Statystyczny",
            "title": "Wykorzystanie miernika kompleksowego w ocenie straty informacji na skutek kontroli ujawniania mikrodanych",
            "type": "article-journal",
            "volume": "66"
        },
        {
            "author": [
                {
                    "family": "Młodak",
                    "given": "Andrzej"
                },
                {
                    "family": "Pietrzak",
                    "given": "Michał"
                },
                {
                    "family": "Klimanek",
                    "given": "Tomasz"
                },
                {
                    "family": "Józefowski",
                    "given": "Tomasz"
                },
                {
                    "family": "Lańduch",
                    "given": "Paweł"
                }
            ],
            "id": "mlodak2023poufnosc",
            "issued": {
                "date-parts": [
                    [
                        2023
                    ]
                ]
            },
            "publisher": "Wydawnictwo Uniwersytetu Ekonomicznego w Poznaniu",
            "title": "Poufność a użyteczność informacji statystycznych. Dylematy ochrony udostępnianych danych",
            "type": ""
        },
        {
            "author": [
                {
                    "family": "Młodak",
                    "given": "Andrzej"
                },
                {
                    "family": "Pietrzak",
                    "given": "Michał"
                },
                {
                    "family": "Józefowski",
                    "given": "Tomasz"
                }
            ],
            "container-title": "Statistical Journal of the IAOS",
            "id": "mlodak2022trade",
            "issue": "4",
            "issued": {
                "date-parts": [
                    [
                        2022
                    ]
                ]
            },
            "page": "1503-1511",
            "publisher": "IOS Press",
            "title": "The trade-off between the risk of disclosure and data utility in SDC: A case of data from a survey of accidents at work 1",
            "title-short": "The trade-off between the risk of disclosure and data utility in SDC",
            "type": "article-journal",
            "volume": "38"
        },
        {
            "author": [
                {
                    "family": "Templ",
                    "given": "Matthias"
                },
                {
                    "family": "Kowarik",
                    "given": "Alexander"
                },
                {
                    "family": "Meindl",
                    "given": "Bernhard"
                }
            ],
            "container-title": "Journal of Statistical Software",
            "id": "templ2015statistical",
            "issued": {
                "date-parts": [
                    [
                        2015
                    ]
                ]
            },
            "page": "1-36",
            "title": "Statistical disclosure control for micro-data using the r package sdcMicro",
            "type": "article-journal",
            "volume": "67"
        }
    ],
    "project_biblios": []
}