{
  "hash": "57a9f836e972fbe9fb6d0ab7edf3b2f8",
  "result": {
    "engine": "knitr",
    "markdown": "---\ntitle: \"check\"\n---\n\n::: {.cell}\n\n```{.r .cell-code}\nlibrary(knitr)\ndt1 <- data.frame(\"Obszar\" = c(\"A\"), \n                  \"Pracujący w A\" = c(87),\n                  \"Mieszkańcy\" = c(232),\n                  \"Pracujący i mieszkający\" = c(69),\n                  check.names = FALSE)\n```\n:::\n\n::: {#tbl-cars .cell tbl-cap='Cars' tbl-colwidths='[60,40]'}\n\n```{.r .cell-code}\nkable(head(dt1))\n```\n\n::: {.cell-output-display}\n\n\n|Obszar | Pracujący w A| Mieszkańcy| Pracujący i mieszkający|\n|:------|-------------:|----------:|-----------------------:|\n|A      |            87|        232|                      69|\n\n\n:::\n:::",
    "supporting": [
      "check_files"
    ],
    "filters": [
      "rmarkdown/pagebreak.lua"
    ],
    "includes": {},
    "engineDependencies": {},
    "preserve": {},
    "postProcess": true
  }
}