\relax 
\providecommand\hyper@newdestlabel[2]{}
\providecommand\HyperFirstAtBeginDocument{\AtBeginDocument}
\HyperFirstAtBeginDocument{\ifx\hyper@anchor\@undefined
\global\let\oldcontentsline\contentsline
\gdef\contentsline#1#2#3#4{\oldcontentsline{#1}{#2}{#3}}
\global\let\oldnewlabel\newlabel
\gdef\newlabel#1#2{\newlabelxx{#1}#2}
\gdef\newlabelxx#1#2#3#4#5#6{\oldnewlabel{#1}{{#2}{#3}}}
\AtEndDocument{\ifx\hyper@anchor\@undefined
\let\contentsline\oldcontentsline
\let\newlabel\oldnewlabel
\fi}
\fi}
\global\let\hyper@last\relax 
\gdef\HyperFirstAtBeginDocument#1{#1}
\providecommand\HyField@AuxAddToFields[1]{}
\providecommand\HyField@AuxAddToCoFields[2]{}
\@writefile{toc}{\contentsline {section}{\numberline {1}Excercise 1}{1}{section.1}}
\@writefile{toc}{\contentsline {subsection}{\numberline {1.1}Design a many-valued logic with truth values at least $\mathfrak  {t}, \mathfrak  {f}, \mathfrak  {u}$}{1}{subsection.1.1}}
\@writefile{toc}{\contentsline {subsubsection}{\numberline {1.1.1}Specify the set $\mathfrak  {T}$ of truth values and $\mathfrak  {D}$ of designated truth values}{1}{subsubsection.1.1.1}}
\@writefile{toc}{\contentsline {subsubsection}{\numberline {1.1.2}Show how can the values from worlds in $\mathcal  {W}$ be mapped to $\mathcal  {T}$ and $\mathcal  {D}$}{1}{subsubsection.1.1.2}}
\@writefile{toc}{\contentsline {subsubsection}{\numberline {1.1.3}Provide truth values for $\lnot , \land , \lor , \rightarrow $}{1}{subsubsection.1.1.3}}
\@writefile{toc}{\contentsline {subsection}{\numberline {1.2}Provide signed tableaux for your logic}{1}{subsection.1.2}}
\@writefile{toc}{\contentsline {subsubsection}{\numberline {1.2.1}Negation}{1}{subsubsection.1.2.1}}
\@writefile{toc}{\contentsline {subsubsection}{\numberline {1.2.2}Conjunction}{1}{subsubsection.1.2.2}}
\@writefile{toc}{\contentsline {subsubsection}{\numberline {1.2.3}Disjunction}{2}{subsubsection.1.2.3}}
\@writefile{toc}{\contentsline {subsubsection}{\numberline {1.2.4}Implication}{2}{subsubsection.1.2.4}}
\@writefile{toc}{\contentsline {subsection}{\numberline {1.3}Use the tableaux rules to prove a tautology and to disprove an invalid formula of your choice. If there are no tautologies, please explain why.}{2}{subsection.1.3}}
\@writefile{toc}{\contentsline {subsection}{\numberline {1.4}Interpretation}{2}{subsection.1.4}}
\@writefile{toc}{\contentsline {section}{\numberline {2}Exercise 2}{2}{section.2}}
\@writefile{toc}{\contentsline {subsection}{\numberline {2.1}Describe informally the intended semantical structures (relating your solution to a particular chosen real-world context, in particular interpret worlds from $\mathcal  {W}$)}{2}{subsection.2.1}}
\@writefile{toc}{\contentsline {subsection}{\numberline {2.2}Provide an (informal) example where $\mathbb  {U}$ is not extensional}{3}{subsection.2.2}}
\@writefile{toc}{\contentsline {subsection}{\numberline {2.3}Formalize the structures selected in Point 4. (here point 1.) using Kripke-like semantics}{3}{subsection.2.3}}
\@writefile{toc}{\contentsline {subsection}{\numberline {2.4}Decide whether $\mathbb  {U}$ should be modelled by $\Box $ or $\Diamond $}{3}{subsection.2.4}}
\@writefile{toc}{\contentsline {subsection}{\numberline {2.5}Give the dual modality a meaningful name in the natural language}{3}{subsection.2.5}}
\@writefile{toc}{\contentsline {subsection}{\numberline {2.6}Discuss whether the axioms $D, T, 4$ and $B$ are valid under your semantics}{3}{subsection.2.6}}
\@writefile{toc}{\contentsline {subsubsection}{\numberline {2.6.1}D}{3}{subsubsection.2.6.1}}
\@writefile{toc}{\contentsline {subsubsection}{\numberline {2.6.2}T}{4}{subsubsection.2.6.2}}
\@writefile{toc}{\contentsline {subsubsection}{\numberline {2.6.3}4}{4}{subsubsection.2.6.3}}
\@writefile{toc}{\contentsline {subsubsection}{\numberline {2.6.4}B}{4}{subsubsection.2.6.4}}
\@writefile{toc}{\contentsline {section}{\numberline {3}Exercise 3}{4}{section.3}}
\@writefile{toc}{\contentsline {subsection}{\numberline {3.1}Design a \textsc  {Datalog}-like database (extensional plus intensional parts) with relations for storing information about observed objects including speed (slow, moderate, high), type (car, truck, motorbike, bicycle, ...) etc., containing, among others, information about connected objects.}{4}{subsection.3.1}}
\@writefile{toc}{\contentsline {subsection}{\numberline {3.2}Provide sample default rules for classifying an object to be a car.}{4}{subsection.3.2}}
\@writefile{toc}{\contentsline {subsection}{\numberline {3.3}Formulate queries}{5}{subsection.3.3}}
\@writefile{toc}{\contentsline {subsubsection}{\numberline {3.3.1}selecting all objects moving with a slow speed connected to a car}{5}{subsubsection.3.3.1}}
\@writefile{toc}{\contentsline {subsubsection}{\numberline {3.3.2}selecting all objects which are directly or indirectly connected to a given object, where we say that an object $Q$ is indirectly connected to an object $P$ if there is a natural number $n \geq 1$ and objects $O_1, ..., O_n$ such that $O_1 = P, O_n = Q$ and for all $1 < i \leq n$, $O_i$ is connected to $O_{i-1}$}{5}{subsubsection.3.3.2}}
\@writefile{toc}{\contentsline {subsection}{\numberline {3.4}Please discuss how logics designed in Exercises 1 and 2 could be used in queries}{5}{subsection.3.4}}
