likelihood:0.0605336276,itemset_size:5,f1:0.400000
likelihood:0.0074168947,itemset_size:40,f1:0.357143
likelihood:0.0060401967,itemset_size:40,f1:0.226415
likelihood:0.0007267139,itemset_size:55,f1:0.342105
likelihood:0.0325593910,itemset_size:22,f1:0.320000
likelihood:0.0005202341,itemset_size:57,f1:0.309524
likelihood:0.1146398340,itemset_size:13,f1:0.434783
likelihood:0.0404887976,itemset_size:23,f1:0.421053
likelihood:0.0073832920,itemset_size:39,f1:0.271186
likelihood:0.1449993601,itemset_size:12,f1:0.476190
likelihood:0.0019825277,itemset_size:49,f1:0.421053
likelihood:0.0094285265,itemset_size:32,f1:0.456140
likelihood:0.0050532136,itemset_size:43,f1:0.245614
likelihood:0.0062979899,itemset_size:41,f1:0.301887
likelihood:0.0145742340,itemset_size:35,f1:0.393443
likelihood:0.0053211815,itemset_size:42,f1:0.307692
likelihood:0.000749602,itemset_size:54,f1:0.372093
likelihood:0.0119588246,itemset_size:5,f1:0.461538
likelihood:0.0681955440,itemset_size:17,f1:0.533333
likelihood:0.0012865559,itemset_size:51,f1:0.278481
likelihood:0.0316704803,itemset_size:25,f1:0.380952
likelihood:0.0004667635,itemset_size:58,f1:0.320988
likelihood:0.0003993677,itemset_size:60,f1:0.259740
likelihood:0.0243171744,itemset_size:27,f1:0.333333
likelihood:0.0012728145,itemset_size:50,f1:0.237288
likelihood:0.0004298568,itemset_size:59,f1:0.333333
likelihood:0.0234179366,itemset_size:27,f1:0.400000
likelihood:0.0189662301,itemset_size:30,f1:0.436364
likelihood:0.0096862285,itemset_size:24,f1:0.564103
likelihood:0.0209979544,itemset_size:30,f1:0.470588
likelihood:0.1479331922,itemset_size:9,f1:0.434783
likelihood:0.0007031038,itemset_size:53,f1:0.197531
likelihood:0.0347365596,itemset_size:4,f1:0.307692
likelihood:0.0004756303,itemset_size:58,f1:0.348837
likelihood:0.0024493259,itemset_size:47,f1:0.333333
likelihood:0.0157243169,itemset_size:28,f1:0.478261
likelihood:0.0952952238,itemset_size:9,f1:0.555556
likelihood:0.0027424251,itemset_size:47,f1:0.329114
likelihood:0.019860691,itemset_size:32,f1:0.509804
likelihood:0.01959517,itemset_size:32,f1:0.367347
likelihood:0.0020795650,itemset_size:47,f1:0.270270
likelihood:0.0238728747,itemset_size:24,f1:0.410256
likelihood:0.0341034572,itemset_size:6,f1:0.571429
likelihood:0.0000042911,itemset_size:1,f1:0.142857
likelihood:0.001977929,itemset_size:47,f1:0.229508
likelihood:0.0016931363,itemset_size:49,f1:0.272727
likelihood:0.0000068500,itemset_size:2,f1:0.000000
likelihood:0.0011819170,itemset_size:50,f1:0.435897
likelihood:0.0326585580,itemset_size:25,f1:0.450000
likelihood:0.0122325453,itemset_size:37,f1:0.363636
likelihood:0.0079383227,itemset_size:39,f1:0.222222
likelihood:0.0762853707,itemset_size:18,f1:0.400000
likelihood:0.0000041155,itemset_size:1,f1:0.250000
likelihood:0.0009013559,itemset_size:53,f1:0.256410
likelihood:0.006486451,itemset_size:41,f1:0.262295
likelihood:0.001568790,itemset_size:49,f1:0.329114
likelihood:0.0268248521,itemset_size:31,f1:0.372093
likelihood:0.1811247340,itemset_size:8,f1:0.260870
likelihood:0.000663667,itemset_size:55,f1:0.289474
likelihood:0.0509849377,itemset_size:5,f1:0.400000
likelihood:0.0007618070,itemset_size:54,f1:0.253521
likelihood:0.0270744816,itemset_size:27,f1:0.380952
likelihood:0.0004248183,itemset_size:60,f1:0.243243
likelihood:0.0258645867,itemset_size:19,f1:0.421053
likelihood:0.0578619925,itemset_size:10,f1:0.421053
likelihood:0.0276572976,itemset_size:26,f1:0.425532
likelihood:0.0218691339,itemset_size:28,f1:0.372093
likelihood:0.0131635614,itemset_size:35,f1:0.385965
likelihood:0.00245721,itemset_size:45,f1:0.366667
likelihood:0.0058298226,itemset_size:41,f1:0.315789
likelihood:0.0003805078,itemset_size:59,f1:0.296296
likelihood:0.0117168659,itemset_size:3,f1:0.400000
likelihood:0.094665390,itemset_size:17,f1:0.588235
likelihood:0.0232391269,itemset_size:8,f1:0.333333
likelihood:0.0114537788,itemset_size:37,f1:0.428571
likelihood:0.0086404608,itemset_size:38,f1:0.377358
likelihood:0.0014673465,itemset_size:50,f1:0.246154
likelihood:0.1430736801,itemset_size:12,f1:0.285714
likelihood:0.1796558342,itemset_size:11,f1:0.500000
likelihood:0.0023182145,itemset_size:45,f1:0.354839
likelihood:0.0278574087,itemset_size:30,f1:0.320000
likelihood:0.0085074247,itemset_size:36,f1:0.326531
likelihood:0.0011395433,itemset_size:52,f1:0.394737
likelihood:0.0005603739,itemset_size:56,f1:0.365854
likelihood:0.0307482281,itemset_size:21,f1:0.555556
likelihood:0.0095841975,itemset_size:35,f1:0.266667
likelihood:0.0470543938,itemset_size:3,f1:0.166667
likelihood:0.0028841262,itemset_size:46,f1:0.328767
likelihood:0.0854187992,itemset_size:15,f1:0.615385
likelihood:0.0272127485,itemset_size:22,f1:0.409091
likelihood:0.0372761657,itemset_size:21,f1:0.500000
likelihood:0.0005068323,itemset_size:58,f1:0.421053
likelihood:0.0022255473,itemset_size:45,f1:0.322581
likelihood:0.0062679741,itemset_size:4,f1:0.615385
likelihood:0.0646194543,itemset_size:16,f1:0.466667
likelihood:0.0030412061,itemset_size:46,f1:0.246154
likelihood:0.002435895,itemset_size:46,f1:0.417910
likelihood:0.0006993954,itemset_size:55,f1:0.350000
likelihood:0.0029811229,itemset_size:44,f1:0.459016
likelihood:0.063278937,itemset_size:17,f1:0.400000
likelihood:0.0051096070,itemset_size:40,f1:0.301887
likelihood:0.0164048190,itemset_size:33,f1:0.275862
likelihood:0.0013417750,itemset_size:51,f1:0.435897
likelihood:0.0010322262,itemset_size:52,f1:0.324324
likelihood:0.0533268593,itemset_size:10,f1:0.500000
likelihood:0.0618524969,itemset_size:19,f1:0.424242
likelihood:0.0376872196,itemset_size:24,f1:0.380952
likelihood:0.1182078351,itemset_size:13,f1:0.370370
likelihood:0.0157047706,itemset_size:34,f1:0.370370
likelihood:0.0840251102,itemset_size:14,f1:0.444444
likelihood:0.0016492258,itemset_size:48,f1:0.373333
likelihood:0.0112412026,itemset_size:34,f1:0.222222
likelihood:0.0000044460,itemset_size:1,f1:0.181818
likelihood:0.002662778,itemset_size:45,f1:0.281250
likelihood:0.0016878002,itemset_size:49,f1:0.276923
likelihood:0.0123969962,itemset_size:23,f1:0.378378
likelihood:0.0296305332,itemset_size:29,f1:0.465116
likelihood:0.0021651476,itemset_size:49,f1:0.373333
likelihood:0.0501686942,itemset_size:15,f1:0.451613
likelihood:0.0041467952,itemset_size:43,f1:0.235294
likelihood:0.0034205929,itemset_size:3,f1:0.307692
likelihood:0.0108894646,itemset_size:36,f1:0.377358
likelihood:0.0478622524,itemset_size:6,f1:0.428571
likelihood:0.0848137842,itemset_size:16,f1:0.484848
likelihood:0.0097687216,itemset_size:36,f1:0.259259
likelihood:0.0005976182,itemset_size:57,f1:0.216216
likelihood:0.1076264074,itemset_size:6,f1:0.571429
likelihood:0.0006997983,itemset_size:55,f1:0.270270
likelihood:0.0022262668,itemset_size:46,f1:0.310345
likelihood:0.0448849438,itemset_size:12,f1:0.380952
likelihood:0.0232278237,itemset_size:31,f1:0.259259
likelihood:0.0000065656,itemset_size:2,f1:0.363636
likelihood:0.0006957504,itemset_size:53,f1:0.297297
likelihood:0.0475652833,itemset_size:22,f1:0.500000
likelihood:0.0388873416,itemset_size:16,f1:0.333333
likelihood:0.001129117,itemset_size:52,f1:0.277778
likelihood:0.0320419935,itemset_size:8,f1:0.636364
likelihood:0.0026319374,itemset_size:46,f1:0.312500
likelihood:0.0092218681,itemset_size:38,f1:0.296296
likelihood:0.0399409920,itemset_size:5,f1:0.333333
likelihood:0.0215438616,itemset_size:32,f1:0.440000
likelihood:0.015580957,itemset_size:34,f1:0.392157
likelihood:0.0901652777,itemset_size:9,f1:0.333333
likelihood:0.0000098169,itemset_size:3,f1:0.166667
likelihood:0.1051671273,itemset_size:17,f1:0.518519
likelihood:0.1396598124,itemset_size:11,f1:0.434783
likelihood:0.0585899456,itemset_size:19,f1:0.631579
likelihood:0.0055717589,itemset_size:41,f1:0.271186
likelihood:0.1158102913,itemset_size:11,f1:0.320000
likelihood:0.0032141159,itemset_size:43,f1:0.309859
likelihood:0.001462912,itemset_size:50,f1:0.309524
likelihood:0.00336863,itemset_size:44,f1:0.271186
likelihood:0.0003727859,itemset_size:59,f1:0.164384
likelihood:0.0338331159,itemset_size:24,f1:0.358974
likelihood:0.0113264510,itemset_size:35,f1:0.313725
likelihood:0.069977535,itemset_size:16,f1:0.482759
likelihood:0.0010142984,itemset_size:52,f1:0.225806
likelihood:0.0000239393,itemset_size:4,f1:0.307692
likelihood:0.0072977176,itemset_size:39,f1:0.363636
likelihood:0.0263913999,itemset_size:29,f1:0.333333
likelihood:0.0019258306,itemset_size:48,f1:0.280702
likelihood:0.0082023484,itemset_size:39,f1:0.327273
likelihood:0.0034772195,itemset_size:44,f1:0.358209
likelihood:0.0802767226,itemset_size:8,f1:0.315789
likelihood:0.0250953140,itemset_size:31,f1:0.489796
likelihood:0.0876077799,itemset_size:10,f1:0.500000
likelihood:0.0617975738,itemset_size:18,f1:0.482759
likelihood:0.0003527104,itemset_size:60,f1:0.240964
likelihood:0.0223639619,itemset_size:31,f1:0.291667
likelihood:0.0267165370,itemset_size:29,f1:0.558140
likelihood:0.1170505498,itemset_size:14,f1:0.444444
likelihood:0.0005873824,itemset_size:57,f1:0.320000
likelihood:0.0616805854,itemset_size:18,f1:0.428571
likelihood:0.080251224,itemset_size:14,f1:0.384615
likelihood:0.0000068358,itemset_size:2,f1:0.250000
likelihood:0.1586725093,itemset_size:12,f1:0.260870
likelihood:0.1454632285,itemset_size:10,f1:0.400000
likelihood:0.0122923339,itemset_size:33,f1:0.470588
likelihood:0.0295814934,itemset_size:30,f1:0.391304
likelihood:0.022948895,itemset_size:28,f1:0.428571
likelihood:0.0050738502,itemset_size:42,f1:0.253968
likelihood:0.0288073697,itemset_size:27,f1:0.260870
likelihood:0.0115438939,itemset_size:37,f1:0.274510
likelihood:0.0618734464,itemset_size:16,f1:0.434783
likelihood:0.0111709654,itemset_size:33,f1:0.313725
likelihood:0.0273364625,itemset_size:29,f1:0.520000
likelihood:0.1425063729,itemset_size:8,f1:0.380952
likelihood:0.0859149531,itemset_size:7,f1:0.631579
likelihood:0.0066706450,itemset_size:40,f1:0.333333
likelihood:0.0006511454,itemset_size:57,f1:0.194444
likelihood:0.0036785484,itemset_size:44,f1:0.231884
likelihood:0.0079383332,itemset_size:2,f1:0.200000
likelihood:0.0004729849,itemset_size:57,f1:0.264706
likelihood:0.0398278480,itemset_size:20,f1:0.571429
likelihood:0.0020365591,itemset_size:48,f1:0.229508
likelihood:0.3554746895,itemset_size:9,f1:0.333333
likelihood:0.0017761556,itemset_size:48,f1:0.327869
likelihood:0.0000042184,itemset_size:1,f1:0.181818
likelihood:0.0049123554,itemset_size:43,f1:0.327869
likelihood:0.0357978433,itemset_size:20,f1:0.400000
likelihood:0.0206755431,itemset_size:29,f1:0.468085
likelihood:0.0171243844,itemset_size:25,f1:0.452830
likelihood:0.1220885807,itemset_size:11,f1:0.538462
likelihood:0.0014463307,itemset_size:50,f1:0.305556
likelihood:0.1070974392,itemset_size:13,f1:0.482759
likelihood:0.0145243466,itemset_size:33,f1:0.274510
likelihood:0.0069715599,itemset_size:40,f1:0.410959
likelihood:0.0421821436,itemset_size:24,f1:0.363636
likelihood:0.0042692865,itemset_size:43,f1:0.380952
likelihood:0.0027064348,itemset_size:45,f1:0.214286
likelihood:0.013530252,itemset_size:36,f1:0.333333
likelihood:0.0000743268,itemset_size:6,f1:0.444444
likelihood:0.0788543645,itemset_size:19,f1:0.256410
likelihood:0.0005114166,itemset_size:56,f1:0.275862
likelihood:0.0003798623,itemset_size:60,f1:0.259740
likelihood:0.0012843840,itemset_size:51,f1:0.312500
likelihood:0.0904142411,itemset_size:17,f1:0.482759
likelihood:0.0017517697,itemset_size:48,f1:0.318841
likelihood:0.0316781897,itemset_size:22,f1:0.476190
likelihood:0.0795451094,itemset_size:7,f1:0.500000
likelihood:0.0000415720,itemset_size:5,f1:0.352941
likelihood:0.0518761654,itemset_size:18,f1:0.500000
likelihood:0.0010961723,itemset_size:52,f1:0.293333
likelihood:0.0321279217,itemset_size:26,f1:0.400000
likelihood:0.0024349377,itemset_size:47,f1:0.447761
likelihood:0.0006081807,itemset_size:56,f1:0.295455
likelihood:0.0004655168,itemset_size:58,f1:0.266667
likelihood:0.1357845696,itemset_size:10,f1:0.571429
likelihood:0.1758928943,itemset_size:11,f1:0.476190
likelihood:0.0006578284,itemset_size:54,f1:0.294118
likelihood:0.0549481887,itemset_size:13,f1:0.416667
likelihood:0.0549646461,itemset_size:20,f1:0.514286
likelihood:0.0340186685,itemset_size:30,f1:0.465116
likelihood:0.0443443112,itemset_size:20,f1:0.450000
likelihood:0.0368076432,itemset_size:26,f1:0.382979
likelihood:0.0244729601,itemset_size:31,f1:0.363636
likelihood:0.0475782535,itemset_size:23,f1:0.411765
likelihood:0.0960396492,itemset_size:13,f1:0.400000
likelihood:0.0004863858,itemset_size:56,f1:0.305556
likelihood:0.0003766451,itemset_size:59,f1:0.320988
likelihood:0.0317274130,itemset_size:27,f1:0.444444
likelihood:0.0003794320,itemset_size:59,f1:0.243243
likelihood:0.0005958976,itemset_size:56,f1:0.285714
likelihood:0.0000064391,itemset_size:2,f1:0.200000
likelihood:0.0008051939,itemset_size:54,f1:0.370370
likelihood:0.0003998918,itemset_size:60,f1:0.171429
likelihood:0.0230811715,itemset_size:26,f1:0.409091
likelihood:0.0715619326,itemset_size:14,f1:0.500000
likelihood:0.0101574623,itemset_size:36,f1:0.313725
likelihood:0.0217692424,itemset_size:28,f1:0.256410
likelihood:0.0975682504,itemset_size:15,f1:0.424242
likelihood:0.0060105555,itemset_size:41,f1:0.226415
likelihood:0.0228576276,itemset_size:32,f1:0.448980
likelihood:0.0004873048,itemset_size:58,f1:0.260870
likelihood:0.0446012488,itemset_size:20,f1:0.461538
likelihood:0.0081321851,itemset_size:38,f1:0.264151
likelihood:0.0572428432,itemset_size:19,f1:0.466667
likelihood:0.0085083823,itemset_size:38,f1:0.296296
likelihood:0.0565095658,itemset_size:21,f1:0.363636
likelihood:0.0352955756,itemset_size:26,f1:0.400000
likelihood:0.0045819364,itemset_size:42,f1:0.222222
likelihood:0.0150024748,itemset_size:35,f1:0.280000
likelihood:0.008583373,itemset_size:37,f1:0.344828
likelihood:0.0007266030,itemset_size:53,f1:0.333333
likelihood:0.0000092623,itemset_size:3,f1:0.315789
likelihood:0.0007849186,itemset_size:54,f1:0.253521
likelihood:0.0122275864,itemset_size:34,f1:0.452830
likelihood:0.0114439246,itemset_size:6,f1:0.307692
likelihood:0.0465775661,itemset_size:15,f1:0.620690
likelihood:0.0032462824,itemset_size:42,f1:0.376812
likelihood:0.0127689468,itemset_size:25,f1:0.444444
likelihood:0.0008198308,itemset_size:53,f1:0.323529
likelihood:0.0121364590,itemset_size:33,f1:0.339623
likelihood:0.0396813781,itemset_size:23,f1:0.378378
likelihood:0.109277554,itemset_size:15,f1:0.363636
likelihood:0.0097956218,itemset_size:37,f1:0.346154
likelihood:0.0642032960,itemset_size:7,f1:0.333333
likelihood:0.0012458915,itemset_size:51,f1:0.525000
likelihood:0.0005868306,itemset_size:55,f1:0.333333
likelihood:0.1119602262,itemset_size:7,f1:0.333333
likelihood:0.0089725587,itemset_size:38,f1:0.352941
likelihood:0.0095418204,itemset_size:39,f1:0.298507
likelihood:0.1744471619,itemset_size:12,f1:0.421053
likelihood:0.0251869198,itemset_size:7,f1:0.153846
likelihood:0.043573189,itemset_size:18,f1:0.545455
likelihood:0.0336989012,itemset_size:22,f1:0.473684
likelihood:0.0000041837,itemset_size:1,f1:0.222222
likelihood:0.048867409,itemset_size:21,f1:0.333333
likelihood:0.0156624695,itemset_size:34,f1:0.326531
likelihood:0.0476405060,itemset_size:9,f1:0.571429
likelihood:0.0000234737,itemset_size:4,f1:0.153846
likelihood:0.0000235827,itemset_size:4,f1:0.235294
likelihood:0.0013853396,itemset_size:51,f1:0.351351
likelihood:0.0236164368,itemset_size:25,f1:0.486486
likelihood:0.0190364421,itemset_size:14,f1:0.451613
likelihood:0.0051532658,itemset_size:42,f1:0.388060
likelihood:0.0291088047,itemset_size:28,f1:0.458333
likelihood:0.0377541775,itemset_size:23,f1:0.388889
likelihood:0.0495911170,itemset_size:21,f1:0.315789
likelihood:0.003737950,itemset_size:44,f1:0.327273
