Rubi;the Spaniard;The Spaniard
Asier Garitano;Asier [Garitano];Garitano;A. Garitano;A Garitano;the Spaniard;The Spaniard
Paco Lopez;Paco [Lopez];Lopez;P. Lopez;P Lopez;the Spaniard;The Spaniard
Gaizka Garitano;Gaizka [Garitano];Garitano;G. Garitano;G Garitano;the Spaniard;The Spaniard
Abelardo
Vicente Moreno;Vicente [Moreno];Moreno;V. Moreno;V Moreno;the Spaniard;The Spaniard
Sergio Gonzalez;Sergio [Gonzalez];Gonzalez;S. Gonzalez;S Gonzalez;the Spaniard;The Spaniard
Jose Bordalas;Jose [Bordalas];Bordalas;J. Bordalas;J Bordalas;the Spaniard;The Spaniard
Zinedine Zidane;Zinedine [Zidane];Zidane;Z. Zidane;Z Zidane
Jagoba Arrasate;Jagoba [Arrasate];Arrasate;J. Arrasate;J Arrasate;the Spaniard;The Spaniard
Imanol Alguacil;Imanol [Alguacil];Alguacil;I. Alguacil;I Alguacil;the Spaniard;The Spaniard
Javier Calleja;Javier [Calleja];Calleja;J. Calleja;J Calleja;the Spaniard;The Spaniard
Diego Simeone;Diego [Simeone];Simeone;D. Simeone;D Simeone;the Argentine;The Argentine
Diego Martinez;Diego [Martinez];Martinez;D. Martinez;D Martinez;the Spaniard;The Spaniard
Jose Luis Mendilibar;Mendilibar;J. Mendilibar;J Mendilibar;the Spaniard;The Spaniard
Oscar Garcia Junyent;Junyent;O. Junyent;O Junyent;the Spaniard;The Spaniard
Albert Celades;Albert [Celades];Celades;A. Celades;A Celades;the Spaniard;The Spaniard
Julen Lopetegui;Julen [Lopetegui];Lopetegui;J. Lopetegui;J Lopetegui
Quique Setien;Quique [Setien];Setien;Q. Setien;Q Setien;the Spaniard;The Spaniard
Fernando Vazquez;Fernando [Vazquez];Vazquez;F. Vazquez;F Vazquez;the Spaniard;The Spaniard
Javier Aguirre;Javier [Aguirre];Aguirre;J. Aguirre;J Aguirre