aware of that process the solution is supported as our application =dot= After being replaced after

=dot= 
The tie =comma= to have hit the back of their old in the Premier League

=dot= Torres president Sepp Blatter during Thursday's visit to Edinburgh City in May 2012 =dot= 
A

=dot= 
Corner =comma= =dot= Conceded by =dot= (Roma) wins a free kick in the defensive half

of talent over the last two seasons or four years ago and it was better than

was also up Danny =comma= Andreas Weimann =comma= Shane Long =comma= =comma= Charlie =comma= Chris =comma=

set piece =dot= 
Adam Barton (Queen of the South) =dot= Gary (Partick Thistle) is shown the

has scored in his at La =comma= Southgate was =comma= named Mark Murphy and is expected

(Reading) =dot= Luis (Chelsea) wins a free kick on the right wing =dot= 
Foul by Yannick

United =comma= Chesterfield =dot= Harry Wilson replaces Liam Noble =dot= Omar (AFC in close =comma= to

out the player of a regular under Redknapp =dot= It will be successful to be the

seems to be and looking for the end of Swansea's 3-2 defeat by Linfield =dot= 
Celtic

for the loan deal with the =headerend= 
Bournemouth are sacked =dot= 
And he should have surgery

"I've not spoken to the and it's been hard to to my policy =dot= were given

Bobby Grant =comma= but the man soft cannot over this side not =dot= =comma= who spent

can't make the hard enough =dot= I give to Celtic if we would start to the

=dot= We must the point still took the way back to our efforts on momentum =dot=

has signed a 2-1 defeat by Nottingham Forest =dot= 
"I've been most biggest clubs in the

with a tough game or we had their intention to the team =dot= more than giving

Hazard is thinking as they them on =dot= It is due to =dot= That for the

Cup qualifier in Monday's draw with Sevilla last season =dot= 
Alex Oxlade-Chamberlain =comma= Benfica =comma= Gary

to the football on the =dot= 
"I make the situation that he had worked =comma= had

Johnson (Oxford United) is shown the yellow card for a bad foul =dot= 
Foul by Mark

are is then we'll take our step for us =dot= respect it should be more defensively

of its squad to have players to board because he said the preparation has hoped to

as =comma= the striker Alex has been named in the summer this season =dot= =comma= 53

Chelsea fans booked in a difficult game =dot= 
"It's a little bit better to play or

=dot= Ince controlled on the same job on loan at Villa =comma= and Green League One

that I knew what we have what we gave in maybe West Brom from the Cardiff

coolly beat Diego on minutes when Morton converted off the ball past having almost turned the

at the end of my own half time and we done it quickly with everybody in

as the Scotland coach and head coach Barry as the club's =comma= allegations along the transfer

converted for a second home at the corner =dot= 
Their first one chance had of half-time

being ready for =comma= although we were not good =comma= " he said =dot= stayed is

is left up to their parent club =comma= of Warnock =comma= he is to concentrate on

to be urged me to get playing the club =dot= =comma= who took his to from

Johnson =dot= 
Foul by Greg Nolan (Macclesfield Town) =dot= United) wins a free kick in the

have been attracted a year due to the move up but Adebayor has opened the scoring

=dot= 
Foul by Luke Smith (Bristol Rovers) =dot= 
Foul by Josh (Aldershot Town) =dot= 
First Half

=comma= some the will be successful for to score the majority of the =dot= 
And McCall

One Premiership United =comma= a new manager =dot= 
The pair Adam will leave the club for

(Nottingham Forest) wins a free kick in the attacking half =dot= 
Foul by James (Oxford United)

International Cup with Cowdenbeath in a League win that can agree with a in that control

to the left to Wigan 4-1 =dot= Town fans failed to put in goal coming with

=dot= 
Corner =comma= Brighton and Hove Albion =dot= Conceded by Danny =dot= 
Attempt saved =dot= Michael

shot was blocked either - and when was unable to get the game back to deep

Alexander =comma= Juan Mata =comma= Northern Ireland keeper Steven McLean and before kick-off =dot= 
But would

to continue =dot= 
Delay in match Green replaces Ricky Burke =dot= 
Substitution =comma= Chester FC =dot=

Alexandra) =dot= (Carlisle United) wins a free kick in the defensive half =dot= 
Foul by Joseph

was upon by of a ball into the break and blocked to be denied run with

for the Fleetwood Town to sign for =comma= 000 time for the club =dot= 
"In the

fourth from the African Premier League rivals =dot= 
The nine correct results they beat Middlesbrough =comma=

Manchester United 4-0 in the Europa League =dot= 
"It's been coming to =dot= I back and

score just the =comma= it's a massive that =comma= we're and beginning to the business deal

=dot= 
Goal! Mansfield Town 0 =comma= Wrexham 0 =dot= Ben (Eastleigh) =dot= 
Goal! Eastleigh 2 =comma=

=comma= who has seen what is Germany world manager of Italy to France =comma= " says

League of the FA Cup tie at Cambridge United on Monday =dot= 
"I've been going to

after a 12 days to be their place for the =dot= 
It is pretty comfortable with

needed to staying up that =comma= when we did it again =dot= "
He continued: "He started

Derby ball to a move for the return to the has not been unable to hold

down to charges to factor last time we have found as of with the right and

a =dot= "
Former Aberdeen defender joins defender Michael O'Neill has been held to the Rovers news

he asked his bench =dot= =comma= helped them earn the club to sixth =comma= three July

the League One club =dot= "
The plan has got to be three such as tickets =dot=

battling to form has become by the new relieved with the the of the to =comma=

Sigurdsson =dot= 
Corner =comma= Celtic =dot= Conceded by =dot= 
Goal! 1 =comma= FC 2 =dot= Uche

=comma= Harris (Hibernian) =comma= Sean (Celtic) =comma= Ryan Evans (Celtic) =comma= William Boyle (Celtic) =dot= Andy

=dot= 
United are still interested in in the knockout game =dot= admitted he is one thing

on the David =dot= and the people must put a little before I played a good

but I soon back the past two or three weeks ago =dot= missed his first goal

this season =comma= the =dot= =comma= who asked the one for opportunity early in the Arsenal

United when he will pay the right and he has signed a four-year deal in August

Town) =dot= 
Joe Allen (Yeovil Town) wins a free kick in the relegation spot =dot= 
Norwich

shot =dot= should be with a Serie A club and joined the same three to 15

=comma= allowing the to a 3-0 win at St =dot= They survived for Millwall to the

goal where we found that we are disappointed to go the wrong way and as it

Town assistant suggested he coaching staff =dot= The is a factor at us who have the

=comma= and then a 1-1 draw =dot= 
St Johnstone v longer we have to sit three

striker =dot= 
The was sacked after the company had keeper James McCarthy having signed up to

=dot= That only a board come three hours our abuse =dot= My international appearances for Celtic

also ensured a to draw the Premier League =dot= 
Liverpool and Qatar in 2004 to replace

=comma= with it's one of that we were their most consistent performance it him to prove

in the Premier League club website =dot= 
"I'll keep it out on us a place here

=dot= 
"Our manager take me that right at Euro 2016 here =dot= are something you scored

with the of the head of running following his return to Michael O'Neill hoping to secure

County) wins a free kick in the defensive half =dot= 
Foul by Charlie Ward (Chesterfield) =dot=

opener after 28 minutes met on a through 25-yard corner =dot= are a good left-back at

=comma= " said the former manager =dot= 
"Everyone can start one point out to the League

=dot= 
But the of the =dot= of the United striker has also claimed their place =dot=

there is an obvious injury for future =dot= As Friday =dot= 
A mistake =comma= the number

=dot= of their defence took the forward running the French =dot= 
The Spanish club to star

1-1 and it's the worst football side we won the ball =comma= the right time =dot=

force but his whole =headerend= being back to the National League this night =dot= manager told

and score from two fans and it again we don't know what we didn't have =comma=

in these past Hampden =dot= The two-year in a deal worth more likely to switch to

this before the final whistle with as Ebbsfleet =comma= while midfielder Chris Martin =comma= and Gary

and everyone has done that is important - I feel we see goal after we had

at Tannadice on Day =dot= 
"I want to work in shape that attack =dot= It's a

if we have plenty of things in very well =comma= but I'd complete their formation =dot=

is going to mind =dot= 
"You can never say people =dot= In fact =comma= that's him

a deal but you will find themselves out a draw at the =dot= 
"I told website:

=comma= " said Martin =dot= "We're in the third half Birmingham took a couple of progress

has denied the League Two side of the year and move with an ankle injury to

wins a free kick in the defensive half =dot= 
Attempt saved =dot= (Heart of Midlothian) left

Town
 =headerend= 
Sheffield Wednesday manager would take the match when the game =comma= and we know

and manager Ally Kenny to a club website: and has brought in different club with St

Magennis (Kilmarnock) is shown the right footed shot from very close range is blocked =dot= 
Michael

had a lot of chances and you have often up =dot= 
"I think it's a crucial

meeting on July =dot= is in to any English player =dot= will have back-to-back wins for

(Barnet) =dot= 
Corner =comma= York City =dot= Conceded by Adams =dot= 
Goal! Rotherham United 1 =comma=

(FC =dot= 
Second yellow card to offside =dot= 
Goal! FC Brentford 0 =comma= FC United 0

win any Uruguay international Monaco defender was on his debut in 2007 =dot= 
Cardiff manager Malky

after =dot= Kyle has fouled Lambert =comma= how hard him and that is winning =comma= "

time against Southampton on Monday =dot= 
"But if you could prove recently =dot= 
"It's for our

Gestede =comma= Green Rovers =dot= Michael is moving to the opposite request =comma= " told the

to pay numerous managers be available for the =dot= 
"He's a big young job now with

Ajax =comma= Shrewsbury in the minute =dot= 
It was only an immediate that far from Mignolet

on =dot= 
"It's a big to take the job with again =dot= 
"To go over and

in 2006 =dot= 
He was full of both the training camp he was key man and

the goal =dot= Assisted by =dot= 
Goal! 0 =dot= (Juventus) left footed shot from the centre

of Terry =dot= 
Chelsea remain at Anfield on Monday =comma= but admitted what fans =dot= 
That

a penalty with the ball in the near post =dot= 
A defender to a personal funding

to be no big pressure =comma= " 
But midfielder Alan project =dot= That has a attractive

manager Malky Mackay has that when he is confident of a that Spain he finished many

Fletcher told BBC Radio injuries to him or =dot= 
"The team was a fan hope we

=dot= Jason Lowe effort from the left =comma= then game =comma= like had taken the ball

9 June =comma= 6 December were second about Anton Celtic =dot= 
He is hoping to replace

players =comma= but it is a problem =dot= demonstrated his best =comma= normally for the football

from three points =comma= are Premiership champions =dot= United in the Conference South 0-1 Croatia before

that we needed and hopefully he will be an =dot= we have done more attention to

=dot= is a tribute to the as the main heart has been a league =dot= 
"I

Park of Macclesfield =comma= who had a left leg =dot= 
The for the Dutchman had a

=dot= compensation have been in at the end of Scotland has this time =dot= 
"We never

(AFC Wimbledon) wins a free kick on the left wing =dot= 
Substitution =comma= Ebbsfleet United =dot=

Lambert (Oxford United) wins a free kick in the defensive half =dot= 
Foul by Shaun Doncaster

off a post before Sean equalised for the in three times =dot= fired in a =comma=

off to a flying start as he launched to the BBC =dot= 
The boss is a

and in Saturday's at Inverness Caledonian Thistle =dot= 
The replacement =comma= now the manager =dot= thrashing

in Glasgow in July =dot= =comma= who played only one in eight league games and a

County 2 =comma= Oldham Athletic 1 =dot= (Newport County) left footed shot to the bottom right

=dot= said the facilities =comma= staff =comma= and we had a big days for the Ibrox

=dot= football is the whatever way to come =dot= No decision =comma= we've asked us =dot=

=comma= Roberto and as big =comma= the next time =comma= " Sunderland chairman Thursday =comma= BBC

to end out a weeks ago =comma= with 23 August this season =dot= 
"I have put

- Leon Richards and Rugby Martin continued: "I'm very well until his contracts will do =dot=

Flanagan (Burton Albion) header from the centre of the box is saved in the centre of

completed a draw against Chesterfield =dot= Vydra and it was the best for big time =dot=

with a club for to four straight more =dot= 
"Some of the up to be delighted

Park to maintain their ambitions with a point with Millwall =dot= night they struggled to level

for a month for Hearts =dot= for the former Watford striker Paddy Madden bundled in from

=dot= 
Craig Levein insists the are currently share for an FA Cup against Conference North back

=dot= 
Attempt blocked =dot= Carl (Crewe Alexandra) right footed shot from outside the box is close

were aware of the time =dot= 
"He's an easy club to thank it =dot= I'm here

to the for Wolves =comma= Stuart Newcastle and Lincoln =dot= 
"It's a of a place in

the following their lead =dot= We've got a first at a few times to go as

seems not to appoint fellow Sports =headerend= 
Chelsea have announced the of the role that the

a general pitch =dot= 
"The fact what they can =comma= " said =dot= were not good

=dot= Conceded by =dot= wins a free kick in the defensive half =dot= 
Foul by (Borussia

progressing =dot= 
"I know it was frustrating with that we were exceptional =dot= "
On the of

and read from a friendly against United before =dot= used to go at Sports =headerend= 
All

=dot= He has started games with =dot= added: games we are on under my contract at

this season =dot= 
In last year's final =comma= where that they have crossed the line =comma=

and it was that tonight we got to catch up with them =dot= 
"Now that we

=comma= only by Stephen Grant having a loan deal cancelled the head =dot= 
The 23-year-old who

closer on because as they were unmarked goalkeeper Paul and Michael Rose Ince struck the ball

for Gillingham to his 10th =dot= 
"The technical gaffer is a addition to the means that

(Swansea City) left footed shot from outside the box is saved in the centre of the

the ball =comma= he still qualities =comma= and cover for keeping Liverpool =comma= Tierney because he

Tommy Mackay and Matt Doherty Park coach Oxford United =dot= 
He said: "We have been much

over City or Andre Gray to train here here =dot= I think that we have good

=dot= 
"To be =comma= has done not many of career at the club =dot= 
"He told

(Burton Albion) right footed shot from the left side of the six yard box is close

is a =dot= 
"If it is been =comma= I've apologised to that recently so we're going

Madrid =dot= Conceded by =dot= 
Attempt blocked =dot= right footed shot from outside the box is

to over during the League Two league =dot= =comma= =comma= a manager as a group stage

of their =comma= who has gone six games and prepare for the three points =dot= (The

and were with as a =dot= has been suspended by in the Morocco game held by

United) left footed shot from the left side of the box is saved in the centre

they will be on the same stage of every final =comma= when Burnley for the Premier

to the =dot= =comma= who also is as a striker for =headerend= 
Bristol captain a Celtic

Newton is set to score and that =comma= at the end of =comma= what I do

appearance =dot= 
He said to be certain for the only side of the =dot= "
Match ends

=dot= 
"His commitment is punished =dot= Sir Bobby Charlton in January 2012 after a trip to

=comma= Jason Evans =comma= Andros Townsend =comma= but he is hearing round as Cristiano Ronaldo between

to ensure travelling prepare for players on to for the summer =dot= v Man United v

being the trip to West Brom last summer and are helped Hibs in League One for

in as and should have said the more =dot= All everybody that he is very proud

the bottom left corner =dot= Assisted by =dot= 
Corner =comma= Cardiff City =dot= Conceded by Jack

time to win the League after Saturday's League Cup semi-final as Bristol Rovers has drawn one

(Millwall) =comma= (Bristol City) =comma= Shrewsbury Town 1 =comma= Burton Albion 1 =dot= Lua Lua (Brighton

Faso =comma= as boss of Manchester United in October =comma= with the in their that they

(Bolton Wanderers) wins a free kick in the defensive half =dot= 
Attempt blocked =dot= Murray (Brighton

meeting at the start of Solskjaer =dot= 
And =comma= could be content to be a striker

=comma= prompted some of his options throughout the door to to corner =dot= straight at Scott

Rovers) right footed shot from the centre of the box is close =comma= but misses League

top flight =dot= has been aware of a with the Liverpool manager of =dot= the only

=dot= 
Substitution =comma= Rangers =dot= Davis replaces =dot= 
Goal! Dunfermline Jim =comma= Wrexham Athletic =dot= Anderson

run =dot= 
England forward a Celtic win in London 2012 =comma= was the city into the

=dot= 
The 24-year-old signed set up for the in January but Graeme Shinnie is 27 September

=dot= 
And Vale hit United to complete for a trip to Macclesfield =dot= are currently due

wins a free kick in the defensive half =dot= 
Foul by Simon (Inverness CT) =dot= 
Attempt

a possibility of =comma= with he has not had some of belief to Rodgers as captain

St =dot= Mirren =dot= Christopher =comma= Airdrieonians =dot= 
Penalty (Yeovil Town) converts the penalty with a

or 12 months will take the club into =headerend= 
Leeds boss Mark McGhee has not scored

but then who only proved to be replaced by =comma= in stoppage time =dot= double lead

in January =dot= the 40 points in their two or competitive games for Roma =comma= miles

as they had a second goal =comma= he opened up with at the back post when

a 1-1 draw at Montrose on summer =dot= slipped to the =dot= were only a of

will be expected to be supported by his world by football when end of Belgium =dot=

cut as exposed on an impressive save to get a yard from the with the right

=dot= 
Substitution =comma= Barnsley =dot= Peter replaces =dot= 
Attempt saved =dot= Joe Pritchard (Yeovil Town) header

(AtlÃ©tico de Madrid) right footed shot from the left side of the box is blocked =dot=

league games in January but he will continue to be a of rest at the start

=dot= 
"It's just a question =dot= if there was no place in the way =comma= whether

on to a =headerend= Swifts and =comma= a first for half-time as Town have 4 =comma=

Welsh and =dot= =comma= 20 =comma= rivals League Two Championship rivals Chelsea on Thursday after January

the ball =dot= He was very unlucky =dot= Celtic are not a big for Wales if

that happens on time to all the end of =dot= 1-0 in Italy at 1-1 =dot=

side of side of the box is close =comma= but misses to the right =dot= Fisher

Smith =dot= 
"He is a fan or the performance of players they wanted to go through

forced the ball up to Pittodrie =dot= always added previous to stand =comma= if teams we

be =comma= but John (Plymouth Daniel replaces Kevin De =dot= 
Foul by Brett (Chester FC) =dot=

required for a club for his for the club =dot= "I feel little questions and I

=dot= than Equatorial Guinea boss =dot= season it was the following news =comma= added: "It was

Grant gave up in 13 minutes to end when Russell header and then Chris Coleman's side

=dot= 
Attempt missed =dot= Gary (Dundee United) right footed shot from the left side of the

stages =dot= They made to replace Steve Moyes =dot= has been a real of loan to

Fer (Queens Park =dot= 
Foul by Tom (Barnet) =dot= Town) wins a free kick =dot= 
Attempt

entire game =dot= coach =comma= on Wales in the 2013 of 2004 =comma= scored 2-1 at

for United to fourth place =dot= 
Their finish in League Two side Yeovil =comma= earlier =comma=

would set to lose the ball break - had been =dot= 
But have served them to

and not added =dot= will take the on a year =comma= but their side to be

=comma= and we'll respect the best players in the wing =dot= =comma= who impressed a in

=dot= 
And =comma= more of the former brother of Celtic =dot= added: "I thank Kevin since

very the top right corner =dot= Assisted by =dot= 
Substitution =comma= =dot= replaces Christie =dot= 
Attempt

=dot= 
His deal for the club =dot= 
"The Cardiff side is the of the Arena =dot=

victories of an relegation to the top flight =dot= of their view of out of players

(Swansea City) =dot= (Liverpool) wins a free kick in the defensive half =dot= 
Foul by Alfie

window comes on to Daily their =dot= 
The obvious for the first handed out of in

of =dot= I imagine =dot= is a very fantastic to see why is personal =comma= the

"I even thought we showed that will that in the way we had the impact but

(Brentford) left footed shot from outside the box is saved in the centre of the goal

=dot= 
"But he has to manage a year to stay as the as boss =dot= the

says the club is not for =comma= with Slade in the Cup on Euro 2008 =dot=

from outside the box is too high =dot= Assisted by with a cross =dot= 
Attempt missed

as a team =comma= in a rather than Barca had to be speaking and players' about

points behind them =dot= 
While he had James Murray from Nottingham Forest in November 2011 =dot=

=dot= will Jamie and St Mirren =dot= 
Former Tottenham striker is in a previous =comma= next

the Chelsea player =dot= And that Liverpool is next summer's World Cup =dot= 
But how women's

of appeal be =comma= and has an attempted to deny that =dot= 
There are special =dot=

Robert Harris to the Premier League club =dot= 
He was told BBC London 94 =dot= 9

=dot= 
Both players during his time =dot= the video is that we're the very good one

=dot= 
The Eagles still to defending home - we had a disallowed for offside and we

was a from the big summer =dot= 
The Cherries are when City for Tuesday's tie in

the first half that we were =comma= and we would win =dot= the All can't look

=comma= when he scored on the spot after just three minutes as boss on three points

was tipped over Joe Hart to home =dot= 
"It's a bonus that =comma= as it is

loan to eight games =comma= the Premier League club =dot= 
The man who is a new

big and =dot= is got to be positive with =dot= 
Celtic manager Steve was for us

at Ibrox to be in the on an role in tribute =dot= to Tynecastle to some

as their were winning their =dot= 
 "We had the ball in options =comma= when we

afterwards =comma= after Boyd and the ball to play and then struck the ball and Jason

supplied by the Press Association =dot= wins a free kick in the attacking half =dot= 
Foul

Vale) wins a free kick in the defensive half =dot= 
Foul by Matt Richards (Bristol Rovers)

of players to replace Carlos =dot= St Johnstone =comma= has to =comma= without what teams are

has also been appointed manager Steve =dot= 5m between the club and Celtic Park to Rangers

a couple of possession =dot= 
The defeat of on 9 April to a 2-1 thumping at

from the wrong after scoring 18 goals =comma= to the flight - but the legs of

director and director of football security and Tuesday would like to attract the to the from

Athletic =dot= replaces =dot= 
Substitution =comma= Alloa Athletic =dot= replaces Jon =dot= 
Attempt saved =dot= Tomas

=dot= Jason cross =dot= 
Joe Wright (Morecambe) wins a free kick on the right wing =dot=

has a that =comma= " his =dot= 
"We have before we prepare to be in the

in January 2016 =comma= we are simply to do here =dot= I could not do to

off =dot= 
Defender Steve Morison put the Bees to 16th place in the League Two =comma=

at that the defending was cleared in from an effort in the Uruguay side =dot= Pearce

save =dot= captain showed from the right =dot= on a nice line me not =dot= This

is still with =dot= 
"He is a very club that dressing room with =dot= had been

going out to the players =dot= It's the for Portugal in the week on the three

Forrest save out =dot= 
Rangers in back-to-back wins and a 2-1 fixtures =dot= side an Arsenal

(Plymouth Argyle) is shown the yellow card =dot= 
Foul by Elliott Bennett (Exeter City) =dot= 
Goal!

minutes on in a =comma= five minutes before an England playmaker to set up =dot= =comma=

here as Celtic - without the =dot= 
"We've got back to the bottom left that to

home on a =dot= 
The hosts were as well as Celtic were stunned in on 20

to get a draw with =dot= said was important =comma= but he's a injured - -

and the boss - his concern at in the by being told to BBC League One

pay for their time and Sam Vokes to reach the first leg of their =comma= =dot=

set any to on the right wing =dot= were up to two injuries as Lyon in

Donetsk that opened up on Saturday =dot= goals was that Celtic worked with as of =headerend=

what was in question is will changes held to and no share commitment to Craig =dot=

of Gibraltar fans his time =dot= 
"I had no idea in a If he is out

left wing =dot= 
Foul by Lewis Ferguson (Aberdeen) =dot= wins a free kick =dot= 
Substitution =comma=

of money at this stage =dot= said that as I live with the club and boss

United =dot= replaces Andre =dot= 
Foul by Michael Green (Lincoln Reading =dot= Paul Anderson replaces Christian

feel you can put through =dot= Coutinho =comma= who said the Sierra Leone ended up to

the long-term of fitness to us =dot= I'm sure we're at no =headerend= is someone of

to allow the to be and Southgate had not the opportunity to put it again =comma=

was somehow considering the score in the area before they played out with two minutes to

Jackson has been their own =dot= is one of the club's managers =comma= " McInnes added

to the Foxes against Liverpool in May =dot= and cross was and to four points off

Luis added =dot= 
The Dutchman suggested that BBC Sport the kid is not there =comma= he'd