Estadio de la Ceramica
Camp Nou;Campowi Nou;Campowi Nou'a;Campa Nou;Campu Nou;Campu Nou'a;Campem Nou;Campu Nou'owi;Campem Nou'owi;Campa Nou'owi;Camp Nou'a;Campa Nou'a;Camp Nou'owi;Campowi Nou'owi;Campem Nou'a
Ipurua Municipal Stadium;Ipurui Municipal Stadiuma;Ipurui Municipala Stadium;Ipuruy Municipala Stadiumowi;Ipurua'owi Municipalu Stadiumowi;Ipurua Municipal Stadiuma;Ipuruy Municipalem Stadiumem;Ipuruie Municipalu Stadiumu;Ipurua'a Municipalowi Stadiumu;Ipuruie Municipal Stadiuma;Ipurua'a Municipal Stadiumem;Ipurua'owi Municipala Stadiumowi;Ipurua'owi Municipalowi Stadiumem;Ipuruie Municipalem Stadiuma;Ipuruie Municipalowi Stadiumu;Ipurua'owi Municipalem Stadiuma;Ipuruie Municipalu Stadiuma;Ipuruy Municipalu Stadium;Ipuruie Municipala Stadium;Ipurua'a Municipalu Stadiumu;Ipuruy Municipal Stadiumu;Ipurui Municipal Stadiumu;Ipurua Municipala Stadiumu;Ipurua'a Municipalowi Stadiumowi;Ipuruie Municipal Stadiumem;Ipurua'owi Municipalu Stadiumem;Ipurua'owi Municipal Stadiumowi;Ipurui Municipalowi Stadiumowi;Ipurua'owi Municipala Stadiumu;Ipurua Municipalem Stadiumowi;Ipurua'owi Municipal Stadium;Ipuruy Municipalowi Stadium;Ipuruie Municipala Stadiumowi;Ipurua'owi Municipalu Stadiuma;Ipurua'owi Municipal Stadiumu;Ipurui Municipalowi Stadiuma;Ipurua'a Municipalem Stadium;Ipuruie Municipala Stadiuma;Ipurua Municipalu Stadiumowi;Ipuruy Municipalowi Stadiuma;Ipurui Municipala Stadiuma;Ipurui Municipalem Stadiumu;Ipuruie Municipalem Stadiumowi;Ipurui Municipalu Stadiumem;Ipurua'owi Municipalu Stadium;Ipuruy Municipalu Stadiumem;Ipuruy Municipal Stadiumem;Ipurua'a Municipala Stadiumowi;Ipurua'owi Municipalowi Stadium;Ipurua'a Municipala Stadiumem;Ipurui Municipal Stadiumem;Ipuruie Municipal Stadium;Ipuruy Municipalowi Stadiumowi;Ipuruy Municipala Stadiuma;Ipuruie Municipalu Stadiumowi;Ipurua Municipal Stadiumem;Ipurua'a Municipalu Stadiumem;Ipurui Municipalu Stadiumowi;Ipurua Municipalowi Stadiumem;Ipurua'a Municipal Stadiumu;Ipurua'a Municipalowi Stadiumem;Ipurua Municipalowi Stadiumowi;Ipuruy Municipala Stadiumu;Ipurui Municipalem Stadium;Ipurui Municipala Stadiumem;Ipurui Municipalem Stadiuma;Ipurua'a Municipalu Stadiumowi;Ipurui Municipalowi Stadiumu;Ipurua'owi Municipalem Stadiumu;Ipurua'a Municipalu Stadium;Ipurua'a Municipalem Stadiumu;Ipurua Municipalem Stadiuma;Ipuruie Municipalem Stadiumu;Ipurua Municipalem Stadiumu;Ipurua'a Municipalowi Stadiuma;Ipurua'owi Municipalowi Stadiumu;Ipurua Municipalu Stadiumem;Ipurui Municipalu Stadiuma;Ipuruie Municipalu Stadium;Ipuruy Municipalem Stadiumu;Ipurui Municipalu Stadium;Ipurua Municipalem Stadium;Ipuruy Municipalu Stadiumowi;Ipurua Municipalem Stadiumem;Ipuruy Municipal Stadiumowi;Ipurui Municipalowi Stadium;Ipurui Municipalowi Stadiumem;Ipuruie Municipalu Stadiumem;Ipuruy Municipalem Stadiuma;Ipurui Municipalem Stadiumowi;Ipuruie Municipal Stadiumowi;Ipurui Municipal Stadiumowi;Ipurua'a Municipal Stadium;Ipuruie Municipal Stadiumu;Ipurua'owi Municipalowi Stadiuma;Ipurua'owi Municipal Stadiuma;Ipurua Municipalu Stadiumu;Ipurua'a Municipal Stadiumowi;Ipuruy Municipala Stadiumem;Ipuruy Municipalowi Stadiumem;Ipurui Municipalu Stadiumu;Ipurua Municipalu Stadium;Ipurua'a Municipalem Stadiumem;Ipuruie Municipalowi Stadiumem;Ipurua'owi Municipalowi Stadiumowi;Ipuruie Municipalem Stadium;Ipuruy Municipalu Stadiumu;Ipuruy Municipala Stadium;Ipurua Municipala Stadiumowi;Ipuruie Municipala Stadiumu;Ipurui Municipala Stadiumowi;Ipuruy Municipalowi Stadiumu;Ipurua Municipala Stadium;Ipurua'a Municipalem Stadiumowi;Ipurua Municipala Stadiumem;Ipurua'owi Municipalem Stadiumem;Ipurua'a Municipal Stadiuma;Ipuruy Municipalem Stadiumowi;Ipuruy Municipal Stadium;Ipurua'owi Municipala Stadiuma;Ipuruy Municipalu Stadiuma;Ipurua'owi Municipalem Stadiumowi;Ipuruie Municipalowi Stadiumowi;Ipurua Municipala Stadiuma;Ipurua Municipalu Stadiuma;Ipuruy Municipal Stadiuma;Ipurui Municipala Stadiumu;Ipurua'a Municipala Stadiumu;Ipuruie Municipalowi Stadiuma;Ipurui Municipal Stadium;Ipurua'a Municipalowi Stadium;Ipurua'owi Municipalem Stadium;Ipuruie Municipalem Stadiumem;Ipurua Municipalowi Stadiuma;Ipurua'owi Municipal Stadiumem;Ipurua Municipal Stadiumu;Ipurua'a Municipala Stadiuma;Ipuruy Municipalem Stadium;Ipurua Municipal Stadiumowi;Ipurua'owi Municipala Stadiumem;Ipurui Municipalem Stadiumem;Ipurua Municipalowi Stadium;Ipurua'owi Municipala Stadium;Ipurua'a Municipala Stadium;Ipurua'a Municipalu Stadiuma;Ipurua'a Municipalem Stadiuma;Ipurua'owi Municipalu Stadiumu;Ipuruie Municipala Stadiumem;Ipuruie Municipalowi Stadium;Ipurua Municipalowi Stadiumu;Ipurua Municipal;Ipuruie Municipalowi;Ipurua Municipalowi;Ipurua'a Municipala;Ipurui Municipalowi;Ipuruy Municipalowi;Ipurua'a Municipalu;Ipuruie Municipalu;Ipuruie Municipalem;Ipurua'owi Municipala;Ipurua Municipalem;Ipurui Municipala;Ipurui Municipalu;Ipuruy Municipalu;Ipuruy Municipal;Ipuruy Municipala;Ipuruy Municipalem;Ipurua'owi Municipal;Ipurua'owi Municipalu;Ipuruie Municipala;Ipurua'owi Municipalem;Ipurua'a Municipalem;Ipurua'a Municipalowi;Ipurui Municipalem;Ipurua Municipala;Ipurui Municipal;Ipurua Municipalu;Ipurua'owi Municipalowi;Ipuruie Municipal;Ipurua'a Municipal
Montilivi;Montilivi'a;Montilivi'owi
Campo de Futbol de Vallecas
Ciutat de Valencia;Ciutatem de Valencia;Ciutata de Valencia'owi;Ciutatem de'a Valenciie;Ciutata de'owi Valenciie;Ciutatowi de'a Valencia'owi;Ciutata de'owi Valencie;Ciutatem de Valencia'owi;Ciutatowi de Valencia'owi;Ciutatowi de Valencia'a;Ciutatem de'owi Valenciy;Ciutata de'owi Valencia'owi;Ciutatu de'owi Valencii;Ciutatem de'a Valencia;Ciutat de'a Valencia'a;Ciutatowi de Valenciie;Ciutata de Valencie;Ciutat de'owi Valenciy;Ciutatowi de'owi Valenciie;Ciutatu de Valencie;Ciutatem de Valenciie;Ciutat de'owi Valencia;Ciutata de'owi Valencia'a;Ciutatowi de Valencia;Ciutat de Valencia'a;Ciutatowi de'a Valencia'a;Ciutatowi de'a Valenciy;Ciutat de'owi Valenciie;Ciutatowi de'owi Valencia'owi;Ciutatu de Valencia'a;Ciutat de'a Valencia;Ciutatu de'owi Valencia;Ciutat de'a Valencia'owi;Ciutatu de'owi Valencia'owi;Ciutat de Valencie;Ciutatu de Valenciy;Ciutatowi de Valencie;Ciutata de'a Valencia'a;Ciutatu de'owi Valencia'a;Ciutata de'a Valencia'owi;Ciutatem de Valenciy;Ciutatu de'owi Valencie;Ciutatu de'a Valenciie;Ciutatem de'a Valencii;Ciutata de Valenciy;Ciutatu de Valencia'owi;Ciutata de Valencii;Ciutatu de Valencii;Ciutat de'owi Valencia'owi;Ciutatowi de'owi Valencia'a;Ciutatowi de Valencii;Ciutatowi de'owi Valencie;Ciutata de'owi Valenciy;Ciutatem de'owi Valencia;Ciutatu de'a Valencia'owi;Ciutata de'owi Valencii;Ciutatowi de Valenciy;Ciutatu de'a Valencia;Ciutatem de Valencii;Ciutata de Valencia'a;Ciutatem de Valencie;Ciutat de'owi Valencia'a;Ciutat de'owi Valencie;Ciutat de'a Valenciy;Ciutatu de'owi Valenciy;Ciutatowi de'a Valencii;Ciutatem de'a Valencia'a;Ciutatowi de'a Valencia;Ciutatem de'owi Valenciie;Ciutatem de'owi Valencia'owi;Ciutata de Valenciie;Ciutat de Valenciie;Ciutat de'a Valencie;Ciutatu de Valenciie;Ciutata de'owi Valencia;Ciutatem de'owi Valencii;Ciutatem de'owi Valencia'a;Ciutatem de'a Valencie;Ciutatu de'owi Valenciie;Ciutata de Valencia;Ciutatem de'a Valenciy;Ciutata de'a Valencia;Ciutatu de Valencia;Ciutatowi de'owi Valencia;Ciutatu de'a Valencia'a;Ciutata de'a Valenciy;Ciutatowi de'owi Valencii;Ciutatowi de'a Valencie;Ciutatem de Valencia'a;Ciutatu de'a Valencii;Ciutat de Valencii;Ciutat de'a Valenciie;Ciutatu de'a Valenciy;Ciutata de'a Valenciie;Ciutat de'owi Valencii;Ciutatowi de'owi Valenciy;Ciutat de Valenciy;Ciutatu de'a Valencie;Ciutat de'a Valencii;Ciutat de Valencia'owi;Ciutatem de'owi Valencie;Ciutata de'a Valencii;Ciutatem de'a Valencia'owi;Ciutata de'a Valencie;Ciutatowi de'a Valenciie
Coliseum Alfonso Perez;Coliseumu Alfonso'owi Perez;Coliseuma Alfonso Perez;Coliseumem Alfonso Pereza;Coliseumem Alfonso'owi Perezem;Coliseuma Alfonso Perezem;Coliseumu Alfonso'a Pereza;Coliseuma Alfonso'a Perezowi;Coliseumowi Alfonso'owi Perezem;Coliseumowi Alfonso'a Perezu;Coliseuma Alfonso Pereza;Coliseumu Alfonso'a Perezu;Coliseumowi Alfonso'owi Perezowi;Coliseuma Alfonso'a Perezu;Coliseumem Alfonso Perezu;Coliseum Alfonso'a Perezu;Coliseumu Alfonso'a Perezowi;Coliseumowi Alfonso'owi Pereza;Coliseumu Alfonso'a Perez;Coliseumu Alfonso'owi Perezowi;Coliseumu Alfonso'a Perezem;Coliseum Alfonso Perezem;Coliseumem Alfonso'a Perezem;Coliseumowi Alfonso Perezem;Coliseumowi Alfonso Perezu;Coliseum Alfonso Perezu;Coliseumowi Alfonso'owi Perez;Coliseumowi Alfonso'owi Perezu;Coliseumowi Alfonso Perezowi;Coliseuma Alfonso'owi Pereza;Coliseumem Alfonso Perezowi;Coliseuma Alfonso'owi Perezu;Coliseum Alfonso'owi Perezowi;Coliseum Alfonso Perezowi;Coliseum Alfonso'owi Perez;Coliseumem Alfonso'owi Perezu;Coliseumem Alfonso'a Pereza;Coliseuma Alfonso'a Perezem;Coliseumowi Alfonso'a Perezem;Coliseumowi Alfonso Perez;Coliseumu Alfonso Pereza;Coliseuma Alfonso'a Pereza;Coliseum Alfonso'owi Perezu;Coliseumu Alfonso'owi Perezu;Coliseumem Alfonso'a Perezowi;Coliseumu Alfonso Perezem;Coliseum Alfonso'owi Pereza;Coliseumem Alfonso'owi Perez;Coliseumu Alfonso Perez;Coliseumem Alfonso'a Perez;Coliseumu Alfonso Perezowi;Coliseumem Alfonso'owi Pereza;Coliseuma Alfonso'owi Perezem;Coliseumu Alfonso'owi Pereza;Coliseumowi Alfonso'a Pereza;Coliseumem Alfonso'owi Perezowi;Coliseumu Alfonso Perezu;Coliseumem Alfonso Perez;Coliseumu Alfonso'owi Perezem;Coliseumem Alfonso'a Perezu;Coliseumowi Alfonso Pereza;Coliseumem Alfonso Perezem;Coliseum Alfonso'owi Perezem;Coliseum Alfonso'a Perezowi;Coliseuma Alfonso Perezu;Coliseum Alfonso'a Perez;Coliseum Alfonso'a Perezem;Coliseum Alfonso'a Pereza;Coliseumowi Alfonso'a Perez;Coliseuma Alfonso'a Perez;Coliseum Alfonso Pereza;Coliseuma Alfonso Perezowi;Coliseumowi Alfonso'a Perezowi;Coliseuma Alfonso'owi Perez;Coliseuma Alfonso'owi Perezowi
Mendizorrotza;Mendizorrotzy;Mendizorrotzi;Mendizorrotza'a;Mendizorrotzie;Mendizorrotza'owi
Estadio Rafa Bolance;Estadio'owi Rafa'a Bolance'a;Estadio'owi Rafa'owi Bolance'owi;Estadio Rafa'owi Bolance;Estadio'owi Rafa'a Bolance;Estadio Rafi Bolance;Estadio'a Rafy Bolance'a;Estadio Rafi Bolance'a;Estadio Rafa'owi Bolance'a;Estadio Rafa Bolance'a;Estadio'owi Rafa Bolance;Estadio'owi Rafa'owi Bolance;Estadio'a Rafi Bolance'owi;Estadio'a Rafa'owi Bolance'a;Estadio'owi Rafi Bolance;Estadio'a Rafy Bolance;Estadio'owi Rafi Bolance'owi;Estadio'a Rafa'a Bolance;Estadio Rafy Bolance'owi;Estadio'a Rafi Bolance'a;Estadio Rafa Bolance'owi;Estadio'a Rafa Bolance'owi;Estadio Rafy Bolance'a;Estadio'a Rafi Bolance;Estadio Rafie Bolance'a;Estadio'a Rafa Bolance;Estadio'a Rafie Bolance;Estadio Rafa'a Bolance;Estadio'a Rafa'owi Bolance;Estadio'owi Rafa Bolance'owi;Estadio'owi Rafy Bolance'owi;Estadio'owi Rafa'a Bolance'owi;Estadio Rafie Bolance'owi;Estadio Rafi Bolance'owi;Estadio Rafie Bolance;Estadio'a Rafie Bolance'a;Estadio'a Rafy Bolance'owi;Estadio'owi Rafy Bolance;Estadio'a Rafa'owi Bolance'owi;Estadio'owi Rafie Bolance'owi;Estadio Rafa'owi Bolance'owi;Estadio'a Rafa'a Bolance'owi;Estadio Rafa'a Bolance'owi;Estadio'owi Rafie Bolance'a;Estadio'owi Rafa Bolance'a;Estadio'owi Rafa'owi Bolance'a;Estadio Rafa'a Bolance'a;Estadio'owi Rafy Bolance'a;Estadio'a Rafa Bolance'a;Estadio'a Rafa'a Bolance'a;Estadio'a Rafie Bolance'owi;Estadio Rafy Bolance;Estadio'owi Rafi Bolance'a;Estadio'owi Rafie Bolance
El Alcoraz;El Alcorazem;Ela Alcorazem;El Alcorazowi;Elowi Alcoraz;Ela Alcorazowi;Elem Alcoraza;Ela Alcoraz;El Alcoraza;Ela Alcoraza;Elem Alcorazem;Elu Alcorazowi;Ela Alcorazu;Elowi Alcorazu;Elu Alcorazu;Elem Alcorazu;Elu Alcorazem;Elowi Alcoraza;Elowi Alcorazem;Elem Alcorazowi;El Alcorazu;Elem Alcoraz;Elu Alcoraza;Elowi Alcorazowi;Elu Alcoraz
Jose Zorrilla;Jose'owi Zorrillie;Jose'a Zorrilly;Jose'a Zorrilla'a;Jose Zorrilla'a;Jose'owi Zorrilla'owi;Jose'owi Zorrilli;Jose'a Zorrilla;Jose Zorrilli;Jose'a Zorrillie;Jose'owi Zorrilly;Jose Zorrilly;Jose'owi Zorrilla'a;Jose'owi Zorrilla;Jose'a Zorrilla'owi;Jose Zorrillie;Jose'a Zorrilli;Jose Zorrilla'owi
Estadio Gran Canaria;Estadio'owi Gran Canaria;Estadio'owi Granu Canaria'a;Estadio'a Granie Canaria;Estadio Granem Canaria'owi;Estadio'owi Granowi Canaria;Estadio'a Granowi Canariy;Estadio Granie Canaria'owi;Estadio'owi Gran Canariy;Estadio'owi Gran Canaria'a;Estadio Grana Canariy;Estadio'owi Granem Canarie;Estadio'owi Granowi Canaria'a;Estadio Grana Canarie;Estadio'a Granem Canariie;Estadio'a Granem Canaria;Estadio'owi Granu Canariy;Estadio Gran Canaria'owi;Estadio Gran Canarii;Estadio'owi Grana Canaria'a;Estadio'a Granu Canariie;Estadio Granowi Canariy;Estadio Granie Canariie;Estadio Granie Canarii;Estadio'owi Gran Canarii;Estadio'a Gran Canariy;Estadio Granu Canarie;Estadio Granem Canaria'a;Estadio Granu Canaria'owi;Estadio'a Gran Canarii;Estadio Granowi Canarie;Estadio'owi Grana Canaria;Estadio'a Granu Canarii;Estadio'owi Granie Canariie;Estadio'owi Granu Canaria;Estadio'owi Granie Canarie;Estadio'a Granem Canaria'a;Estadio'a Gran Canaria'owi;Estadio'a Granowi Canarie;Estadio Granie Canarie;Estadio'owi Gran Canarie;Estadio'owi Granowi Canarii;Estadio'a Granie Canariie;Estadio'owi Granie Canaria'owi;Estadio'owi Granu Canariie;Estadio'owi Granowi Canarie;Estadio'a Granowi Canaria;Estadio'a Granem Canaria'owi;Estadio'owi Granem Canarii;Estadio'a Granie Canaria'a;Estadio Granem Canariie;Estadio'a Granie Canarii;Estadio'a Grana Canarie;Estadio'a Grana Canaria'owi;Estadio Granu Canaria;Estadio'a Granowi Canariie;Estadio Grana Canarii;Estadio Gran Canariie;Estadio'owi Granem Canaria;Estadio'a Gran Canarie;Estadio'owi Granowi Canariie;Estadio'a Gran Canaria'a;Estadio'a Gran Canariie;Estadio Grana Canaria'owi;Estadio Granem Canariy;Estadio Granu Canarii;Estadio'a Granu Canaria'owi;Estadio'a Granem Canarii;Estadio Granie Canariy;Estadio Granem Canarii;Estadio'owi Granie Canariy;Estadio'a Granie Canaria'owi;Estadio Granem Canarie;Estadio Granowi Canarii;Estadio'a Granu Canaria;Estadio'owi Gran Canaria'owi;Estadio Granu Canariie;Estadio'a Granem Canarie;Estadio'owi Granem Canaria'owi;Estadio Granowi Canaria;Estadio'owi Granu Canarii;Estadio'owi Granem Canariy;Estadio'owi Granu Canaria'owi;Estadio Granu Canariy;Estadio'a Granu Canariy;Estadio Grana Canaria'a;Estadio'a Granowi Canarii;Estadio'owi Gran Canariie;Estadio'owi Grana Canariie;Estadio'owi Granie Canarii;Estadio Granie Canaria'a;Estadio Granowi Canaria'a;Estadio Gran Canaria'a;Estadio'a Grana Canarii;Estadio'owi Grana Canaria'owi;Estadio Grana Canariie;Estadio Gran Canariy;Estadio'a Granie Canarie;Estadio'a Grana Canaria;Estadio'a Granem Canariy;Estadio'a Granowi Canaria'owi;Estadio'owi Granu Canarie;Estadio'a Grana Canaria'a;Estadio Granem Canaria;Estadio Granu Canaria'a;Estadio Granie Canaria;Estadio Granowi Canaria'owi;Estadio'a Grana Canariy;Estadio'owi Granem Canaria'a;Estadio'owi Granowi Canaria'owi;Estadio'a Granu Canarie;Estadio'owi Granem Canariie;Estadio Grana Canaria;Estadio Gran Canarie;Estadio'a Granie Canariy;Estadio'a Granowi Canaria'a;Estadio Granowi Canariie;Estadio'owi Grana Canarii;Estadio'owi Grana Canarie;Estadio'a Gran Canaria;Estadio'a Grana Canariie;Estadio'owi Granowi Canariy;Estadio'owi Granie Canaria;Estadio'a Granu Canaria'a;Estadio'owi Granie Canaria'a;Estadio'owi Grana Canariy
Nuevo Los Carmenes;Nuevo Losa Carmenesowi;Nuevo Los Carmenesem;Nuevo'a Losowi Carmenesowi;Nuevo'a Losa Carmenes;Nuevo'a Los Carmenesa;Nuevo'a Losa Carmenesa;Nuevo'a Losowi Carmenesem;Nuevo Losem Carmenes;Nuevo'owi Losowi Carmenes;Nuevo Losowi Carmenesu;Nuevo'a Losem Carmenes;Nuevo'owi Los Carmenesem;Nuevo'a Los Carmenes;Nuevo'a Losa Carmenesu;Nuevo'owi Los Carmenesu;Nuevo'a Losa Carmenesowi;Nuevo'owi Losa Carmenesa;Nuevo'a Losem Carmenesem;Nuevo'owi Losem Carmenesowi;Nuevo Losu Carmenesu;Nuevo'owi Losem Carmenesu;Nuevo'owi Losowi Carmenesa;Nuevo'owi Losowi Carmenesu;Nuevo'a Losu Carmenesa;Nuevo Losa Carmenesu;Nuevo'a Los Carmenesu;Nuevo'a Losu Carmenesowi;Nuevo'owi Losa Carmenesem;Nuevo'owi Losem Carmenesa;Nuevo'a Losu Carmenesem;Nuevo Losu Carmenesowi;Nuevo Losowi Carmenesem;Nuevo'a Losowi Carmenesu;Nuevo'owi Los Carmenesa;Nuevo Losu Carmenesa;Nuevo'owi Losu Carmenesem;Nuevo'a Losowi Carmenes;Nuevo'owi Losu Carmenesu;Nuevo'owi Losem Carmenesem;Nuevo'a Losu Carmenes;Nuevo Losa Carmenesa;Nuevo'a Losu Carmenesu;Nuevo'a Losem Carmenesowi;Nuevo Losem Carmenesowi;Nuevo Losu Carmenes;Nuevo Losowi Carmenesowi;Nuevo Losowi Carmenes;Nuevo'owi Los Carmenes;Nuevo Losem Carmenesu;Nuevo Losowi Carmenesa;Nuevo'a Losem Carmenesu;Nuevo'owi Losa Carmenesowi;Nuevo'owi Losa Carmenes;Nuevo'owi Losowi Carmenesowi;Nuevo'owi Losa Carmenesu;Nuevo'owi Losu Carmenesowi;Nuevo Losa Carmenes;Nuevo Los Carmenesu;Nuevo'owi Losu Carmenes;Nuevo'owi Los Carmenesowi;Nuevo'a Los Carmenesem;Nuevo Los Carmenesowi;Nuevo Los Carmenesa;Nuevo Losem Carmenesa;Nuevo Losu Carmenesem;Nuevo Losem Carmenesem;Nuevo'a Los Carmenesowi;Nuevo'a Losa Carmenesem;Nuevo'a Losowi Carmenesa;Nuevo'owi Losu Carmenesa;Nuevo'owi Losem Carmenes;Nuevo'a Losem Carmenesa;Nuevo'owi Losowi Carmenesem;Nuevo Losa Carmenesem
Abanca-Balaidos;Abanca-Balaidosu;Abanca-Balaidosem;Abanca-Balaidosa;Abanca-Balaidosowi
San Mames;Sanowi Mames;Sanie Mames;Sanie Mamesa;Sanem Mamesa;Sanem Mamesowi;San Mamesu;Sanu Mamesem;Sanowi Mamesa;Sanu Mames;Sanu Mamesa;Sanowi Mamesu;Sanowi Mamesem;Sana Mames;Sanowi Mamesowi;Sanem Mamesu;San Mamesa;Sanie Mamesowi;Sanie Mamesu;Sana Mamesowi;Sanem Mamesem;Sanie Mamesem;Sana Mamesa;Sanem Mames;San Mamesowi;Sanu Mamesu;Sana Mamesu;Sanu Mamesowi;San Mamesem;Sana Mamesem
Estadio Benito Villamarin;Estadio'owi Benito'a Villamarinie;Estadio Benito'a Villamarinu;Estadio'a Benito'a Villamarinowi;Estadio'owi Benito'owi Villamarinowi;Estadio'owi Benito'a Villamarin;Estadio'a Benito'owi Villamarinowi;Estadio Benito'owi Villamarin;Estadio'a Benito'owi Villamarin;Estadio'a Benito'a Villamarinu;Estadio Benito Villamarinie;Estadio'owi Benito Villamarina;Estadio Benito Villamarinowi;Estadio'a Benito'owi Villamarinie;Estadio Benito'a Villamarinie;Estadio'owi Benito'a Villamarinem;Estadio'a Benito Villamarinu;Estadio'a Benito'owi Villamarinu;Estadio'owi Benito'owi Villamarinem;Estadio Benito'owi Villamarinowi;Estadio'a Benito Villamarinie;Estadio'a Benito Villamarin;Estadio Benito Villamarinem;Estadio'owi Benito Villamarinu;Estadio Benito'owi Villamarina;Estadio'a Benito'a Villamarinem;Estadio Benito'a Villamarinowi;Estadio'a Benito'owi Villamarina;Estadio'a Benito Villamarina;Estadio'owi Benito'a Villamarinowi;Estadio Benito'owi Villamarinem;Estadio Benito Villamarinu;Estadio'owi Benito Villamarinowi;Estadio'owi Benito'a Villamarinu;Estadio Benito'a Villamarinem;Estadio Benito Villamarina;Estadio'owi Benito Villamarinie;Estadio Benito'a Villamarina;Estadio'owi Benito'owi Villamarinu;Estadio'a Benito'owi Villamarinem;Estadio Benito'owi Villamarinu;Estadio Benito'a Villamarin;Estadio'owi Benito Villamarin;Estadio Benito'owi Villamarinie;Estadio'a Benito'a Villamarina;Estadio'owi Benito'owi Villamarinie;Estadio'owi Benito'a Villamarina;Estadio'a Benito'a Villamarin;Estadio'a Benito Villamarinem;Estadio'a Benito'a Villamarinie;Estadio'owi Benito'owi Villamarin;Estadio'owi Benito'owi Villamarina;Estadio'a Benito Villamarinowi;Estadio'owi Benito Villamarinem
Estadi de Son Moix
El Sadar;Ela Sadar;Elem Sadar;Elem Sadaru;Elem Sadara;Ela Sadara;Ela Sadaru;Elu Sadar;Elowi Sadaru;El Sadaru;Elowi Sadarem;Elowi Sadara;Elu Sadaru;Elem Sadarem;Elu Sadarowi;Elu Sadarem;Ela Sadarowi;Ela Sadarem;Elowi Sadarowi;Elowi Sadar;El Sadara;Elu Sadara;El Sadarem;Elem Sadarowi;El Sadarowi
El Molinon-Enrique Castro "Quini"
Anoeta;Anoeta'a;Anoety;Anoeta'owi;Anoetie;Anoeti
Mestalla;Mestallie;Mestally;Mestalli;Mestalla'owi;Mestalla'a
Estadio Municipal de Butarque