\relax 
\bbl@beforestart
\citation{article}
\citation{article}
\citation{book}
\citation{book}
\citation{booklet}
\citation{booklet}
\citation{conference}
\citation{conference}
\citation{inbook}
\citation{inbook}
\citation{incollection}
\citation{incollection}
\citation{manual}
\citation{manual}
\citation{mastersthesis}
\citation{mastersthesis}
\citation{misc}
\citation{misc}
\citation{phdthesis}
\citation{phdthesis}
\citation{proceedings}
\citation{proceedings}
\citation{techreport}
\citation{techreport}
\citation{unpublished}
\citation{unpublished}
\citation{website}
\citation{website}
\citation{lecture}
\citation{lecture}
\citation{conference}
\citation{proceedings}
\citation{article_2}
\citation{article_3}
\citation{techreport_corp}
\citation{Vinyals2019}
\bibdata{refs}
\expandafter\ifx\csname natexlab\endcsname\relax\gdef\natexlab#1{#1}\fi
\bibcite{article}{{1}{1993}{{Adams}}{{}}}
\bibcite{book}{{2}{1993}{{Babington}}{{}}}
\bibcite{booklet}{{3}{1993}{{Caxton}}{{}}}
\bibcite{conference}{{4}{1993}{{Draper}}{{}}}
\bibcite{inbook}{{5}{1993}{{Eston}}{{}}}
\bibcite{incollection}{{6}{1993}{{Farindon}}{{}}}
\bibcite{manual}{{7}{1993}{{Gainsford}}{{}}}
\bibcite{mastersthesis}{{8}{1993}{{Harwood}}{{}}}
\bibcite{misc}{{9}{1993}{{Isley}}{{}}}
\bibcite{phdthesis}{{10}{1993}{{Joslin}}{{}}}
\babel@aux{british}{}
\bibcite{proceedings}{{11}{1993}{{Kidwelly}}{{}}}
\bibcite{techreport}{{12}{1993}{{Lambert}}{{}}}
\bibcite{unpublished}{{13}{1993}{{Marcheford}}{{}}}
\bibcite{website}{{14}{2016}{{Neener}}{{}}}
\bibcite{article_2}{{15}{1993{a}}{{Odams}}{{}}}
\bibcite{article_3}{{16}{1993{b}}{{Odams}}{{}}}
\bibcite{techreport_corp}{{17}{1993}{{Pp Corp}}{{}}}
\bibcite{lecture}{{18}{2016}{{Reener}}{{}}}
\bibcite{Vinyals2019}{{19}{2019}{{Vinyals et~al.}}{{Vinyals, Babuschkin, Czarnecki, Mathieu, Dudzik, Chung, Choi, Powell, Ewalds, Georgiev, Oh, Horgan, Kroiss, Danihelka, Huang, Sifre, Cai, Agapiou, Jaderberg, Vezhnevets, Leblond, Pohlen, Dalibard, Budden, Sulsky, Molloy, Paine, Gulcehre, Wang, Pfaff, Wu, Ring, Yogatama, Wünsch, McKinney, Smith, Schaul, Lillicrap, Kavukcuoglu, Hassabis, Apps and{} Silver}}}
\bibstyle{cuharvard}
