%YAML 1.1
%TAG !u! tag:unity3d.com,2011:
--- !u!114 &11400000
MonoBehaviour:
  m_ObjectHideFlags: 0
  m_CorrespondingSourceObject: {fileID: 0}
  m_PrefabInstance: {fileID: 0}
  m_PrefabAsset: {fileID: 0}
  m_GameObject: {fileID: 0}
  m_Enabled: 1
  m_EditorHideFlags: 0
  m_Script: {fileID: 11500000, guid: f8e6fc0e17b743e41bc28579812c097e, type: 3}
  m_Name: Q3-Unity
  m_EditorClassIdentifier: 
  Id: 0
  QuestionTitle: Question 4
  QuestionText: ' Qu''est-ce qu''un "Prefab" dans Unity ?'
  QuestionOptions:
  - "A) Un script de contr\xF4le"
  - "B) Un mod\xE8le pr\xE9fabriqu\xE9 d'un Objet"
  - 'C) Un type de shader '
  QuestionAnswer: 1
