<?xml version="1.0" encoding="UTF-8" standalone="no"?>
<svg
   id="svg5069"
   version="1.1"
   viewBox="0 0 33.569122 32.595505"
   height="32.595505mm"
   width="33.569122mm"
   xmlns="http://www.w3.org/2000/svg"
   xmlns:svg="http://www.w3.org/2000/svg"
   xmlns:rdf="http://www.w3.org/1999/02/22-rdf-syntax-ns#"
   xmlns:cc="http://creativecommons.org/ns#"
   xmlns:dc="http://purl.org/dc/elements/1.1/">
  <defs
     id="defs5063" />
  <metadata
     id="metadata5066">
    <rdf:RDF>
      <cc:Work
         rdf:about="">
        <dc:format>image/svg+xml</dc:format>
        <dc:type
           rdf:resource="http://purl.org/dc/dcmitype/StillImage" />
      </cc:Work>
    </rdf:RDF>
  </metadata>
  <g
     transform="translate(-106.57538,-132.82724)"
     id="layer1">
    <path
       id="path4592"
       style="fill:none;stroke:#4c4c4c;stroke-width:0.0846635;stroke-linecap:butt;stroke-linejoin:miter;stroke-miterlimit:10;stroke-dasharray:none;stroke-opacity:1"
       d="m 108.50147,132.86957 h 29.71694 v 32.51084 h -29.71694 z" />
    <path
       id="path4596"
       style="fill:#f5f5f5;fill-opacity:1;fill-rule:nonzero;stroke:none;stroke-width:0.0846635"
       d="m 106.63887,134.39352 h 33.44214 v 29.46294 h -33.44214 z" />
    <path
       id="path4598"
       style="fill:none;stroke:#4c4c4c;stroke-width:0.0846635;stroke-linecap:butt;stroke-linejoin:miter;stroke-miterlimit:10;stroke-dasharray:none;stroke-opacity:1"
       d="m 106.63887,134.39352 h 33.44214 v 29.46294 h -33.44214 z" />
    <path
       id="path4608"
       style="fill:none;stroke:#4c4c4c;stroke-width:0.0846635;stroke-linecap:butt;stroke-linejoin:miter;stroke-miterlimit:10;stroke-dasharray:none;stroke-opacity:1"
       d="m 106.61771,149.10382 h 33.48446 v 0.0423 h -33.48446 z" />
  </g>
</svg>
