<?xml version="1.0" encoding="UTF-8" standalone="no"?>
<svg
   width="144.119"
   height="39.908081"
   viewBox="0 0 144.119 39.908082"
   version="1.1"
   id="svg24"
   xmlns="http://www.w3.org/2000/svg"
   xmlns:svg="http://www.w3.org/2000/svg">
  <defs
     id="defs28" />
  <g
     id="logo-flag-text-white"
     transform="translate(-288.547,-170.504)"
     style="fill:#000000">
    <g
       id="Group_11"
       data-name="Group 11"
       transform="translate(288.3,173.149)"
       style="fill:#000000">
      <path
         id="Path_17"
         data-name="Path 17"
         d="M 306.944,211.307 A 16.912,16.912 0 1 1 323.856,194.4 16.936,16.936 0 0 1 306.944,211.312 M 320.189,181.2 a 18.571,18.571 0 1 0 5.5,13.194 18.794,18.794 0 0 0 -5.5,-13.194"
         transform="translate(-288.3,-175.7)"
         fill="#ffffff"
         style="fill:#000000" />
      <path
         id="Path_18"
         data-name="Path 18"
         d="m 316,197.98 c -0.56,2.7 -3.515,4.126 -5.247,5.3 v -13.7 c 2.9,0.713 6.368,2.955 5.247,8.405 m -5.25,-9.885 v -2.6 h -1.63 v 3.005 c -1.121,0.357 -1.732,0.713 -1.63,0.917 a 5.119,5.119 0 0 1 1.63,-0.1 v 15.741 c -1.681,3.26 0.713,8.252 0.713,8.252 0,0 -1.783,-5.349 2.19,-7.9 3.668,-2.343 16.4,-1.223 16.352,-8.405 0,-10.188 -11.767,-10.137 -17.625,-8.915"
         transform="translate(-297.709,-180.508)"
         fill="#ffffff"
         style="fill:#000000" />
      <path
         id="Path_19"
         data-name="Path 19"
         d="m 384.221,186.483 a 4.663,4.663 0 0 0 0.866,0.051 2.758,2.758 0 0 0 1.936,-0.611 2.117,2.117 0 0 0 0.662,-1.681 c 0,-1.375 -0.866,-2.038 -2.649,-2.038 a 5.022,5.022 0 0 0 -0.866,0.1 v 4.177 z m 0,2.853 v 4.432 H 380.4 v -14.162 a 29.174,29.174 0 0 1 4.279,-0.306 c 4.432,0 6.622,1.579 6.622,4.788 a 5.032,5.032 0 0 1 -1.477,3.922 6.265,6.265 0 0 1 -4.381,1.324 9.753,9.753 0 0 1 -1.223,0"
         transform="translate(-333.484,-177.466)"
         fill="#ffffff"
         style="fill:#000000" />
    </g>
    <rect
       id="Rectangle_29"
       data-name="Rectangle 29"
       width="4.2789998"
       height="14.263"
       transform="translate(347.951,175.187)"
       fill="#ffffff"
       x="0"
       y="0"
       style="fill:#000000" />
    <g
       id="Group_12"
       data-name="Group 12"
       transform="translate(355.032,174.983)"
       style="fill:#000000">
      <path
         id="Path_20"
         data-name="Path 20"
         d="m 423.121,185.973 h 1.07 a 2.269,2.269 0 0 0 1.579,-0.509 1.639,1.639 0 0 0 0.56,-1.375 q 0,-1.834 -2.14,-1.834 a 6.358,6.358 0 0 0 -1.07,0.1 z m 0,2.8 v 4.992 H 419.3 v -14.159 a 42.086,42.086 0 0 1 5.094,-0.306 c 3.922,0 5.858,1.477 5.858,4.381 a 3.871,3.871 0 0 1 -0.764,2.292 4.207,4.207 0 0 1 -1.988,1.527 v 0.051 a 2.646,2.646 0 0 1 0.968,0.866 6.5,6.5 0 0 1 0.764,1.477 l 1.426,3.922 h -4.024 l -1.223,-3.719 a 1.949,1.949 0 0 0 -0.56,-0.968 1.2,1.2 0 0 0 -0.866,-0.306 h -0.866 z"
         transform="translate(-419.3,-179.3)"
         fill="#ffffff"
         style="fill:#000000" />
    </g>
    <path
       id="Path_21"
       data-name="Path 21"
       d="m 448.551,183.8 h 2.6 l -1.273,-5.3 h -0.051 z m 2.089,-9.781 h -3.107 l 1.936,-3.515 h 4.279 z m -2.8,12.684 -0.662,2.751 H 443.1 l 4.687,-14.263 h 4.126 l 4.687,14.259 h -4.126 l -0.662,-2.751 z"
       transform="translate(-75.944)"
       fill="#ffffff"
       style="fill:#000000" />
    <path
       id="Path_22"
       data-name="Path 22"
       d="m 480.816,179.7 v 3.209 h -3.871 v 11.054 h -3.973 V 182.909 H 469.1 V 179.7 Z"
       transform="translate(-88.7,-4.513)"
       fill="#ffffff"
       style="fill:#000000" />
    <g
       id="Group_13"
       data-name="Group 13"
       transform="translate(393.237,175.034)"
       style="fill:#000000">
      <path
         id="Path_23"
         data-name="Path 23"
         d="m 504.233,183.373 a 8.828,8.828 0 0 0 -4.024,-0.968 2.5,2.5 0 0 0 -1.375,0.306 1,1 0 0 0 -0.458,0.866 c 0,0.56 0.408,0.917 1.274,1.172 a 11.092,11.092 0 0 1 4.33,1.987 4.145,4.145 0 0 1 -0.2,6.164 7.27,7.27 0 0 1 -4.483,1.121 10.863,10.863 0 0 1 -2.7,-0.408 6,6 0 0 1 -2.292,-1.07 l 0.866,-3.005 a 8.413,8.413 0 0 0 2.14,1.07 6.866,6.866 0 0 0 2.139,0.408 c 1.172,0 1.783,-0.408 1.783,-1.273 0,-0.56 -0.509,-0.968 -1.579,-1.274 a 10.417,10.417 0 0 1 -4.075,-1.987 3.808,3.808 0 0 1 -1.223,-2.9 3.719,3.719 0 0 1 1.477,-3.056 6.681,6.681 0 0 1 4.177,-1.121 10.873,10.873 0 0 1 4.89,0.968 z"
         transform="translate(-494.3,-179.4)"
         fill="#ffffff"
         style="fill:#000000" />
    </g>
    <path
       id="Path_24"
       data-name="Path 24"
       d="m 523.722,185.762 h 0.051 l 3.668,-6.062 h 4.483 l -4.483,6.826 4.687,7.437 h -4.483 l -3.872,-6.622 h -0.051 v 6.622 H 519.8 V 179.7 h 3.922 z"
       transform="translate(-113.573,-4.513)"
       fill="#ffffff"
       style="fill:#000000" />
    <path
       id="Path_25"
       data-name="Path 25"
       d="m 550.651,183.8 h 2.6 l -1.274,-5.3 h -0.051 z m 2.089,-9.781 h -3.107 l 1.936,-3.515 h 4.279 z m -2.8,12.684 -0.662,2.751 H 545.2 l 4.687,-14.263 h 4.126 l 4.687,14.259 h -4.126 l -0.662,-2.751 z"
       transform="translate(-126.034)"
       fill="#ffffff"
       style="fill:#000000" />
    <g
       id="Group_14"
       data-name="Group 14"
       transform="translate(334.758,194.289)"
       style="fill:#000000">
      <path
         id="Path_26"
         data-name="Path 26"
         d="m 389.433,221.173 a 8.828,8.828 0 0 0 -4.024,-0.968 2.5,2.5 0 0 0 -1.375,0.306 1,1 0 0 0 -0.458,0.866 c 0,0.56 0.408,0.917 1.274,1.172 a 11.093,11.093 0 0 1 4.33,1.987 4.146,4.146 0 0 1 -0.2,6.164 7.27,7.27 0 0 1 -4.483,1.121 10.866,10.866 0 0 1 -2.7,-0.408 6.866,6.866 0 0 1 -2.292,-1.07 l 0.866,-3.005 a 8.414,8.414 0 0 0 2.139,1.07 6.867,6.867 0 0 0 2.14,0.408 c 1.172,0 1.783,-0.408 1.783,-1.274 0,-0.56 -0.509,-0.968 -1.579,-1.273 a 10.419,10.419 0 0 1 -4.075,-1.987 3.808,3.808 0 0 1 -1.223,-2.9 3.719,3.719 0 0 1 1.477,-3.056 6.681,6.681 0 0 1 4.177,-1.121 10.874,10.874 0 0 1 4.89,0.968 z"
         transform="translate(-379.5,-217.2)"
         fill="#ffffff"
         style="fill:#000000" />
    </g>
    <path
       id="Path_27"
       data-name="Path 27"
       d="m 415.016,217.6 v 3.209 h -3.871 v 11.054 h -3.973 V 220.809 H 403.3 V 217.6 Z"
       transform="translate(-56.418,-23.107)"
       fill="#ffffff"
       style="fill:#000000" />
    <g
       id="Group_15"
       data-name="Group 15"
       transform="translate(360.686,194.289)"
       style="fill:#000000">
      <path
         id="Path_28"
         data-name="Path 28"
         d="m 434.221,223.822 h 1.07 a 2.269,2.269 0 0 0 1.579,-0.509 1.639,1.639 0 0 0 0.56,-1.375 q 0,-1.834 -2.14,-1.834 a 6.36,6.36 0 0 0 -1.07,0.1 z m 0,2.853 v 4.992 H 430.4 v -14.161 a 42.1,42.1 0 0 1 5.094,-0.306 c 3.922,0 5.858,1.477 5.858,4.381 a 3.871,3.871 0 0 1 -0.764,2.292 4.207,4.207 0 0 1 -1.988,1.527 v 0.051 a 2.647,2.647 0 0 1 0.968,0.866 6.5,6.5 0 0 1 0.764,1.477 l 1.426,3.922 h -4.024 L 436.513,228 a 1.949,1.949 0 0 0 -0.56,-0.968 1.2,1.2 0 0 0 -0.866,-0.306 h -0.866 z"
         transform="translate(-430.4,-217.2)"
         fill="#ffffff"
         style="fill:#000000" />
    </g>
    <path
       id="Path_29"
       data-name="Path 29"
       d="m 460.051,226.158 h 2.6 l -1.273,-5.3 h -0.051 z m -0.713,2.955 -0.662,2.751 H 454.6 l 4.687,-14.263 h 4.126 l 4.687,14.263 h -4.126 l -0.662,-2.751 z"
       transform="translate(-81.586,-23.107)"
       fill="#ffffff"
       style="fill:#000000" />
    <path
       id="Path_30"
       data-name="Path 30"
       d="M 492.349,225.394 H 492.4 V 217.6 h 3.821 v 14.263 H 492.4 l -4.279,-7.845 h -0.051 v 7.845 H 484.3 V 217.6 h 3.77 z"
       transform="translate(-96.157,-23.107)"
       fill="#ffffff"
       style="fill:#000000" />
    <path
       id="Path_31"
       data-name="Path 31"
       d="m 516.151,226.158 h 2.6 l -1.274,-5.3 h -0.051 z m -0.713,2.955 -0.662,2.751 H 510.7 l 4.686,-14.263 h 4.126 l 4.687,14.263 h -4.126 l -0.662,-2.751 z"
       transform="translate(-109.108,-23.107)"
       fill="#ffffff"
       style="fill:#000000" />
  </g>
</svg>
