{
  "trips": [
    {
      "id": "xxx",
      "name": "Alcúdia Garden"
    },
    {
      "id": "yyy",
      "name": "Pinero Tal"
    },
    {
      "id": "zzz",
      "name": "Anba Romani"
    },
    {
      "id": "ddd",
      "name": "MANAUS"
    }
  ]
}
