1p,1,1d,3,1d,1,1c,2,18,5,5,5,z,5,5,5,z,5,5,5,z,5,5,5,z,f,16,1,1d,1,1c,3,1b,3,1b,3,19,7,17,1,1,3,1,1,17,1,1,3,1,1,17,1,1,3,1,1,17,1,5,1,17,7,1a,1,1d,1|d-entry,b:1;d-monster,b:5,c:6,i:8,j:9,e:i;d-column,9:6,b:6,j:6,l:6,9:8,b:8,j:8,l:8;d-stairs-down,c:f,i:f;d-door1s,d:f,h:f;d-stairs-up,c:g,i:g;|c:1@Dveře se otevírají pouze za soumraku a za úsvitu a to tak, že kompletně zmizí. Za soumraku se z podzemí vyvalí osm trolů a ráno se zas vrací.;a:7@V místnosti jsou dva trolové, hromada rozlámaného dřeva, kameny vhodné na tvorbu kamenných mlatů a kamenné mlaty a dřevěné kyje.;k:7@V místnosti jsou dva trolové, hromada zmrzlých potravin a mražená elfka.;f:e@Široký tunel, plný hromad odpadků, dřeva a kamení - lze rozeznat několik doupat, buď pro jednotlivé troly, nebo celé trolí rodiny. V koutě chrní jeden trol.



1p,1,1d,3,1d,g,x,2,a,5,t,5,5,5,1,5,t,5,5,b,t,5,5,5,1,5,t,5,5,5,z,f,16,1,1d,1,1c,3,1b,3,1b,3,19,7,17,1,1,3,1,1,17,1,1,3,1,1,17,1,1,3,1,1,17,1,5,1,17,7,1a,1,1d,1,19,9,15,9,15,9,15,9,17,1,3,1,19,1,3,1,19,1,3,1,17,9,15,9,15,9,15,9,19,1,8,3,12,1,8,1,1,1,12,c,1b,1,1d,1,1a,h,x,h,x,h,x,h,x,i,w,i,w,i,w,i,w,i,w,i,y,b|d-entry,b:1;d-column,p:4,r:4,9:6,b:6,j:6,l:6,p:6,r:6,9:8,b:8,j:8,l:8,t:18,u:18,t:19,u:19,v:19,u:1a;d-monster,b:5,c:6,i:8,j:9,e:i,c:q,i:q;d-door1,n:6;d-stairs-down,c:f,i:f,p:y,o:z,q:z,p:10;d-door1s,d:f,h:f;d-stairs-up,c:g,i:g;|c:1@Dveře se otevírají pouze za soumraku a za úsvitu a to tak, že kompletně zmizí. Za soumraku se z podzemí vyvalí osm trolů a ráno se zas vrací.;h:3@Chapadla - vyrazí z nenápadných škvír ve stěnách ve chvíli, kdy postavy dojdou doprostřed chodby.;q:5@Místnost, ve které se můžou hrdinové schovat před troly (ovšem dveře dlouho nevydrží). ...a v koutě by mohla být truhla s lektvary proti mrazu a možná i vodní dech...;a:7@V místnosti jsou dva trolové, hromada rozlámaného dřeva, kameny vhodné na tvorbu kamenných mlatů a kamenné mlaty a dřevěné kyje.;k:7@V místnosti jsou dva trolové, hromada zmrzlých potravin a mražená elfka.;f:e@Široký tunel, plný hromad odpadků, dřeva a kamení - lze rozeznat několik doupat, buď pro jednotlivé troly, nebo celé trolí rodiny. V koutě chrní jeden trol.;f:r@Ledová řeka, přes kterou vedou dva můstky - jak postavy vstoupí do sálu, začnou z řeky vylézat ledoví obři (asi dva).;t:17@Jezero plné ledové vody s několika slepýma zubatýma rybama. Uprostřed je ostrůvek s oltářem, na kterém leží kamenná podložka a na ní ledová kniha - jak ji zkusí odnést bez podložky, začne tát. Jak se podložka dotkne hladiny, jezero zamrzne - jinak by se jim to zpátky blbě neslo :-).



1p,1,1d,3,1d,g,x,2,a,5,t,5,5,5,1,5,t,5,5,b,t,5,5,5,1,5,t,5,5,5,z,f,16,1,1d,1,1c,3,1b,3,1b,3,19,7,17,1,1,3,1,1,17,1,1,3,1,1,17,1,1,3,1,1,17,1,5,1,17,7,1a,1,1d,1,19,9,15,9,15,9,15,9,17,1,3,1,19,1,3,1,19,1,3,1,17,9,15,9,8,4,t,l,t,9,8,4,x,1,8,3,1,4,x,1,8,1,1,1,12,c,1b,1,1d,1,1a,h,x,h,x,h,x,h,x,i,w,i,w,i,w,i,w,i,w,i,y,b|d-entry,b:1;d-column,p:4,r:4,9:6,b:6,j:6,l:6,p:6,r:6,9:8,b:8,j:8,l:8,t:18,u:18,t:19,u:19,v:19,u:1a;d-monster,b:5,c:6,i:8,j:9,e:i,c:q,i:q;d-door1,n:6;d-stairs-down,c:f,i:f,p:y,o:z,q:z,p:10;d-door1s,d:f,h:f;d-stairs-up,c:g,i:g;d-door2s,f:y;|c:1@Dveře se otevírají pouze za soumraku a za úsvitu a to tak, že kompletně zmizí. Za soumraku se z podzemí vyvalí osm trolů a ráno se zas vrací.;h:3@Chapadla - vyrazí z nenápadných škvír ve stěnách ve chvíli, kdy postavy dojdou doprostřed chodby.;q:5@Místnost, ve které se můžou hrdinové schovat před troly (ovšem dveře dlouho nevydrží). ...a v koutě by mohla být truhla s lektvary proti mrazu a možná i vodní dech...;a:7@V místnosti jsou dva trolové, hromada rozlámaného dřeva, kameny vhodné na tvorbu kamenných mlatů a kamenné mlaty a dřevěné kyje.;k:7@V místnosti jsou dva trolové, hromada zmrzlých potravin a mražená elfka.;f:e@Široký tunel, plný hromad odpadků, dřeva a kamení - lze rozeznat několik doupat, buď pro jednotlivé troly, nebo celé trolí rodiny. V koutě chrní jeden trol.;f:r@Ledová řeka, přes kterou vedou dva můstky - jak postavy vstoupí do sálu, začnou z řeky vylézat ledoví obři (asi dva).;v:x@truhla s pokladem a nápisem, nabádajícím k odchodu;t:17@Jezero plné ledové vody s několika slepýma zubatýma rybama. Uprostřed je ostrůvek s oltářem, na kterém leží kamenná podložka a na ní ledová kniha - jak ji zkusí odnést bez podložky, začne tát. Jak se podložka dotkne hladiny, jezero zamrzne - jinak by se jim to zpátky blbě neslo :-).

1p,1,1d,3,1d,g,x,2,a,5,t,5,5,5,1,5,t,5,5,b,t,5,5,5,1,5,t,5,5,5,z,f,16,1,1d,1,1c,3,1b,3,1b,3,19,7,17,1,1,3,1,1,17,1,1,3,1,1,17,1,1,3,1,1,17,1,5,1,17,7,1a,1,1d,1,19,9,15,9,15,9,15,9,17,1,3,1,19,1,3,1,19,1,3,1,17,9,15,9,8,4,t,l,t,9,8,4,x,1,8,3,1,4,x,1,8,1,1,1,12,c,1b,1,1d,1,1a,h,x,h,x,h,x,h,x,i,w,i,w,i,w,i,w,i,w,i,y,b|d-entry,b:1;d-column,p:4,r:4,9:6,b:6,j:6,l:6,p:6,r:6,9:8,b:8,j:8,l:8,t:18,u:18,t:19,u:19,v:19,u:1a;d-monster,b:5,c:6,i:8,j:9,e:i,c:q,i:q;d-door1,n:6;d-stairs-down,c:f,i:f,p:y,o:z,q:z,p:10;d-door1s,d:f,h:f;d-stairs-up,c:g,i:g;d-door2s,f:y;|c:1@Dve%C5%99e%20se%20otev%C3%ADraj%C3%AD%20pouze%20za%20soumraku%20a%20za%20%C3%BAsvitu%20a%20to%20tak%2C%20%C5%BEe%20kompletn%C4%9B%20zmiz%C3%AD.%20Za%20soumraku%20se%20z%20podzem%C3%AD%20vyval%C3%AD%20osm%20trol%C5%AF%20a%20r%C3%A1no%20se%20zas%20vrac%C3%AD.;h:3@Chapadla%20-%20vyraz%C3%AD%20z%20nen%C3%A1padn%C3%BDch%20%C5%A1kv%C3%ADr%20ve%20st%C4%9Bn%C3%A1ch%20ve%20chv%C3%ADli%2C%20kdy%20postavy%20dojdou%20doprost%C5%99ed%20chodby.;q:5@M%C3%ADstnost%2C%20ve%20kter%C3%A9%20se%20m%C5%AF%C5%BEou%20hrdinov%C3%A9%20schovat%20p%C5%99ed%20troly%20(ov%C5%A1em%20dve%C5%99e%20dlouho%20nevydr%C5%BE%C3%AD).%20...a%20v%20kout%C4%9B%20by%20mohla%20b%C3%BDt%20truhla%20s%20lektvary%20proti%20mrazu%20a%20mo%C5%BEn%C3%A1%20i%20vodn%C3%AD%20dech...;a:7@V%20m%C3%ADstnosti%20jsou%20dva%20trolov%C3%A9%2C%20hromada%20rozl%C3%A1man%C3%A9ho%20d%C5%99eva%2C%20kameny%20vhodn%C3%A9%20na%20tvorbu%20kamenn%C3%BDch%20mlat%C5%AF%20a%20kamenn%C3%A9%20mlaty%20a%20d%C5%99ev%C4%9Bn%C3%A9%20kyje.;k:7@V%20m%C3%ADstnosti%20jsou%20dva%20trolov%C3%A9%2C%20hromada%20zmrzl%C3%BDch%20potravin%20a%20mra%C5%BEen%C3%A1%20elfka.;f:e@%C5%A0irok%C3%BD%20tunel%2C%20pln%C3%BD%20hromad%20odpadk%C5%AF%2C%20d%C5%99eva%20a%20kamen%C3%AD%20-%20lze%20rozeznat%20n%C4%9Bkolik%20doupat%2C%20bu%C4%8F%20pro%20jednotliv%C3%A9%20troly%2C%20nebo%20cel%C3%A9%20trol%C3%AD%20rodiny.%20V%20kout%C4%9B%20chrn%C3%AD%20jeden%20trol.;f:r@Ledov%C3%A1%20%C5%99eka%2C%20p%C5%99es%20kterou%20vedou%20dva%20m%C5%AFstky%20-%20jak%20postavy%20vstoup%C3%AD%20do%20s%C3%A1lu%2C%20za%C4%8Dnou%20z%20%C5%99eky%20vyl%C3%A9zat%20ledov%C3%AD%20ob%C5%99i%20(asi%20dva).;v:x@truhla%20s%20pokladem%20a%20n%C3%A1pisem%2C%20nab%C3%A1daj%C3%ADc%C3%ADm%20k%20odchodu;t:17@Jezero%20pln%C3%A9%20ledov%C3%A9%20vody%20s%20n%C4%9Bkolika%20slep%C3%BDma%20zubat%C3%BDma%20rybama.%20Uprost%C5%99ed%20je%20ostr%C5%AFvek%20s%20olt%C3%A1%C5%99em%2C%20na%20kter%C3%A9m%20le%C5%BE%C3%AD%20kamenn%C3%A1%20podlo%C5%BEka%20a%20na%20n%C3%AD%20ledov%C3%A1%20kniha%20-%20jak%20ji%20zkus%C3%AD%20odn%C3%A9st%20bez%20podlo%C5%BEky%2C%20za%C4%8Dne%20t%C3%A1t.%20Jak%20se%20podlo%C5%BEka%20dotkne%20hladiny%2C%20jezero%20zamrzne%20-%20jinak%20by%20se%20jim%20to%20zp%C3%A1tky%20blb%C4%9B%20neslo%20%3A-).
