{
  "project_info": {
    "project_number": "128760566156",
    "firebase_url": "https://notifyelsewhere.firebaseio.com",
    "project_id": "notifyelsewhere",
    "storage_bucket": "notifyelsewhere.appspot.com"
  },
  "client": [
    {
      "client_info": {
        "mobilesdk_app_id": "1:128760566156:android:56db028f9215f3fe",
        "android_client_info": {
          "package_name": "com.tomasmichalkevic.notifyelsewhere"
        }
      },
      "oauth_client": [
        {
          "client_id": "128760566156-6o47mc5mn0jcfd5ifqicall8nbiej7sl.apps.googleusercontent.com",
          "client_type": 1,
          "android_info": {
            "package_name": "com.tomasmichalkevic.notifyelsewhere",
            "certificate_hash": "572A0BAB83E4B82C07D5658A6F1C5F3AE461B4C8"
          }
        },
        {
          "client_id": "128760566156-fr43hhibn6dvf48bjkst3n2kj9ktsjf5.apps.googleusercontent.com",
          "client_type": 3
        }
      ],
      "api_key": [
        {
          "current_key": "AIzaSyCbmgtem-3devIfWZ0GzNg4zW66L6pMl0A"
        }
      ],
      "services": {
        "analytics_service": {
          "status": 1
        },
        "appinvite_service": {
          "status": 2,
          "other_platform_oauth_client": [
            {
              "client_id": "128760566156-fr43hhibn6dvf48bjkst3n2kj9ktsjf5.apps.googleusercontent.com",
              "client_type": 3
            }
          ]
        },
        "ads_service": {
          "status": 2
        }
      }
    }
  ],
  "configuration_version": "1"
}