{
  "kind": "collectionType",
  "collectionName": "programme_entries",
  "info": {
    "singularName": "programme-entry",
    "pluralName": "programme-entries",
    "displayName": "ProgrammeEntry",
    "description": ""
  },
  "options": {
    "draftAndPublish": false
  },
  "pluginOptions": {
    "i18n": {
      "localized": true
    }
  },
  "attributes": {
    "Time": {
      "pluginOptions": {
        "i18n": {
          "localized": true
        }
      },
      "type": "string",
      "required": true
    },
    "BlockNumber": {
      "pluginOptions": {
        "i18n": {
          "localized": true
        }
      },
      "type": "integer"
    },
    "Name": {
      "pluginOptions": {
        "i18n": {
          "localized": true
        }
      },
      "type": "blocks",
      "required": true
    },
    "Moderator": {
      "pluginOptions": {
        "i18n": {
          "localized": true
        }
      },
      "type": "string"
    },
    "IsSubjectToChange": {
      "pluginOptions": {
        "i18n": {
          "localized": true
        }
      },
      "type": "boolean"
    },
    "speakers": {
      "type": "relation",
      "relation": "oneToMany",
      "target": "api::speaker.speaker",
      "mappedBy": "programme_entry"
    },
    "Order": {
      "pluginOptions": {
        "i18n": {
          "localized": true
        }
      },
      "type": "integer",
      "required": true
    }
  }
}
