{
  "kind": "collectionType",
  "collectionName": "contacts",
  "info": {
    "singularName": "contact",
    "pluralName": "contacts",
    "displayName": "Contact",
    "description": ""
  },
  "options": {
    "draftAndPublish": false
  },
  "pluginOptions": {
    "i18n": {
      "localized": true
    }
  },
  "attributes": {
    "Heading": {
      "pluginOptions": {
        "i18n": {
          "localized": true
        }
      },
      "type": "string",
      "required": true
    },
    "Content": {
      "pluginOptions": {
        "i18n": {
          "localized": true
        }
      },
      "type": "blocks"
    },
    "Order": {
      "pluginOptions": {
        "i18n": {
          "localized": true
        }
      },
      "type": "integer",
      "required": true
    }
  }
}
