{
  "kind": "singleType",
  "collectionName": "abouts",
  "info": {
    "singularName": "about",
    "pluralName": "abouts",
    "displayName": "About",
    "description": ""
  },
  "options": {
    "draftAndPublish": false
  },
  "pluginOptions": {
    "i18n": {
      "localized": true
    }
  },
  "attributes": {
    "Text": {
      "pluginOptions": {
        "i18n": {
          "localized": true
        }
      },
      "type": "blocks"
    },
    "HighlightedText": {
      "pluginOptions": {
        "i18n": {
          "localized": true
        }
      },
      "type": "string",
      "default": "Become part of an exclusive technology and digital community.",
      "required": true
    },
    "PreviousHeader": {
      "pluginOptions": {
        "i18n": {
          "localized": true
        }
      },
      "type": "string",
      "required": true
    }
  }
}
