{
  "collectionName": "components_about_enticement_small_texts",
  "info": {
    "displayName": "SmallText",
    "icon": "underline"
  },
  "options": {},
  "attributes": {
    "Text": {
      "type": "string"
    }
  }
}
