{
  "kind": "collectionType",
  "collectionName": "partners",
  "info": {
    "singularName": "partner",
    "pluralName": "partners",
    "displayName": "Partner",
    "description": ""
  },
  "options": {
    "draftAndPublish": false
  },
  "pluginOptions": {
    "i18n": {
      "localized": true
    }
  },
  "attributes": {
    "SectionName": {
      "pluginOptions": {
        "i18n": {
          "localized": true
        }
      },
      "type": "string",
      "required": true
    },
    "Partner": {
      "displayName": "Partners",
      "type": "component",
      "repeatable": true,
      "pluginOptions": {
        "i18n": {
          "localized": true
        }
      },
      "component": "partner-section.partners"
    },
    "Columns": {
      "pluginOptions": {
        "i18n": {
          "localized": true
        }
      },
      "type": "integer",
      "required": true,
      "default": 1
    },
    "Order": {
      "pluginOptions": {
        "i18n": {
          "localized": true
        }
      },
      "type": "integer",
      "required": true
    }
  }
}
