<?xml version="1.0" encoding="UTF-8" standalone="no"?>
<!-- Created with Inkscape (http://www.inkscape.org/) -->

<svg
   width="23.983898mm"
   height="38.984772mm"
   viewBox="0 0 23.983899 38.984772"
   preserveAspectRatio="none"
   version="1.1"
   id="svg479"
   inkscape:export-filename="target_12.svg"
   inkscape:export-xdpi="96"
   inkscape:export-ydpi="96"
   sodipodi:docname="target_13.svg"
   inkscape:version="1.2 (dc2aedaf03, 2022-05-15)"
   xmlns:inkscape="http://www.inkscape.org/namespaces/inkscape"
   xmlns:sodipodi="http://sodipodi.sourceforge.net/DTD/sodipodi-0.dtd"
   xmlns="http://www.w3.org/2000/svg"
   xmlns:svg="http://www.w3.org/2000/svg">
  <sodipodi:namedview
     id="namedview481"
     pagecolor="#ffffff"
     bordercolor="#666666"
     borderopacity="1.0"
     inkscape:showpageshadow="2"
     inkscape:pageopacity="0.0"
     inkscape:pagecheckerboard="0"
     inkscape:deskcolor="#d1d1d1"
     inkscape:document-units="mm"
     showgrid="false"
     inkscape:zoom="5.6262888"
     inkscape:cx="45.411818"
     inkscape:cy="73.583141"
     inkscape:window-width="1920"
     inkscape:window-height="1009"
     inkscape:window-x="-8"
     inkscape:window-y="-8"
     inkscape:window-maximized="1"
     inkscape:current-layer="layer1" />
  <defs
     id="defs476" />
  <g
     inkscape:label="Layer 1"
     inkscape:groupmode="layer"
     id="layer1"
     transform="translate(42.44136,52.92604)">
    <g
       id="g104807"
       transform="matrix(0.41843537,0,0,0.41843537,-79.191608,-291.64018)">
      <path
         id="rect104803"
         style="opacity:1;stroke-width:1.15558;stroke-linecap:round;stroke-linejoin:round;stroke-dashoffset:347.717;paint-order:stroke markers fill"
         d="m 114.6046,617.34119 h 3.76437 v 38.63774 h -3.76437 z" />
      <path
         id="ellipse104805"
         style="opacity:1;fill:#ffa966;stroke-width:0.826373;stroke-linecap:round;stroke-linejoin:round;stroke-dashoffset:347.717;paint-order:stroke markers fill;fill-opacity:1"
         d="m 137.50128,599.46497 a 21.014488,21.291557 0 0 1 -21.01449,21.29155 21.014488,21.291557 0 0 1 -21.014485,-21.29155 21.014488,21.291557 0 0 1 21.014485,-21.29156 21.014488,21.291557 0 0 1 21.01449,21.29156 z" />
    </g>
    <path
       style="fill:#000000;fill-opacity:1;stroke:none;stroke-width:0.0219729;stroke-linecap:square;stroke-linejoin:round;stroke-miterlimit:4;stroke-dasharray:none;stroke-dashoffset:347.717;stroke-opacity:1;paint-order:stroke markers fill"
       d="m -34.502232,-30.30569 c -0.248147,-0.0536 -0.44306,-0.16641 -0.694656,-0.40151 -0.257645,-0.24059 -0.462621,-0.50888 -0.603059,-0.78921 -0.143466,-0.28646 -0.191386,-0.45961 -0.191746,-0.6931 -5.97e-4,-0.44459 0.318695,-1.05642 0.811219,-1.55386 0.25678,-0.25934 0.460808,-0.41182 1.019978,-0.76221 1.160852,-0.72742 1.642186,-1.20763 2.019588,-2.01497 0.26393,-0.56456 0.332393,-0.89394 0.355468,-1.71002 0.01689,-0.59503 0.0058,-0.72247 -0.06276,-0.72247 -0.02436,0 -0.196475,0.30858 -0.425562,0.76305 -0.435736,0.8644 -0.761761,1.43489 -1.133754,1.98392 -0.968164,1.42892 -2.197879,2.59617 -3.028534,2.87464 -0.308276,0.10336 -0.828623,0.10966 -1.125514,0.0135 -0.644513,-0.20852 -1.013787,-0.77282 -0.904815,-1.38258 0.07647,-0.42797 0.324321,-0.85837 0.867011,-1.50566 0.610785,-0.72848 0.717751,-0.90996 0.719572,-1.22085 0.0012,-0.15876 -0.01441,-0.23535 -0.07012,-0.3488 -0.169633,-0.34568 -0.466958,-0.54229 -0.909618,-0.60151 -0.203276,-0.0275 -0.287928,-0.0246 -0.531542,0.018 -0.159364,0.0279 -0.348618,0.0579 -0.42056,0.0671 -0.117255,0.0158 -0.126826,0.0113 -0.09248,-0.0297 0.08352,-0.10088 0.784484,-0.34314 1.110599,-0.38387 0.088,-0.0113 0.264473,-0.007 0.392129,0.0113 0.327038,0.0446 0.559456,0.16483 0.815529,0.42134 0.233764,0.23415 0.274613,0.33562 0.334526,0.83085 0.07929,0.65541 -0.0099,0.88156 -0.684385,1.73423 -0.493517,0.62392 -0.592921,0.91592 -0.386868,1.13638 0.05958,0.0637 0.08469,0.0696 0.255042,0.0597 0.343332,-0.0203 0.83072,-0.32369 1.272664,-0.79147 0.447617,-0.47377 1.142995,-1.4543 1.619406,-2.28337 0.374805,-0.65227 0.838199,-1.5722 0.807461,-1.60294 -0.01554,-0.0158 -0.177492,-0.0547 -0.359688,-0.0874 -0.400715,-0.0712 -0.681536,-0.16169 -1.028909,-0.33128 -0.460034,-0.22473 -0.665181,-0.34314 -0.960957,-0.55463 -0.865218,-0.61863 -1.486483,-0.96576 -1.945873,-1.08718 -0.135922,-0.0358 -0.371718,-0.0685 -0.567488,-0.0781 -0.610321,-0.0304 -1.056544,0.11169 -1.3805,0.43934 -0.210122,0.21258 -0.326205,0.4402 -0.379136,0.74339 -0.06884,0.3943 0.0043,0.68148 0.236052,0.92945 0.305713,0.32686 0.808056,0.42583 1.473196,0.29029 0.439515,-0.0896 0.464866,-0.0644 0.109171,0.10877 -0.791051,0.38471 -1.187114,0.43172 -1.671426,0.19839 -0.592846,-0.28563 -0.912924,-0.92241 -0.876872,-1.74452 0.0236,-0.53788 0.131464,-0.84837 0.408723,-1.17629 0.336933,-0.39853 0.8189,-0.68774 1.317792,-0.7907 0.4065,-0.084 1.090813,-0.0644 1.496194,0.0428 0.552736,0.14592 1.053141,0.3909 1.831134,0.89656 0.464436,0.3019 1.074326,0.60737 1.353497,0.67797 0.107797,0.0275 0.287847,0.0565 0.400109,0.0653 0.168372,0.0135 0.211203,0.007 0.244537,-0.0329 0.06008,-0.0725 -0.007,-0.1878 -0.28153,-0.48491 -0.127096,-0.13759 -0.270558,-0.30756 -0.318788,-0.37787 -0.214715,-0.31305 -0.392295,-0.77509 -0.615104,-1.60051 -0.06328,-0.2344 -0.127433,-0.45026 -0.142588,-0.47962 -0.01509,-0.0293 -0.03635,-0.17768 -0.04706,-0.32954 -0.04873,-0.68973 -0.209626,-1.49346 -0.394507,-1.97113 -0.11552,-0.29848 -0.331422,-0.62606 -0.531994,-0.80731 -0.08352,-0.0754 -0.261273,-0.18984 -0.395013,-0.25429 -0.2272,-0.10944 -0.263491,-0.11799 -0.552664,-0.12993 -0.599316,-0.0243 -1.037586,0.16416 -1.703994,0.73391 -0.159837,0.13669 -0.307174,0.24851 -0.327407,0.24851 -0.105388,0 0.218881,-0.4848 0.507221,-0.7584 0.213207,-0.20222 0.389181,-0.32263 0.656011,-0.44864 0.360423,-0.17024 0.530889,-0.20289 1.053558,-0.20177 0.448756,0 0.474774,0.007 0.740636,0.0962 0.770805,0.26626 1.255816,0.76383 1.548935,1.58884 0.09199,0.25899 0.260187,0.91955 0.344132,1.35171 0.07274,0.37439 0.214265,0.733 0.551978,1.39859 0.173393,0.3417 0.2426,0.44632 0.401365,0.60665 0.285474,0.28831 0.754677,0.61089 0.888514,0.61089 0.08708,0 0.03378,-0.23715 -0.127365,-0.5668 -0.165647,-0.3389 -0.246311,-0.45062 -0.325417,-0.45062 -0.03139,0 -0.114463,-0.059 -0.184563,-0.13106 -0.257679,-0.2652 -0.284825,-0.54999 -0.08785,-0.92166 0.179293,-0.3383 0.159927,-0.53331 -0.163688,-1.64859 -0.408034,-1.40623 -0.432412,-2.11178 -0.111422,-3.22391 0.09924,-0.34384 0.313952,-0.8172 0.484752,-1.06876 0.519751,-0.76536 1.598608,-1.20668 2.725235,-1.11487 1.356413,0.11056 2.26444,0.8517 2.642699,2.15699 0.142115,0.49041 0.202488,0.90325 0.202961,1.38816 5.31e-4,0.51795 -0.04177,0.77723 -0.272796,1.67143 -0.404356,1.56518 -0.392415,1.47319 -0.23364,1.79976 0.191814,0.39448 0.19017,0.62613 -0.0065,0.91396 -0.06035,0.0883 -0.127861,0.14367 -0.223272,0.18353 -0.163238,0.0678 -0.272719,0.22874 -0.408252,0.6001 -0.09564,0.26205 -0.109171,0.37685 -0.04724,0.40063 0.102167,0.0394 0.497081,-0.21213 0.783516,-0.49852 0.202983,-0.20289 0.412082,-0.51597 0.591187,-0.88496 0.903095,-1.86058 1.122726,-2.26477 1.477498,-2.71913 0.610404,-0.78169 1.350507,-1.07722 2.359584,-0.94209 0.513542,0.0687 0.817521,0.22451 1.215705,0.6232 0.328158,0.3286 0.525538,0.63294 0.658892,1.01598 0.08546,0.24547 0.10041,0.33609 0.05546,0.33609 -0.01486,0 -0.148713,-0.16686 -0.297665,-0.37064 -0.43738,-0.59861 -0.776097,-0.89777 -1.186589,-1.04804 -0.716116,-0.26209 -1.529249,0.0806 -2.055512,0.86636 -0.413425,0.61726 -0.8091,1.5469 -1.087388,2.55484 -0.256413,0.92867 -0.546118,1.50809 -0.953129,1.90622 -0.240087,0.23485 -0.289509,0.31387 -0.23641,0.37784 0.06508,0.0784 0.394293,0.0579 0.713405,-0.0441 0.523047,-0.16754 1.593014,-0.76676 2.150646,-1.20437 0.809604,-0.63532 1.438102,-0.91928 2.223726,-1.0046 0.550336,-0.0599 1.056913,0.018 1.4808,0.22622 0.310105,0.15268 0.644047,0.4878 0.81209,0.81506 0.1781,0.3469 0.270055,0.72727 0.272145,1.12567 0.0012,0.17587 -0.01396,0.38471 -0.0333,0.46413 -0.118763,0.49066 -0.512738,0.92905 -0.983896,1.09486 -0.230506,0.0811 -0.673875,0.0628 -1.025543,-0.0423 -0.337971,-0.10088 -0.558354,-0.18533 -0.625786,-0.23989 -0.05267,-0.0423 -0.04772,-0.0441 0.0744,-0.0279 0.405311,0.0543 0.741589,0.0513 0.995385,-0.009 0.41937,-0.10043 0.750387,-0.30249 0.865683,-0.52849 0.07163,-0.14052 0.07881,-0.54392 0.01396,-0.79243 -0.233695,-0.89717 -1.198036,-1.28341 -2.29342,-0.91849 -0.50165,0.16708 -1.313162,0.64896 -1.80546,1.07204 -0.399857,0.34366 -1.168094,0.83324 -1.718739,1.09538 -0.353331,0.16821 -0.685028,0.27009 -1.12269,0.3448 -0.155874,0.0268 -0.283413,0.0617 -0.283413,0.0777 0,0.0603 0.348679,0.7553 0.524388,1.04516 0.933348,1.53974 1.809754,2.64198 2.476766,3.11505 0.392511,0.27838 0.795134,0.41815 0.988461,0.34319 0.124708,-0.0482 0.201699,-0.19524 0.187715,-0.35807 -0.01576,-0.18398 -0.128964,-0.36476 -0.584843,-0.93471 -0.592869,-0.74118 -0.672857,-0.89455 -0.703404,-1.34878 -0.03218,-0.47886 0.104397,-0.88192 0.398981,-1.17732 0.284307,-0.28508 0.702528,-0.42862 1.132504,-0.38865 0.26794,0.025 0.71723,0.14593 0.950816,0.25602 0.165332,0.0779 0.184158,0.0939 0.123087,0.10449 -0.03968,0.007 -0.170466,-0.007 -0.290682,-0.0232 -0.638823,-0.10471 -1.148303,0.0239 -1.449512,0.36611 -0.159072,0.18082 -0.218791,0.36964 -0.201565,0.63782 0.0097,0.15177 0.03254,0.24219 0.08145,0.32328 0.107324,0.17789 0.407388,0.55434 0.669007,0.83931 0.72686,0.79171 0.975828,1.25287 0.953915,1.76704 -0.0086,0.19861 -0.02621,0.27248 -0.103135,0.42833 -0.19634,0.39781 -0.521289,0.65425 -0.924495,0.72944 -0.173483,0.0322 -0.801103,0.018 -0.940129,-0.0225 l -0.06807,-0.018 0.06096,0.11935 c 0.0994,0.19479 0.147903,0.43506 0.147497,0.7305 -3.22e-4,0.22821 -0.01486,0.31889 -0.08197,0.5117 -0.127455,0.3661 -0.332265,0.68792 -0.629822,0.98956 -0.216314,0.21933 -0.291819,0.27646 -0.436028,0.33003 -0.329457,0.12228 -0.557968,0.15808 -1.017393,0.15853 -0.374785,4.7e-4 -0.459444,-0.009 -0.602795,-0.0615 -0.315723,-0.11754 -0.723946,-0.3952 -1.079225,-0.73404 -0.214332,-0.20424 -0.470734,-0.51799 -0.444746,-0.54396 0.0088,-0.009 0.11149,0.0435 0.228349,0.11642 0.262799,0.16372 0.479379,0.2605 0.804332,0.3594 0.224038,0.0682 0.301228,0.0768 0.716201,0.0788 0.307292,0 0.519335,-0.0113 0.624965,-0.0376 0.419347,-0.10539 0.770586,-0.35832 0.918906,-0.66146 0.06371,-0.13016 0.07429,-0.18555 0.06452,-0.33747 -0.03337,-0.51905 -0.504047,-0.94114 -1.433982,-1.28599 -1.622892,-0.18555 -3.102302,-1.73898 -4.010221,-3.06411 l -0.07927,-0.15696 -0.06891,0.0842 c -0.0379,0.0464 -0.0898,0.15448 -0.115341,0.24023 -0.104532,0.35091 -0.403242,0.89989 -0.703026,1.29198 -0.211878,0.27719 -0.689402,0.75735 -1.011299,1.01692 -0.367595,0.29649 -0.734194,0.53689 -1.246748,0.8177 -0.549486,0.30094 -0.776632,0.45682 -1.018572,0.69876 -0.341259,0.34133 -0.475326,0.69447 -0.383538,1.01018 0.153104,0.52665 0.693532,0.78523 1.494365,0.71497 0.625489,-0.0547 1.251253,-0.33429 1.719497,-0.76782 0.09692,-0.0896 0.176231,-0.15493 0.176231,-0.14479 0,0.009 -0.04456,0.10628 -0.09908,0.21392 -0.314245,0.61999 -0.99332,1.2858 -1.457698,1.42929 -0.38261,0.11822 -1.011751,0.152 -1.37182,0.0739 z m 8.08451,-4.90569 c -0.866266,-0.88483 -1.258766,-1.46317 -2.082575,-3.06857 -0.199718,-0.38919 -0.369297,-0.69662 -0.376834,-0.68308 -0.04706,0.0844 -0.08679,0.5125 -0.07287,0.7852 l 0.01576,0.30945 0.211382,0.42054 c 0.487106,0.96895 1.113359,1.73706 1.756532,2.15424 0.192917,0.12521 0.770019,0.38692 0.797879,0.3619 0.0072,-0.007 -0.105027,-0.13241 -0.249304,-0.27968 z"
       id="path105751"
       sodipodi:nodetypes="cssssssssssscsscscsccccsssscssscsscsssssssssscssscsssssssscssssccsssssssssssssssssssssssssssssssssscsssscsscccsssssscssssssssssccsssssscccsssssscsscsccsscccssssssssssssccsssscsssss" />
    <path
       style="fill:#ffa966;fill-opacity:1;stroke:none;stroke-width:0.595805px;stroke-linecap:butt;stroke-linejoin:miter;stroke-opacity:1"
       d="m -33.390392,-45.78407 c 0.450553,0.93018 0.232528,1.72957 0.421482,1.72957 0.188931,0 5.348563,0.40693 5.348563,-0.0435 0,-0.45053 1.584233,-1.80224 0.406957,-1.93303 -1.177252,-0.13083 -6.177002,0.24708 -6.177002,0.24708 z"
       id="path106243" />
    <path
       style="fill:#000000;stroke:none;stroke-width:0.595805px;stroke-linecap:butt;stroke-linejoin:miter;stroke-opacity:1"
       d="m -32.227664,-45.50065 c 0.828439,0.13083 1.388005,0.0363 1.351683,0.10899 -0.03626,0.0727 0.123627,0.79214 -0.363361,0.58139 -0.486899,-0.21078 -0.988322,-0.69036 -0.988322,-0.69036 z"
       id="path109556" />
    <path
       style="fill:#000000;stroke:none;stroke-width:0.595805px;stroke-linecap:butt;stroke-linejoin:miter;stroke-opacity:1"
       d="m -28.548858,-45.50065 c -0.828439,0.13083 -1.388005,0.0363 -1.351683,0.10899 0.03626,0.0727 -0.123627,0.79214 0.363361,0.58139 0.486899,-0.21078 0.988322,-0.69036 0.988322,-0.69036 z"
       id="path109704" />
  </g>
</svg>
