<?xml version="1.0" encoding="UTF-8" standalone="no"?>
<!-- Created with Inkscape (http://www.inkscape.org/) -->

<svg
   width="23.9839mm"
   height="38.984756mm"
   viewBox="0 0 23.983901 38.984757"
   preserveAspectRatio="none"
   version="1.1"
   id="svg479"
   inkscape:export-filename="target_13.svg"
   inkscape:export-xdpi="96"
   inkscape:export-ydpi="96"
   xmlns:inkscape="http://www.inkscape.org/namespaces/inkscape"
   xmlns:sodipodi="http://sodipodi.sourceforge.net/DTD/sodipodi-0.dtd"
   xmlns="http://www.w3.org/2000/svg"
   xmlns:svg="http://www.w3.org/2000/svg">
  <sodipodi:namedview
     id="namedview481"
     pagecolor="#ffffff"
     bordercolor="#666666"
     borderopacity="1.0"
     inkscape:showpageshadow="2"
     inkscape:pageopacity="0.0"
     inkscape:pagecheckerboard="0"
     inkscape:deskcolor="#d1d1d1"
     inkscape:document-units="mm"
     showgrid="false" />
  <defs
     id="defs476" />
  <g
     inkscape:label="Layer 1"
     inkscape:groupmode="layer"
     id="layer1"
     transform="translate(72.550312,61.429416)">
    <g
       id="g71963-8"
       transform="matrix(0.41843537,0,0,0.41843537,-109.30057,-300.14359)">
      <path
         id="ellipse71955-8"
         style="opacity:1;fill:#ffeeaa;stroke-width:0.826373;stroke-linecap:round;stroke-linejoin:round;stroke-dashoffset:347.717;paint-order:stroke markers fill"
         d="m 137.50128,599.46497 a 21.014488,21.291557 0 0 1 -21.01449,21.29155 21.014488,21.291557 0 0 1 -21.014485,-21.29155 21.014488,21.291557 0 0 1 21.014485,-21.29156 21.014488,21.291557 0 0 1 21.01449,21.29156 z" />
      <path
         id="rect71961-6"
         style="opacity:1;stroke-width:1.15558;stroke-linecap:round;stroke-linejoin:round;stroke-dashoffset:347.717;paint-order:stroke markers fill"
         d="m 114.6046,617.34119 h 3.76437 v 38.63774 h -3.76437 z" />
    </g>
    <g
       id="g25616"
       transform="matrix(2.2332694,-0.28880138,0.28880138,2.2332694,-418.83833,-709.40036)">
      <path
         id="path73384-7"
         style="fill:#000000;stroke-width:0.03217"
         d="m 117.49722,308.33572 c -0.074,-0.0125 -0.1519,-0.004 -0.2173,0.033 -0.19084,0.10365 -0.20627,0.15427 -0.40927,1.3432 l -0.18696,1.09512 -0.0793,-0.0138 -0.0793,-0.0134 0.0977,-0.57243 c 0.1044,-0.61141 0.10123,-0.70546 -0.028,-0.83332 -0.0789,-0.0782 -0.24387,-0.10694 -0.3744,-0.0654 -0.19199,0.0611 -0.2163,0.12595 -0.35798,0.95646 -0.11959,0.70113 -0.12541,0.7631 -0.0826,0.87076 0.0546,0.13724 0.16901,0.21519 0.42316,0.28792 0.1027,0.0297 0.22463,0.0677 0.27098,0.0854 l 0.0843,0.0319 -0.0673,0.39396 -0.0486,0.28489 0.76106,0.12998 0.0485,-0.28389 0.0671,-0.39284 0.10608,1.1e-4 c 0.0584,0 0.20428,0.007 0.32427,0.0151 0.24742,0.0171 0.37046,-0.0315 0.46722,-0.18366 0.0851,-0.13434 0.21836,-0.91461 0.18261,-1.06956 -0.0534,-0.23157 -0.26806,-0.3564 -0.49089,-0.28545 -0.15549,0.0495 -0.23083,0.18858 -0.29015,0.53608 -0.0484,0.28326 -0.0564,0.30362 -0.1154,0.29357 -0.0622,-0.0104 -0.0598,-0.0322 0.12625,-1.12174 0.20593,-1.20612 0.20818,-1.25746 0.0623,-1.41881 -0.0499,-0.0551 -0.12006,-0.0905 -0.19407,-0.1032 z" />
      <path
         id="path73747-3"
         style="fill:#000000;fill-opacity:1;stroke-width:0.373297;stroke-linecap:round;stroke-linejoin:round;stroke-miterlimit:4;stroke-dasharray:none;stroke-dashoffset:347.717;paint-order:stroke markers fill"
         d="m 121.9767,306.51485 -0.0964,0.28532 a 1.7546003,1.7909026 0 0 1 0.12673,0.0136 z m -1.03198,0.11632 0.043,0.34919 a 1.7546003,1.7909026 0 0 1 0.13392,-0.0609 z m 2.01205,0.22666 -0.22889,0.23389 a 1.7546003,1.7909026 0 0 1 0.11389,0.0838 z m -1.1949,0.20796 a 1.5443627,1.5443627 0 0 0 -1.54432,1.54446 1.5443627,1.5443627 0 0 0 1.54432,1.54431 1.5443627,1.5443627 0 0 0 1.54443,-1.54431 1.5443627,1.5443627 0 0 0 -1.54443,-1.54446 z m -1.69639,0.11779 0.25047,0.38935 a 1.7546003,1.7909026 0 0 1 0.11676,-0.15315 z m 3.62565,0.40852 -0.38749,0.14011 a 1.7546003,1.7909026 0 0 1 0.0769,0.16393 z m -4.17806,0.47083 0.5078,0.31144 a 1.7546003,1.7909026 0 0 1 0.0454,-0.24327 z m 4.00208,0.45644 a 1.7546003,1.7909026 0 0 1 10e-4,0.0676 1.7546003,1.7909026 0 0 1 -0.008,0.16281 l 0.52562,-0.17764 z m -3.48343,0.36069 -0.63486,0.21462 0.70614,0.0719 a 1.7546003,1.7909026 0 0 1 -0.0713,-0.28655 z m 3.34917,0.39458 a 1.7546003,1.7909026 0 0 1 -0.12418,0.24781 l 0.66098,0.0817 z m -3.10003,0.2704 -0.54111,0.52982 0.73856,-0.2673 a 1.7546003,1.7909026 0 0 1 -0.19745,-0.26252 z m 2.69539,0.33338 a 1.7546003,1.7909026 0 0 1 -0.2425,0.19876 l 0.63154,0.4062 z m -2.22699,0.16998 -0.27526,0.7607 0.57487,-0.58726 a 1.7546003,1.7909026 0 0 1 -0.29961,-0.17344 z m 1.64083,0.21018 a 1.7546003,1.7909026 0 0 1 -0.32507,0.0911 l 0.42091,0.68611 z m -1.01947,0.0739 0.0836,0.81949 0.26231,-0.77599 a 1.7546003,1.7909026 0 0 1 -0.34587,-0.0435 z" />
      <path
         id="ellipse74073-4"
         style="fill:#000000;fill-opacity:1;stroke-width:0.156306;stroke-linecap:round;stroke-linejoin:round;stroke-miterlimit:4;stroke-dasharray:none;stroke-dashoffset:347.717;paint-order:stroke markers fill"
         d="m 116.26829,311.92959 a 3.9748131,4.0272195 13.225032 0 0 2.96109,3.02456 3.9748131,4.0272195 13.225032 0 0 4.58542,-2.38072 c -0.19494,-0.0754 -0.43082,-0.13024 -0.62205,-0.14816 -0.43419,-0.0407 -0.81411,0.095 -0.93623,0.13568 -0.12212,0.0407 0.0136,0.27136 -0.36633,0.40704 -0.37992,0.13569 -0.77337,0.18993 -0.77337,0.18993 0,0 0.62415,-0.27138 0.80055,-0.3935 0.17639,-0.12212 -0.14928,-0.29851 0.23065,-0.35279 0.37992,-0.0543 0.8819,-0.29844 0.69194,-0.39341 -0.18996,-0.095 -1.32972,-0.12217 -1.73678,0.10851 -0.40706,0.23065 -1.97938,0.38443 -2.52379,0.18993 -0.44049,-0.15736 -1.50935,-0.37973 -2.3111,-0.38707 z" />
      <path
         id="path74209-1"
         style="fill:#000000;stroke-width:0.0161089"
         d="m 119.4077,310.38443 c 0.0369,0.007 0.0721,0.0243 0.0963,0.0533 0.0716,0.0819 0.0362,0.35786 -0.0756,0.9514 l -0.10296,0.54669 0.0396,0.007 0.0395,0.007 0.0538,-0.28575 c 0.0575,-0.30522 0.0754,-0.34883 0.1583,-0.38635 0.0507,-0.0229 0.13312,-0.008 0.18717,0.0345 0.0795,0.0621 0.0796,0.0968 0.001,0.51138 -0.066,0.35001 -0.074,0.38009 -0.11286,0.42318 -0.0495,0.055 -0.11683,0.0716 -0.24881,0.0615 -0.0534,-0.004 -0.11726,-0.007 -0.14209,-0.007 h -0.0451 l -0.0497,0.26857 -0.0268,0.1422 -0.37995,-0.0715 0.0267,-0.14172 0.0496,-0.26797 -0.0498,-0.0186 c -0.0275,-0.01 -0.0971,-0.0323 -0.1549,-0.0493 -0.11914,-0.035 -0.16845,-0.0793 -0.18737,-0.16757 -0.0166,-0.0779 0.0568,-0.46742 0.10055,-0.53396 0.0654,-0.0994 0.18791,-0.12063 0.28018,-0.0485 0.0644,0.0503 0.0755,0.12875 0.0428,0.30223 -0.0266,0.14139 -0.0264,0.15236 0.003,0.15791 0.0311,0.006 0.0337,-0.005 0.1361,-0.54862 0.11338,-0.60211 0.15508,-0.87611 0.25168,-0.92647 0.033,-0.0171 0.0721,-0.0215 0.10908,-0.0145 z"
         sodipodi:nodetypes="ccscccsscsscccccccccscsssssscc" />
    </g>
  </g>
</svg>
