<?xml version="1.0" encoding="UTF-8" standalone="no"?>
<!-- Created with Inkscape (http://www.inkscape.org/) -->

<svg
   width="23.9839mm"
   height="38.984791mm"
   viewBox="0 0 23.9839 38.984791"
   preserveAspectRatio="none"
   version="1.1"
   id="svg479"
   inkscape:export-filename="target_03.svg"
   inkscape:export-xdpi="96"
   inkscape:export-ydpi="96"
   sodipodi:docname="target_04.svg"
   inkscape:version="1.2 (1:1.2.1+202207142221+cd75a1ee6d)"
   xmlns:inkscape="http://www.inkscape.org/namespaces/inkscape"
   xmlns:sodipodi="http://sodipodi.sourceforge.net/DTD/sodipodi-0.dtd"
   xmlns="http://www.w3.org/2000/svg"
   xmlns:svg="http://www.w3.org/2000/svg">
  <sodipodi:namedview
     id="namedview481"
     pagecolor="#ffffff"
     bordercolor="#666666"
     borderopacity="1.0"
     inkscape:showpageshadow="2"
     inkscape:pageopacity="0.0"
     inkscape:pagecheckerboard="0"
     inkscape:deskcolor="#d1d1d1"
     inkscape:document-units="mm"
     showgrid="false"
     inkscape:zoom="6.7868348"
     inkscape:cx="45.455652"
     inkscape:cy="73.745718"
     inkscape:window-width="2560"
     inkscape:window-height="1376"
     inkscape:window-x="1920"
     inkscape:window-y="27"
     inkscape:window-maximized="1"
     inkscape:current-layer="layer1" />
  <defs
     id="defs476" />
  <g
     inkscape:label="Layer 1"
     inkscape:groupmode="layer"
     id="layer1"
     transform="translate(39.6518,22.430573)">
    <path
       id="rect72023-6"
       style="stroke-width:0.483536;stroke-linecap:round;stroke-linejoin:round;stroke-dashoffset:347.717;paint-order:stroke markers fill"
       d="m -28.447428,-2.8273307 h 1.575146 V 13.340066 h -1.575146 z" />
    <path
       id="ellipse72017-2"
       style="fill:#aafbff;stroke-width:0.345784;stroke-linecap:round;stroke-linejoin:round;stroke-dashoffset:347.717;paint-order:stroke markers fill"
       d="m -18.866647,-10.307373 a 8.7932051,8.9091405 0 0 1 -8.793206,8.9091371 8.7932051,8.9091405 0 0 1 -8.793204,-8.9091371 8.7932051,8.9091405 0 0 1 8.793204,-8.909142 8.7932051,8.9091405 0 0 1 8.793206,8.909142 z" />
    <path
       id="path64627"
       style="fill:#000000;stroke-width:0.0556055"
       d="m -31.33211,-12.619758 c -0.20694,0.02702 -0.35775,0.190508 -0.50892,0.318977 -0.28204,0.261104 -0.53758,0.551887 -0.7528,0.870571 -0.51257,-0.235545 -0.99629,-0.53108 -1.51631,-0.750164 -0.14142,-0.05495 -0.31711,-0.03445 -0.42018,0.0849 -0.20627,0.202893 -0.30231,0.485885 -0.39574,0.752709 -0.2074,0.636782 -0.26835,1.319571 -0.18645,1.983646 0.0329,0.07364 -0.0158,0.07972 -0.0829,0.07341 -0.64888,0.02702 -1.301,0.03063 -1.94528,0.117547 -0.25273,0.06103 -0.41416,0.393311 -0.26349,0.616673 0.23052,0.224962 0.49447,0.411822 0.74309,0.61575 0.86916,0.688035 1.74148,1.373143 2.63273,2.032557 0.18195,0.127906 0.36259,0.274908 0.57902,0.339716 0.16574,0.02635 0.32861,-0.01576 0.49413,-0.02252 2.05964,-0.189607 4.11692,-0.405381 6.17576,-0.602104 0.92797,-0.09908 1.85799,-0.18105 2.78299,-0.307785 0.2101,-0.0295 0.45558,-0.06328 0.58342,-0.255046 0.0993,-0.127231 0.11101,-0.317176 0.007,-0.445622 -0.16551,-0.237437 -0.44699,-0.352124 -0.68558,-0.495028 -0.0786,-0.02702 -0.10291,-0.06508 -0.0277,-0.118898 0.15516,-0.173844 0.34546,-0.368158 0.331,-0.619804 -0.0203,-0.188256 -0.18217,-0.315261 -0.34127,-0.391419 -0.64311,-0.367707 -1.31108,-0.688823 -1.98452,-0.996608 -0.1225,-0.04819 -0.24478,-0.113044 -0.37602,-0.128131 -0.27576,0.01351 -0.48764,0.213927 -0.72361,0.332195 -0.40254,0.215053 -0.88145,0.294657 -1.32941,0.200866 -0.18961,-0.05337 -0.37158,-0.158306 -0.55013,-0.253087 -0.0892,-0.02252 0.009,-0.07589 0.0336,-0.113719 0.19974,-0.203344 0.42233,-0.383876 0.64923,-0.553328 0.18578,-0.133311 0.40464,-0.226561 0.5607,-0.397297 0.10719,-0.114395 0.11822,-0.298462 0.0252,-0.424432 -0.10832,-0.139615 -0.28621,-0.195011 -0.4386,-0.271665 -0.68849,-0.308708 -1.39339,-0.579337 -2.09572,-0.85465 -0.31515,-0.120025 -0.62931,-0.24712 -0.95437,-0.336879 -0.007,-2.3e-5 -0.0135,-0.0023 -0.0203,-0.0021 z m 0.0955,0.749984 c 0.63352,0.255339 1.26569,0.5166 1.90058,0.769507 0.1565,0.06283 0.3129,0.125429 0.46933,0.188256 -0.35232,0.243157 -0.66722,0.54574 -0.91112,0.898067 -0.30112,0.469086 -0.3764,1.05036 -0.3317,1.59387 0.0113,0.28038 0.0905,0.554905 0.22644,0.799863 0.098,0.192534 0.20763,0.3798 0.33817,0.552202 -0.38115,-0.171592 -0.73026,-0.43148 -0.95052,-0.789324 -0.18082,-0.284883 -0.28425,-0.602959 -0.345,-0.929682 -0.0932,-0.505454 -0.0752,-1.016425 -0.0448,-1.528544 -0.0113,-0.181275 -0.19186,-0.27108 -0.3286,-0.352642 -0.24725,-0.140967 -0.49793,-0.275876 -0.74766,-0.412587 0.21618,-0.287586 0.42655,-0.580824 0.72494,-0.788986 z m -2.84451,0.517591 c 0.30632,0.119574 0.59022,0.287766 0.88341,0.435308 0.52079,0.273129 1.03953,0.550176 1.5591,0.825579 -6.3e-4,0.594966 -0.009,1.20056 0.15831,1.777533 0.10426,0.378111 0.27718,0.738251 0.51592,1.049865 -0.55456,-0.110792 -1.10749,-0.224962 -1.65419,-0.369644 -0.37859,-0.101334 -0.75533,-0.255654 -1.03895,-0.534683 -0.24435,-0.223385 -0.45046,-0.485142 -0.58276,-0.784685 -0.19569,-0.457962 -0.2101,-0.973729 -0.15132,-1.458421 0.0399,-0.291617 0.0912,-0.585417 0.19636,-0.86368 0.0254,-0.04053 0.0329,-0.133761 0.0991,-0.08197 l 0.0113,0.0023 z m 8.53773,2.597505 c 0.29017,0.146146 0.58118,0.290828 0.8689,0.441838 -0.2784,0.287226 -0.59384,0.537543 -0.92304,0.76381 -0.35681,0.234532 -0.73609,0.441794 -1.14084,0.580329 -0.24293,0.06733 -0.49266,0.0867 -0.73607,0.105162 -0.5862,0.02635 -1.19506,-0.220233 -1.54797,-0.698732 -0.24118,-0.311298 -0.36384,-0.703077 -0.37129,-1.094834 -0.009,-0.111467 -0.0135,-0.224061 -5.4e-4,-0.33537 0.30508,0.139615 0.61433,0.291639 0.95274,0.328569 0.58037,0.08444 1.16331,-0.103586 1.66886,-0.377277 0.10854,-0.05517 0.21685,-0.110117 0.32535,-0.165287 0.3013,0.15065 0.60262,0.301254 0.90394,0.451882 z m -9.13229,0.504237 c 0.33432,0.500995 0.79257,0.943937 1.36866,1.14897 0.60438,0.229622 1.24425,0.339896 1.87338,0.478814 0.17699,0.03716 0.35374,0.07476 0.53042,0.113043 -0.7961,0.07454 -1.59083,0.164387 -2.38828,0.223611 -0.2065,-0.108765 -0.38597,-0.26178 -0.57731,-0.394617 -0.80419,-0.589111 -1.58158,-1.213441 -2.37027,-1.822795 0.45402,-0.04639 0.90879,-0.04594 1.36646,-0.05157 0.0657,0.101559 0.13128,0.202893 0.19703,0.304385 z m -2.47984,0.473973 c -0.25597,0.02027 -0.3889,0.37998 -0.2074,0.56184 0.18105,0.208973 0.43689,0.329719 0.6435,0.509598 0.78238,0.609242 1.55745,1.228978 2.3028,1.883257 0.15605,0.131734 0.30263,0.295175 0.50442,0.353566 0.22203,0.0572 0.44974,-0.0068 0.67366,-0.01576 2.5926,-0.226516 5.1842,-0.464583 7.77486,-0.712243 0.53396,-0.0554 1.07022,-0.103361 1.5984,-0.201542 0.12948,-0.0313 0.29743,-0.07183 0.34483,-0.214152 0.0311,-0.115746 0.0268,-0.274796 -0.0905,-0.341023 -0.15425,-0.07859 -0.33634,-0.04909 -0.50334,-0.05359 -0.67233,0.02252 -1.34188,0.09413 -2.01208,0.149298 -2.44895,0.214828 -4.89621,0.449045 -7.34572,0.656982 -0.0696,-4.28e-4 -0.14592,0.02027 -0.21168,0.0068 -0.91669,-0.732284 -1.83479,-1.463037 -2.73818,-2.212233 -0.20537,-0.153577 -0.41533,-0.332848 -0.67711,-0.372368 -0.018,-0.001 -0.0376,-0.001 -0.0565,-2.03e-4 z m 12.52776,0.622303 c -0.11215,0.01576 -0.22406,0.02972 -0.3365,0.04189 0.0563,-0.04301 0.11259,-0.0858 0.16889,-0.128807 0.0559,0.02882 0.11169,0.05787 0.16754,0.0867 z m -12.5192,0.564745 c -0.14412,0.02725 -0.25856,0.151776 -0.30709,0.285582 -0.0408,0.175195 0.10516,0.321679 0.23949,0.408488 0.24243,0.167089 0.4834,0.337172 0.70262,0.534638 0.71999,0.602532 1.46394,1.176983 2.16781,1.798926 0.1824,0.149523 0.37808,0.337554 0.63203,0.32652 0.28182,-0.01126 0.5572,-0.05517 0.83814,-0.07476 2.70514,-0.258987 5.41225,-0.498946 8.11726,-0.757955 0.34665,-0.04008 0.699,-0.059 1.03736,-0.147948 0.20109,-0.07746 0.28122,-0.371513 0.12701,-0.530675 -0.14097,-0.144344 -0.36449,-0.131508 -0.5484,-0.104711 -0.79306,0.07994 -1.58725,0.15155 -2.38085,0.227123 -2.24698,0.207397 -4.49423,0.412452 -6.74247,0.605482 -0.13286,3.37e-4 -0.27759,0.04931 -0.39824,-0.02837 -0.28047,-0.164837 -0.52964,-0.377458 -0.7891,-0.572852 -0.60172,-0.472959 -1.19923,-0.965172 -1.7919,-1.444302 -0.2475,-0.203568 -0.50007,-0.422675 -0.81193,-0.518357 -0.0299,-0.0068 -0.0613,-0.01126 -0.0919,-0.0068 z m 0.0113,1.20101 c -0.26212,0.01801 -0.42317,0.38847 -0.23159,0.580261 0.13872,0.138715 0.33303,0.200191 0.47661,0.333321 0.36152,0.287271 0.71015,0.590394 1.07353,0.875413 0.54164,0.435646 1.08403,0.870931 1.60022,1.33673 0.15516,0.134661 0.35704,0.245701 0.56934,0.204244 2.86066,-0.249191 5.7192,-0.52187 8.57882,-0.782658 0.4009,-0.04301 0.80552,-0.06395 1.20142,-0.143444 0.13781,-0.03716 0.3115,-0.09098 0.34505,-0.250768 0.0408,-0.172943 -0.0761,-0.401215 -0.27081,-0.400156 -0.80473,0.02905 -1.60713,0.107639 -2.40954,0.174294 -2.41305,0.208748 -4.82397,0.441974 -7.23749,0.644844 -0.0799,6.53e-4 -0.16642,0.02027 -0.24246,0.0068 -0.93601,-0.750592 -1.85811,-1.518884 -2.80927,-2.249659 -0.1761,-0.128356 -0.35143,-0.281753 -0.5702,-0.327984 -0.0245,-9.69e-4 -0.0491,-0.0045 -0.0736,-0.0021 z" />
    <path
       style="fill:#000000;stroke:#000000;stroke-width:0.821931;stroke-linecap:round;stroke-linejoin:round;stroke-miterlimit:4;stroke-dasharray:none;stroke-opacity:1"
       d="m -27.51994,-11.026721 c 2.03478,-2.645199 1.48249,-7.17987 1.48249,-7.17987 l 6.24969,0.813936 c 0,0 0.37786,0.784843 0.029,3.16842 -0.34884,2.3836 -1.74411,5.348564 -1.74411,5.348564 z"
       id="path65733" />
    <path
       style="color:#000000;fill:#aafbff;fill-opacity:1;stroke-width:0.439713;stroke-linecap:round;stroke-linejoin:round;-inkscape-stroke:none"
       d="m -24.440338,-16.463341 c 1.857969,0.545267 3.528358,0.616674 3.528358,0.616674 m -3.597671,0.726249 c 1.129514,0.362708 2.256144,0.415356 2.256144,0.415356 m -2.554809,0.571591 c 1.547865,0.513381 3.130003,0.525113 3.130003,0.525113 m -3.311458,0.285492 c 1.118637,0.451183 2.439829,0.475729 2.439829,0.475729 m -2.761328,0.363406 c 1.370553,0.512097 2.631665,0.35906 2.631665,0.35906 m -2.920422,0.436006 c 1.480647,0.616245 2.934497,0.4499 2.934497,0.4499"
       id="path78734" />
    <path
       style="color:#000000;fill:#aafbff;fill-opacity:1;stroke-width:2.25187;stroke-linecap:round;stroke-linejoin:round;-inkscape-stroke:none"
       d="m -24.376408,-16.673755 a 0.21985639,0.21985639 0 0 0 -0.277069,0.149524 0.21985639,0.21985639 0 0 0 0.149523,0.272678 c 1.887176,0.553847 3.58452,0.624555 3.58452,0.624555 a 0.21985639,0.21985639 0 0 0 0.2287,-0.211 0.21985639,0.21985639 0 0 0 -0.211,-0.228699 c 0,0 -1.645776,-0.07026 -3.474561,-0.606968 z m -0.06598,1.34585 a 0.21985639,0.21985639 0 0 0 -0.277092,0.140742 0.21985639,0.21985639 0 0 0 0.140742,0.277092 c 1.164147,0.373832 2.313432,0.426616 2.313432,0.426616 a 0.21985639,0.21985639 0 0 0 0.233113,-0.211 0.21985639,0.21985639 0 0 0 -0.211,-0.2287 c 0,0 -1.104202,-0.05314 -2.199082,-0.404637 z m -0.294679,0.985191 a 0.21985639,0.21985639 0 0 0 -0.281483,0.140742 0.21985639,0.21985639 0 0 0 0.140742,0.277092 c 1.589389,0.527162 3.197469,0.536574 3.197469,0.536574 a 0.21985639,0.21985639 0 0 0 0.220007,-0.220007 0.21985639,0.21985639 0 0 0 -0.215504,-0.220007 c 0,0 -1.5548,-0.01576 -3.061118,-0.514597 z m -0.338658,0.818058 a 0.21985639,0.21985639 0 0 0 -0.118673,0.118673 0.21985639,0.21985639 0 0 0 0.123177,0.285875 c 1.171758,0.472621 2.515762,0.492595 2.515762,0.492595 a 0.21985639,0.21985639 0 0 0 0.224286,-0.215503 0.21985639,0.21985639 0 0 0 -0.215504,-0.224286 c 0,0 -1.296309,-0.0277 -2.361802,-0.457422 a 0.21985639,0.21985639 0 0 0 -0.167088,0 z m -0.158306,0.835667 a 0.21985639,0.21985639 0 0 0 -0.281483,0.127456 0.21985639,0.21985639 0 0 0 0.127456,0.281483 c 1.425408,0.532589 2.735656,0.373832 2.735656,0.373832 a 0.21985639,0.21985639 0 0 0 0.189157,-0.246286 0.21985639,0.21985639 0 0 0 -0.241896,-0.189157 c 0,0 -1.21326,0.144119 -2.528935,-0.34744 z m -0.281483,0.796057 a 0.21985639,0.21985639 0 0 0 -0.285897,0.118674 0.21985639,0.21985639 0 0 0 0.118673,0.290265 c 1.540727,0.641264 3.043532,0.461813 3.043532,0.461813 a 0.21985639,0.21985639 0 0 0 0.193435,-0.241896 0.21985639,0.21985639 0 0 0 -0.246309,-0.193435 c 0,0 -1.40307,0.155829 -2.823614,-0.435421 z"
       id="path78736" />
    <path
       style="fill:#000000;fill-opacity:1;stroke:none;stroke-width:0.00820496;stroke-linecap:round;stroke-linejoin:round;stroke-miterlimit:4;stroke-dasharray:none;stroke-dashoffset:347.717;stroke-opacity:1;paint-order:stroke markers fill"
       d="m -31.23325,-7.226563 c -0.69017,-0.144569 -1.27854,-0.283172 -1.53048,-0.360523 -0.46253,-0.141868 -0.75935,-0.321229 -1.07479,-0.649145 -0.38901,-0.404436 -0.57281,-0.779799 -0.65318,-1.334006 -0.018,-0.130383 -0.018,-0.677271 -1.3e-4,-0.83033 0.0441,-0.358182 0.11507,-0.6913 0.19636,-0.921869 0.0642,-0.18195 0.0529,-0.177222 0.23395,-0.09863 0.21325,0.09233 0.88385,0.440487 2.2747,1.180585 l 0.20086,0.106739 0.007,0.455462 c 0.007,0.468748 0.0158,0.609084 0.0536,0.889599 0.0745,0.547722 0.25858,1.054031 0.53275,1.465334 0.11214,0.168215 0.11237,0.168665 0.0995,0.167089 -0.005,-5.63e-4 -0.15808,-0.03198 -0.3401,-0.07048 z"
       id="path83361" />
    <path
       style="fill:#000000;fill-opacity:1;stroke:none;stroke-width:0.0131575;stroke-linecap:round;stroke-linejoin:round;stroke-miterlimit:4;stroke-dasharray:none;stroke-dashoffset:347.717;stroke-opacity:1;paint-order:stroke markers fill"
       d="m -28.01749,-6.703026 c -0.95065,-0.155379 -1.63367,-0.869265 -1.77556,-1.855785 -0.0248,-0.172268 -0.0419,-0.662792 -0.0236,-0.68191 0.004,-0.0068 0.1207,0.04076 0.25604,0.10291 0.51406,0.237099 0.82238,0.306434 1.28716,0.28941 0.49339,-0.01801 0.84454,-0.125654 1.49542,-0.458412 l 0.42016,-0.214828 1.0264,0.536799 c 0.56452,0.295287 1.0264,0.542565 1.0264,0.549546 0,0.0304 -0.39831,0.403061 -0.64007,0.598298 -0.64726,0.52286 -1.44509,0.967153 -1.92197,1.070424 -0.37106,0.08017 -0.87674,0.108315 -1.15032,0.06328 z"
       id="path83517" />
    <path
       style="color:#000000;fill:#aafbff;fill-opacity:1;stroke-width:2.25187;stroke-linecap:round;stroke-linejoin:round;-inkscape-stroke:none"
       d="m -26.94394,-8.876189 a 0.21686366,0.21686366 0 0 0 -0.018,0.303484 c 0.28943,0.32625 0.4455,0.552495 0.52779,0.690512 0.0822,0.138039 0.0835,0.16281 0.0835,0.16281 a 0.21686366,0.21686366 0 0 0 0.26388,0.158306 0.21686366,0.21686366 0 0 0 0.1583,-0.259505 c 0,0 -0.0322,-0.11417 -0.13196,-0.281483 -0.0998,-0.167314 -0.27247,-0.414141 -0.57616,-0.756492 a 0.21686366,0.21686366 0 0 0 -0.30787,-0.01802 z m -1.25348,0.307875 a 0.21686366,0.21686366 0 0 0 -0.17587,0.2507 c 0.0577,0.33805 0.0484,0.5486 0.0309,0.66412 -0.009,0.05765 -0.0203,0.09368 -0.0263,0.109891 a 0.21686366,0.21686366 0 0 0 0.0572,0.299071 0.21686366,0.21686366 0 0 0 0.30349,-0.0572 c 0,0 0.0261,-0.04121 0.0439,-0.08805 0.018,-0.04684 0.0353,-0.112143 0.0484,-0.197939 0.0261,-0.171592 0.0329,-0.426345 -0.0309,-0.80047 a 0.21686366,0.21686366 0 0 0 -0.2507,-0.180375 z m 0.88843,0.02252 a 0.21686366,0.21686366 0 0 0 -0.16709,0.02252 0.21686366,0.21686366 0 0 0 -0.0793,0.294679 c 0.26184,0.449135 0.2155,0.840059 0.2155,0.840059 a 0.21686366,0.21686366 0 0 0 0.19344,0.241895 0.21686366,0.21686366 0 0 0 0.2375,-0.193435 c 0,0 0.063,-0.535674 -0.26829,-1.103932 a 0.21686366,0.21686366 0 0 0 -0.13196,-0.101109 z m -1.35902,0.009 a 0.21686366,0.21686366 0 0 0 -0.25951,0.167088 c -0.0435,0.203119 -0.0703,0.426616 -0.0703,0.426616 a 0.21686366,0.21686366 0 0 0 0.18916,0.241918 0.21686366,0.21686366 0 0 0 0.24189,-0.189156 c 0,0 0.0284,-0.212126 0.066,-0.387029 a 0.21686366,0.21686366 0 0 0 -0.16708,-0.259505 z"
       id="path66098" />
  </g>
</svg>
