<?xml version="1.0" encoding="UTF-8" standalone="no"?>
<!-- Created with Inkscape (http://www.inkscape.org/) -->

<svg
   width="23.9839mm"
   height="38.984764mm"
   viewBox="0 0 23.983901 38.984765"
   preserveAspectRatio="none"
   version="1.1"
   id="svg479"
   inkscape:export-filename="target_15.svg"
   inkscape:export-xdpi="96"
   inkscape:export-ydpi="96"
   xmlns:inkscape="http://www.inkscape.org/namespaces/inkscape"
   xmlns:sodipodi="http://sodipodi.sourceforge.net/DTD/sodipodi-0.dtd"
   xmlns="http://www.w3.org/2000/svg"
   xmlns:svg="http://www.w3.org/2000/svg">
  <sodipodi:namedview
     id="namedview481"
     pagecolor="#ffffff"
     bordercolor="#666666"
     borderopacity="1.0"
     inkscape:showpageshadow="2"
     inkscape:pageopacity="0.0"
     inkscape:pagecheckerboard="0"
     inkscape:deskcolor="#d1d1d1"
     inkscape:document-units="mm"
     showgrid="false" />
  <defs
     id="defs476" />
  <g
     inkscape:label="Layer 1"
     inkscape:groupmode="layer"
     id="layer1"
     transform="translate(80.79321,43.093176)">
    <g
       id="g109874"
       transform="matrix(0.41843537,0,0,0.41843537,-117.54347,-281.80734)">
      <path
         id="rect109872"
         style="opacity:1;stroke-width:1.15558;stroke-linecap:round;stroke-linejoin:round;stroke-dashoffset:347.717;paint-order:stroke markers fill"
         d="m 114.6046,617.34119 h 3.76437 v 38.63774 h -3.76437 z" />
      <path
         id="ellipse109870"
         style="opacity:1;fill:#aafbff;stroke-width:0.826373;stroke-linecap:round;stroke-linejoin:round;stroke-dashoffset:347.717;paint-order:stroke markers fill"
         d="m 137.50128,599.46497 a 21.014488,21.291557 0 0 1 -21.01449,21.29155 21.014488,21.291557 0 0 1 -21.014485,-21.29155 21.014488,21.291557 0 0 1 21.014485,-21.29156 21.014488,21.291557 0 0 1 21.01449,21.29156 z" />
    </g>
    <g
       id="g110314"
       transform="matrix(2.2518656,0,0,2.2518656,-405.07535,-820.73401)">
      <path
         id="path110004"
         style="opacity:1;stroke-width:0.275676;stroke-linecap:square;stroke-linejoin:round;stroke-dashoffset:347.717;paint-order:stroke markers fill"
         d="m 147.84251,348.23041 a 0.93102801,0.93102801 0 0 1 -0.93103,0.93103 0.93102801,0.93102801 0 0 1 -0.93102,-0.93103 0.93102801,0.93102801 0 0 1 0.93102,-0.93103 0.93102801,0.93102801 0 0 1 0.93103,0.93103 z" />
      <path
         id="circle110086"
         style="opacity:1;stroke-width:0.275676;stroke-linecap:square;stroke-linejoin:round;stroke-dashoffset:347.717;paint-order:stroke markers fill"
         d="m 150.24457,348.23041 a 0.93102801,0.93102801 0 0 1 -0.93103,0.93103 0.93102801,0.93102801 0 0 1 -0.93103,-0.93103 0.93102801,0.93102801 0 0 1 0.93103,-0.93103 0.93102801,0.93102801 0 0 1 0.93103,0.93103 z" />
      <path
         id="circle110190"
         style="opacity:1;stroke-width:0.275676;stroke-linecap:square;stroke-linejoin:round;stroke-dashoffset:347.717;paint-order:stroke markers fill"
         d="m 152.6822,348.23041 a 0.93102801,0.93102801 0 0 1 -0.93103,0.93103 0.93102801,0.93102801 0 0 1 -0.93102,-0.93103 0.93102801,0.93102801 0 0 1 0.93102,-0.93103 0.93102801,0.93102801 0 0 1 0.93103,0.93103 z" />
    </g>
    <g
       id="g110319"
       transform="matrix(2.2518656,0,0,2.2518656,-405.07535,-820.73401)">
      <path
         id="circle110192"
         style="opacity:1;stroke-width:0.275676;stroke-linecap:square;stroke-linejoin:round;stroke-dashoffset:347.717;paint-order:stroke markers fill"
         d="m 147.84251,352.99509 a 0.93102801,0.93102801 0 0 1 -0.93103,0.93102 0.93102801,0.93102801 0 0 1 -0.93102,-0.93102 0.93102801,0.93102801 0 0 1 0.93102,-0.93103 0.93102801,0.93102801 0 0 1 0.93103,0.93103 z" />
      <path
         id="circle110194"
         style="opacity:1;stroke-width:0.275676;stroke-linecap:square;stroke-linejoin:round;stroke-dashoffset:347.717;paint-order:stroke markers fill"
         d="m 150.24457,352.99509 a 0.93102801,0.93102801 0 0 1 -0.93103,0.93102 0.93102801,0.93102801 0 0 1 -0.93103,-0.93102 0.93102801,0.93102801 0 0 1 0.93103,-0.93103 0.93102801,0.93102801 0 0 1 0.93103,0.93103 z" />
      <path
         id="circle110196"
         style="opacity:1;stroke-width:0.275676;stroke-linecap:square;stroke-linejoin:round;stroke-dashoffset:347.717;paint-order:stroke markers fill"
         d="m 152.6822,352.99509 a 0.93102801,0.93102801 0 0 1 -0.93103,0.93102 0.93102801,0.93102801 0 0 1 -0.93102,-0.93102 0.93102801,0.93102801 0 0 1 0.93102,-0.93103 0.93102801,0.93102801 0 0 1 0.93103,0.93103 z" />
    </g>
    <g
       id="g110309"
       transform="matrix(2.2518656,0,0,2.2518656,-405.41249,-820.73401)">
      <path
         id="rect110220"
         style="opacity:1;stroke-width:0.213328;stroke-linecap:square;stroke-linejoin:round;stroke-dashoffset:347.717;paint-order:stroke markers fill"
         d="m 145.27286,350.05414 h 2.45262 v 1.18759 h -2.45262 z" />
      <path
         id="rect110302"
         style="opacity:1;stroke-width:0.213328;stroke-linecap:square;stroke-linejoin:round;stroke-dashoffset:347.717;paint-order:stroke markers fill"
         d="m 148.26764,350.05414 h 2.45262 v 1.18759 h -2.45262 z" />
      <path
         id="rect110304"
         style="opacity:1;stroke-width:0.213328;stroke-linecap:square;stroke-linejoin:round;stroke-dashoffset:347.717;paint-order:stroke markers fill"
         d="m 151.2366,350.05414 h 2.45263 v 1.18759 h -2.45263 z" />
    </g>
  </g>
</svg>
