<?xml version="1.0" encoding="UTF-8" standalone="no"?>
<!-- Created with Inkscape (http://www.inkscape.org/) -->

<svg
   width="23.9839mm"
   height="38.984768mm"
   viewBox="0 0 23.9839 38.984768"
   preserveAspectRatio="none"
   version="1.1"
   id="svg479"
   inkscape:export-filename="target_02.svg"
   inkscape:export-xdpi="96"
   inkscape:export-ydpi="96"
   sodipodi:docname="target_agent.svg"
   inkscape:version="1.2 (dc2aedaf03, 2022-05-15)"
   xmlns:inkscape="http://www.inkscape.org/namespaces/inkscape"
   xmlns:sodipodi="http://sodipodi.sourceforge.net/DTD/sodipodi-0.dtd"
   xmlns="http://www.w3.org/2000/svg"
   xmlns:svg="http://www.w3.org/2000/svg">
  <sodipodi:namedview
     id="namedview481"
     pagecolor="#ffffff"
     bordercolor="#666666"
     borderopacity="1.0"
     inkscape:showpageshadow="2"
     inkscape:pageopacity="0.0"
     inkscape:pagecheckerboard="0"
     inkscape:deskcolor="#d1d1d1"
     inkscape:document-units="mm"
     showgrid="false"
     inkscape:zoom="6.7868388"
     inkscape:cx="77.060914"
     inkscape:cy="30.205521"
     inkscape:window-width="1920"
     inkscape:window-height="1009"
     inkscape:window-x="-8"
     inkscape:window-y="-8"
     inkscape:window-maximized="1"
     inkscape:current-layer="g22100"
     inkscape:pageshadow="2" />
  <defs
     id="defs476">
    <linearGradient
       id="a"
       x1="25376"
       x2="25363"
       y1="34699"
       y2="34700"
       gradientTransform="matrix(0.00366,6.5e-4,-6.5e-4,0.00366,-236.71,39.157)"
       gradientUnits="userSpaceOnUse">
      <stop
         stop-color="#1a2b42"
         offset="0"
         id="stop8" />
      <stop
         offset="1"
         id="stop10" />
    </linearGradient>
    <filter
       id="b"
       x="-0.49152364"
       y="-0.49152364"
       width="1.9830473"
       height="1.9830473"
       color-interpolation-filters="sRGB">
      <feGaussianBlur
         stdDeviation="2.363"
         id="feGaussianBlur2" />
    </filter>
    <filter
       id="c"
       x="-0.62158614"
       y="-0.31070045"
       width="2.2431723"
       height="1.6214009"
       color-interpolation-filters="sRGB">
      <feGaussianBlur
         stdDeviation="2.606"
         id="feGaussianBlur5" />
    </filter>
  </defs>
  <g
     inkscape:label="Layer 1"
     inkscape:groupmode="layer"
     id="layer1"
     transform="translate(-101.6471,1.5627803)">
    <g
       id="g22100"
       transform="matrix(0.30279786,0,0,0.30279786,-48.076192,2.4952675)">
      <path
         id="rect22011"
         style="opacity:1;fill:#ffffff;stroke-width:0.765;stroke-linecap:round;stroke-linejoin:round;stroke-dashoffset:347.717;paint-order:stroke markers fill"
         d="M 513.24408,12.082406 H 557.3397 V 56.5911 h -44.09562 z" />
      <path
         id="rect21373"
         style="opacity:1;fill:#000000;fill-opacity:1;stroke:none;stroke-width:30.1024;stroke-linecap:round;stroke-linejoin:round;stroke-dashoffset:347.717;paint-order:stroke markers fill"
         d="M 1925.7695,33.566406 V 224.81641 h 191.25 V 33.566406 Z m 28.8828,28.882813 h 133.4844 V 195.93359 h -133.4844 z"
         transform="scale(0.26458333)" />
      <g
         id="g112367-6"
         transform="matrix(1.2005591,0,0,1.2005591,396.18249,-696.8613)">
        <path
           id="rect112365-1"
           style="opacity:1;stroke-width:1.42593;stroke-linecap:round;stroke-linejoin:round;stroke-dashoffset:347.717;paint-order:stroke markers fill"
           d="m 114.6046,617.34119 h 3.76437 v 58.83103 h -3.76437 z" />
      </g>
      <path
         style="fill:#ffffff;stroke:#000000;stroke-width:0.765;stroke-linecap:butt;stroke-linejoin:miter;stroke-miterlimit:4;stroke-dasharray:none;stroke-opacity:1"
         d="m 516.49703,7.5385953 -0.82613,5.9379347 2.20189,3.905065 3.27133,2.445943 1.43111,4.958943 -1.32784,2.734554 7.53859,-0.25817 8.98435,-2.32354 c 0,0 2.32354,-5.731398 2.32354,-5.937934 0,-0.206537 0.69289,-5.013385 0.69289,-5.013385 0,0 0.95941,1.605527 1.42412,0.727745 0.46472,-0.877782 2.42681,-2.013735 0.51634,-4.027469 -1.91048,-2.0137342 -0.9294,-3.8725657 -0.9294,-3.8725657 l -2.63335,-2.3751741 c 0,0 0.82614,-5.36995803 0.0516,-7.0738871 -0.77451,-1.7039291 -3.82093,-4.3372738 -3.82093,-4.3372738 0,0 -4.15433,-3.9430753 -6.33862,-3.2743553 -2.18427,0.6687198 -2.37665,-0.72384 -4.64143,0.2459366 -2.26478,0.969777 -2.98513,2.1592419 -4.16551,2.0053395 -0.73623,-0.095993 -3.43888,2.3711569 -3.98296,3.4526812 -0.54412,1.0815243 -1.31864,8.5168511 -1.31864,8.5168511 z"
         id="path21513"
         sodipodi:nodetypes="ccccccccscssccscsssscc" />
      <path
         id="path20742"
         style="fill:#000000;stroke-width:0.406023"
         d="m 1995.4863,-38.978516 c -0.3621,0.0079 -0.8456,0.03422 -1.4746,0.07031 -2.7769,0.15942 -3.6318,0.615917 -3.2109,1.712891 0.2347,0.611785 0.3577,0.632005 1.6445,0.287109 0.5025,-0.134657 0.9141,-0.51647 0.9141,-0.849609 0,-0.432168 0.2717,-0.539153 0.9492,-0.369141 0.55,0.138066 1.2749,-0.0093 1.7246,-0.351563 0.5235,-0.398691 0.5391,-0.52383 -0.5469,-0.5 z m -7.6758,0.06055 c -0.3416,0.0257 -0.6785,0.09257 -0.957,0.208985 -0.8673,0.362532 -0.7836,0.391666 0.6172,0.220703 l 1.625,-0.197266 -1.291,0.509766 c -0.7098,0.280138 -1.4161,0.638108 -1.5703,0.794922 -0.3999,0.406509 2.7862,-0.492753 3.2246,-0.910157 0.4345,-0.413642 -0.6231,-0.704044 -1.6485,-0.626953 z m 11.7715,0.197266 c -0.7848,0.02683 -1.4777,0.192099 -2.2031,0.486328 l -1.7891,0.724609 1.752,0.02344 c 1.93,0.02502 1.9715,0.621996 0.072,1.039062 -1.4305,0.314189 -1.6618,0.987387 -0.2461,0.716797 0.5321,-0.101726 1.0809,5.73e-4 1.2207,0.226563 0.1413,0.228669 -0.2874,0.515277 -0.9668,0.646484 -0.6719,0.129827 -1.7715,0.342832 -2.4434,0.472656 -0.6718,0.129827 -1.1169,0.40228 -0.9902,0.607422 0.3201,0.517858 2.519,0.470178 2.6953,-0.05859 0.1946,-0.584239 3.4055,-0.988262 3.7266,-0.46875 0.153,0.247484 -0.2534,0.387472 -1.0215,0.351563 -0.7063,-0.03307 -1.3555,0.167997 -1.4551,0.451172 -0.1391,0.395933 0.8116,0.478945 4.2207,0.365234 3.9762,-0.13254 4.1449,-0.11198 1.7598,0.22461 -1.4516,0.20485 -2.9158,0.51935 -3.2539,0.697265 -0.3383,0.178012 -1.2053,0.234945 -1.9278,0.128906 -0.7884,-0.115705 -1.3144,-0.01683 -1.3144,0.246094 0,0.240972 0.9294,0.562349 2.0644,0.712891 2.1856,0.289927 2.0348,0.926692 -0.2363,0.998047 -0.6699,0.02105 -0.9901,0.129554 -0.7109,0.242187 0.8139,0.328441 0.5945,0.712131 -0.7442,1.304688 -0.8614,0.38128 -1.1192,0.683512 -0.8301,0.972656 0.2892,0.289157 1.0028,0.198997 2.2911,-0.292969 1.0288,-0.392884 1.9798,-0.604098 2.1152,-0.46875 0.1353,0.135364 -0.058,0.246094 -0.4297,0.246094 -0.3723,0 -0.6777,0.164775 -0.6777,0.367188 0,0.202407 0.3954,0.266619 0.8769,0.140624 0.6005,-0.156875 0.783,-0.08178 0.584,0.240235 -0.1599,0.258497 -0.8734,0.487517 -1.5859,0.509765 -0.7126,0.02226 -1.7523,0.188397 -2.3106,0.367188 l -1.0156,0.324219 1.1172,0.04102 c 0.6141,0.0223 1.0714,0.248358 1.0156,0.503907 -0.056,0.255533 0.491,0.626749 1.2168,0.824218 1.9481,0.530026 1.6144,1.0164 -1.0137,1.472657 -1.9286,0.334828 -2.5277,0.291392 -3.4433,-0.246094 -0.7985,-0.468767 -0.9691,-0.747786 -0.6094,-0.998047 0.6763,-0.470483 -2.488,0.01701 -5.998,0.923828 -1.5633,0.403824 -3.13,0.720159 -3.4825,0.703125 -0.6889,-0.03326 -5.1963,1.677792 -5.834,2.214844 -0.212,0.178658 -0.6695,0.317816 -1.0156,0.308594 -0.3462,-0.0091 -0.082,-0.30097 0.5879,-0.650391 0.6699,-0.349417 1.9016,-1.096727 2.7363,-1.660156 0.9305,-0.627995 2.1356,-1.040781 3.1133,-1.066407 0.8772,-0.02306 1.5162,-0.16854 1.4199,-0.324218 -0.175,-0.283049 0.2493,-0.447405 2.4082,-0.929688 0.8424,-0.188296 1.0701,-0.125587 0.8477,0.234375 -0.2064,0.333997 -0.097,0.411817 0.3457,0.242188 0.3575,-0.137235 1.3526,-0.4388 2.2109,-0.669922 0.8583,-0.231118 1.9197,-0.69418 2.3594,-1.029297 0.6831,-0.52059 0.5159,-0.51532 -1.1504,0.03711 -3.009,0.997561 -2.7041,0.375269 0.5977,-1.21875 1.6372,-0.790378 2.8472,-1.444339 2.6875,-1.455078 -0.5477,-0.03534 -4.1759,1.294918 -4.3789,1.605469 -0.175,0.267738 -3.7473,1.623047 -4.2774,1.623047 -0.1039,0 -0.1894,-0.179384 -0.1894,-0.398438 0,-0.219061 0.4573,-0.512237 1.0156,-0.652343 0.5583,-0.140123 1.0137,-0.509547 1.0137,-0.820313 0,-0.725025 -0.6589,-0.734544 -0.9356,-0.01367 -0.2022,0.527431 -2.104,1.182885 -3.6523,1.259766 -0.4025,0.01999 -0.8599,0.21576 -1.0156,0.433594 -0.4574,0.63984 -2.4899,1.570738 -2.7852,1.27539 -0.1493,-0.149291 0,-0.271484 0.3359,-0.271484 0.3349,0 1.1963,-0.731755 1.9141,-1.625 1.3271,-1.651413 1.2485,-2.10615 -0.1777,-1.027344 -0.4335,0.327874 -1.0343,0.601701 -1.334,0.609375 -0.2997,0.0071 -1.0251,0.390856 -1.6133,0.853516 -0.6273,0.493334 -1.1297,0.661489 -1.2148,0.40625 -0.2159,-0.646902 -1.12,-0.526825 -1.75,0.232422 -0.4952,0.596594 -0.4473,0.637804 0.457,0.386718 0.8665,-0.240604 0.907,-0.215676 0.2773,0.177735 -0.4043,0.252661 -0.9839,0.365136 -1.289,0.248047 -0.305,-0.11709 -0.7858,0.06573 -1.0684,0.40625 -0.9344,1.125872 -3.7737,2.830085 -6.2461,3.75 -1.3399,0.498523 -3.1109,1.259949 -3.9355,1.693359 -0.8329,0.437764 -1.6016,0.620702 -1.7305,0.412109 -0.1277,-0.206551 0.136,-0.49205 0.5859,-0.634765 0.9211,-0.292385 1.0723,-0.85246 0.3086,-1.138672 -0.3556,-0.133304 -0.2756,-0.368283 0.2637,-0.783203 0.7529,-0.579024 0.7518,-0.590596 -0.027,-0.533203 -0.4383,0.03213 -1.3894,0.48066 -2.1133,0.996093 -0.7239,0.515445 -1.3991,0.85293 -1.5,0.751954 -0.2892,-0.289059 4.2526,-4.371094 4.8633,-4.371094 0.3008,0 0.797,-0.306802 1.1035,-0.683594 0.4854,-0.596655 0.4704,-0.653076 -0.1211,-0.431641 -0.5396,0.201978 -0.6444,0.05725 -0.5059,-0.707031 0.1289,-0.711063 -0.05,-1.034608 -0.6855,-1.236328 -0.8545,-0.271208 -0.8532,-0.274242 0.1,-0.822266 1.7113,-0.984612 2.0052,-1.094395 2.2598,-0.839843 0.1379,0.137881 -0.099,0.644513 -0.5254,1.125 -0.7723,0.869631 -0.7727,0.871737 0.1367,0.394531 0.5024,-0.263671 0.914,-0.731797 0.914,-1.039063 0,-0.855017 2.4506,-2.743293 3.1915,-2.458984 0.3525,0.135409 0.511,0.116717 0.3515,-0.04297 -0.3084,-0.308413 2.6617,-1.783203 3.5918,-1.783203 0.5599,0 1.3926,-1.205469 1.3926,-2.017578 0,-0.323059 -0.2286,-0.324557 -0.8242,-0.0059 -0.4529,0.242369 -0.7277,0.594911 -0.6114,0.783203 0.1165,0.188277 -0.2898,0.466297 -0.9023,0.61914 -0.6126,0.152844 -1.9971,0.720799 -3.0762,1.261719 -1.0791,0.540923 -2.4284,0.984375 -2.998,0.984375 -0.5696,0 -1.3707,0.385961 -1.7813,0.859375 -0.7235,0.834258 -0.8007,0.841707 -2.4843,0.197266 l -1.7364,-0.666016 0.959,0.820313 c 0.5276,0.450562 0.7575,0.818359 0.5137,0.818359 -0.2438,0 -0.5572,0.457348 -0.6973,1.015625 -0.1402,0.558293 -0.4044,1.015625 -0.5879,1.015625 -0.1833,0 -0.1732,-0.561322 0.024,-1.246094 0.2623,-0.914715 0.2266,-1.201267 -0.1309,-1.082031 -0.268,0.08927 -0.4863,0.419964 -0.4863,0.736328 0,0.880663 -1.4709,2.036682 -2.2696,1.783203 -0.4846,-0.153827 -0.7966,0.04744 -0.9824,0.632813 -0.1561,0.49166 -0.5045,0.769317 -0.8144,0.65039 -0.3311,-0.126992 -0.6984,0.242545 -0.9453,0.951172 -0.4394,1.260374 -0.2749,1.688256 0.5312,1.378907 0.2842,-0.109115 0.6336,0.100448 0.7734,0.464843 0.2933,0.763915 -0.7688,2.05742 -1.164,1.417969 -0.1391,-0.225033 -0.059,-0.410156 0.1777,-0.410156 0.2366,0 0.4297,-0.170535 0.4297,-0.378906 0,-0.672945 -2.6166,-0.348031 -3.3496,0.416015 -1.0875,1.133511 -0.8935,2.256186 0.4727,2.732422 0.6508,0.226923 1.2912,0.306364 1.4218,0.175781 0.1308,-0.13062 0.2364,0.0653 0.2364,0.4375 0,0.37217 0.2618,0.677735 0.582,0.677735 0.3875,0 0.5706,0.41889 0.5469,1.255859 -0.019,0.691223 0.1529,1.377189 0.3828,1.523438 0.2298,0.146191 0.567,0.905897 0.75,1.6875 0.1829,0.781586 0.3656,1.557115 0.4062,1.724609 0.041,0.167471 0.097,0.579098 0.125,0.914062 0.026,0.33498 0.3251,0.6093754 0.6602,0.6093754 0.3348,0 0.5617,-0.2242024 0.5058,-0.4980464 -0.1761,-0.86315 1.6318,-0.815532 2.5137,0.06641 0.6427,0.6426817 0.6963,0.8378904 0.2285,0.8378904 -0.7306,0 -0.8302,0.8056537 -0.1015,0.8242187 0.2993,0.00756 0.2017,0.2440724 -0.2364,0.5761719 -0.7165,0.5430387 -0.7142,0.5944507 0.086,1.3945312 0.5781,0.5781506 0.9193,0.6858771 1.1211,0.359375 0.1595,-0.2578014 0.073,-0.5408243 -0.1914,-0.6289062 -0.2646,-0.088101 -0.3763,-0.3270119 -0.25,-0.53125 0.3507,-0.5673184 0.9921,-0.4422891 0.9921,0.1933594 0,0.7741757 1.742,1.1489539 3.043,0.6542968 1.36,-0.517334 2.2373,-0.5229039 1.4258,-0.00977 -0.5205,0.3290457 -0.4914,0.4689513 0.2031,0.9804688 0.739,0.5442066 0.8284,0.5184507 1.0293,-0.2851563 0.1618,-0.6472063 0.3077,-0.7397927 0.5488,-0.3496093 0.1807,0.2921195 0.5741,0.4358564 0.875,0.3203124 0.3009,-0.1155022 1.1335,0.3387644 1.8497,1.0078126 0.7401,0.6913699 1.5603,1.117953 1.8984,0.9882812 0.3367,-0.129222 1.0052,0.2148181 1.541,0.7929688 1.0791,1.16434 2.2669,1.3132528 3.0391,0.3828124 0.291,-0.3504376 0.8612,-0.5495489 1.2676,-0.4433593 0.4702,0.1229858 0.7382,-0.026994 0.7382,-0.4121094 0,-0.332674 0.2286,-0.5243021 0.5078,-0.4257813 0.279,0.098494 0.4822,0.4789416 0.4512,0.8457032 -0.063,0.7433499 1.6549,0.9590605 2.086,0.2617187 0.1379,-0.2232945 0.5948,-0.40625 1.0156,-0.40625 0.4208,0 1.0127,-0.35429 1.3144,-0.7851562 0.6566,-0.9372397 2.7461,-1.580534 2.7461,-0.8457031 0,0.2684219 -0.3601,0.5824775 -0.7988,0.6972656 -0.6994,0.1828913 -0.7235,0.2804687 -0.2031,0.8007812 0.3963,0.3963364 0.8966,0.4899064 1.5078,0.28125 0.5032,-0.1717795 1.0367,-0.3212974 1.1855,-0.3320312 0.1489,-0.010961 0.4068,-0.1567101 0.5743,-0.3242188 0.1673,-0.1674708 0.7589,-0.3046875 1.3124,-0.3046875 h 1.0059 l -1.0742,0.9960938 c -0.5909,0.5476308 -1.0742,1.0944951 -1.0742,1.2167969 0,0.522323 2.5224,0.162516 3.7715,-0.5390626 1.7717,-0.9951192 3.6676,-1.3997759 6.1757,-1.3144531 1.1166,0.037946 2.8526,-0.1206211 3.8575,-0.3535156 2.5444,-0.5896894 14.1006,-2.4443352 15.164,-2.4335937 0.481,0.00491 1.2682,0.3250969 1.75,0.7109374 0.822,0.6582048 0.8484,0.8509432 0.4317,3.1367188 -0.4564,2.50288627 -0.9018,3.18706606 -1.8516,2.83789062 -0.2993,-0.11002203 -0.703,-0.10189274 -0.8965,0.01757813 -0.5374,0.33210709 0.024,1.40820315 0.7344,1.40820315 0.4813,0 0.427,0.1744695 -0.2344,0.7480469 l -0.8633,0.7480468 0.8164,0.8769532 c 0.7931,0.8512666 0.6059,1.0807884 -0.7382,0.90625 -0.2793,-0.036283 -0.5079,0.3089929 -0.5079,0.7675781 0,0.4586003 -0.3556,1.1390989 -0.791,1.5117187 -0.4351,0.3726236 -0.6993,0.8282416 -0.5859,1.0117188 0.2222,0.3595842 -0.3216,0.4652335 -1.7715,0.3476562 -0.5213,-0.042293 -1.0242,0.2091498 -1.168,0.5839844 -0.1387,0.361852 -0.8218,0.9198896 -1.5195,1.2402344 l -1.2695,0.583985 1.8281,-0.126953 c 1.0049,-0.06985 2.1007,-0.249163 2.4355,-0.396485 0.3349,-0.14725 0.8838,-0.08619 1.2188,0.134766 0.5414,0.357127 0.5414,0.447357 0,0.802734 -0.4072,0.267288 -0.4412,0.39969 -0.1016,0.404297 0.279,0.0032 0.5079,0.188797 0.5078,0.412109 0,0.223295 -0.2743,0.406251 -0.6093,0.40625 -0.3772,0 -0.6094,0.382405 -0.6094,1.003907 0,0.86685 -0.3044,1.091606 -2.2266,1.65039 -3.5279,1.025587 -3.2037,1.49353 0.8086,1.167969 l 3.5332,-0.285156 -0.957,1.46289 c -0.5259,0.805206 -1.3209,1.631949 -1.7676,1.835938 -0.4466,0.204019 -1.5867,0.711751 -2.5332,1.130859 -0.9464,0.41912 -1.7215,0.898924 -1.7246,1.066407 -0.01,0.384056 -0.097,0.400501 1.8223,-0.291016 2.2104,-0.79635 4.5922,-0.762549 6.2695,0.08984 1.8499,0.940108 1.9805,1.586371 0.3906,1.935547 -0.7153,0.157115 -2.9241,1.271506 -4.9082,2.474609 -1.9841,1.203107 -3.9533,2.1875 -4.375,2.1875 -0.4216,0 -1.5836,0.622681 -2.582,1.384766 -0.9984,0.762085 -2.3023,1.640777 -2.8984,1.953125 -0.5961,0.31234 -1.3034,1.014005 -1.5723,1.558593 -0.2687,0.544574 -0.896,1.170184 -1.3945,1.390625 -0.4985,0.220422 -0.9082,0.732264 -0.9082,1.136719 0,0.444042 -0.5176,0.952554 -1.3086,1.285156 -1.1596,0.487567 -1.4823,0.46372 -2.8047,-0.210937 -0.8217,-0.41918 -1.9605,-1.358574 -2.5313,-2.087891 -0.7415,-0.947508 -1.1639,-1.201265 -1.4765,-0.888672 -0.3126,0.312567 0.09,1.006865 1.4082,2.431641 1.0148,1.096637 1.7991,2.240377 1.7422,2.541016 -0.1391,0.733889 -2.7968,1.614077 -5.8282,1.93164 -2.1596,0.226243 -2.5739,0.153846 -3.248,-0.564453 -0.425,-0.452852 -1.7344,-1.136639 -2.9102,-1.519531 -1.1758,-0.382889 -2.236,-0.856248 -2.3574,-1.052735 -0.1213,-0.196496 -0.5058,-0.357421 -0.8535,-0.357421 -0.3477,0 -1.4788,-0.607971 -2.5137,-1.351563 -1.0348,-0.743595 -2.4754,-1.588545 -3.2012,-1.876953 -0.7256,-0.288416 -1.3203,-0.643546 -1.3203,-0.791016 0,-0.274242 -2.3879,-1.009967 -4.7988,-1.478515 -0.7408,-0.143962 -1.8365,-0.51753 -2.4355,-0.830078 -0.5991,-0.31253 -1.5247,-0.571053 -2.0567,-0.572266 -0.5319,-0.0012 -1.6071,-0.398611 -2.3906,-0.882812 -1.3151,-0.812758 -1.4627,-0.828478 -1.9199,-0.203126 -0.5028,0.687614 -1.423,0.929292 -1.4199,0.373047 0,-0.917556 1.7101,-2.873292 2.8945,-3.320312 3.6369,-1.37263 4.0558,-2.128757 1.3672,-2.464844 -1.0035,-0.125442 -1.5843,-0.397331 -1.5215,-0.710937 0.056,-0.279118 -0.081,-0.507813 -0.3047,-0.507813 -0.2234,0 -0.4062,-0.1655 -0.4062,-0.369141 0,-0.203677 0.729,-0.493837 1.621,-0.644531 2.3629,-0.399201 2.6221,-1.187011 0.3047,-0.925781 -2.0552,0.231647 -3.3474,-0.232553 -2.3808,-0.855469 0.558,-0.359697 0.2585,-1.442788 -0.3028,-1.095703 -0.418,0.258369 -0.979,-0.209537 -1.6328,-1.367187 -0.4012,-0.710661 -0.4308,-1.042621 -0.1015,-1.152344 0.2536,-0.08459 0.4629,-0.316667 0.4629,-0.515625 0,-0.494136 -2.3775,-1.687333 -2.9688,-1.490234 -0.465,0.154997 -1.0389,-0.593163 -1.8769,-2.445313 -0.2276,-0.502447 -0.5753,-0.912109 -0.7735,-0.912109 -0.4734,0 -1.8279,-4.3217324 -1.5137,-4.8300789 0.1335,-0.2160378 0.081,-0.4929591 -0.1171,-0.6152344 -0.1992,-0.1230614 -0.2184,-0.9950265 -0.043,-1.953125 0.1738,-0.9519534 0.226,-1.8774305 0.1152,-2.0566406 -0.1107,-0.1791874 0.019,-0.58977237 0.2852,-0.91210938 0.2676,-0.32235589 0.3797,-0.86141216 0.25,-1.19921872 -0.3016,-0.7857298 -1.636,-0.795402 -2.2832,-0.015625 -0.6967,0.83944056 -2.8496,1.86982863 -2.8496,1.36328122 0,-0.22654487 0.6377,-1.1588076 1.4179,-2.07031252 0.7802,-0.9115162 1.3653,-1.7108959 1.2989,-1.7773437 -0.2786,-0.2784 -3.0972,1.3169599 -3.1094,1.7597656 -0.01,0.2659654 -0.2031,0.6006584 -0.4356,0.7441406 -0.6564,0.40568319 0.011,-1.9576298 0.711,-2.5175781 0.3681,-0.294463 0.4958,-0.7951769 0.334,-1.3046875 -0.1444,-0.4545865 -0.064,-1.1992342 0.1796,-1.6542969 0.5333,-0.9963364 0.303,-1.0628351 -0.5898,-0.1699219 -1.0423,1.0422955 -1.1865,0.3416703 -0.2031,-0.9882812 0.4912,-0.6644674 0.9223,-1.804892 0.959,-2.5332026 0.045,-0.898662 0.316,-1.411308 0.8418,-1.595703 0.4788,-0.167962 0.6056,-0.375887 0.332,-0.544922 -0.2434,-0.150388 -0.3526,-0.617868 -0.2422,-1.039063 0.11,-0.421194 -0.027,-0.906757 -0.3047,-1.078125 -0.325,-0.200806 -0.3998,-0.143932 -0.2129,0.158204 0.1678,0.271558 0.043,0.46875 -0.2968,0.46875 -0.5091,0 -0.8267,0.555336 -1.2813,2.240234 -0.061,0.227414 -0.6508,1.231633 -1.3105,2.2324214 -1.4023,2.1272389 -2.0027,3.5677295 -2.5352,6.0839843 -0.2128,1.0049008 -0.5659,2.64938478 -0.7852,3.6542969 -1.5159,6.9467635 -2.22,13.8035834 -1.5312,14.9179694 0.1413,0.228775 0.051,1.008497 -0.2012,1.730468 -0.342,0.980958 -0.3342,2.043162 0.025,4.207032 0.5692,3.44335 1.2044,6.242792 1.6719,7.361328 0.1867,0.446619 0.6507,1.818664 1.0312,3.046875 0.3804,1.228225 0.877,2.466198 1.1035,2.751953 0.2812,0.354369 0.2654,0.843874 -0.053,1.541016 -0.8759,1.922419 -0.1788,7.001812 1.2676,9.232422 0.3168,0.488468 0.6867,2.233443 0.8223,3.878906 0.2393,2.904329 0.6116,4.037944 0.9843,2.99414 0.1001,-0.280554 0.3629,-0.39917 0.5821,-0.263672 0.2192,0.135534 0.4978,-0.131947 0.6191,-0.595703 0.1783,-0.682945 0.3662,-0.766368 0.9844,-0.435547 0.4197,0.224656 0.7274,0.540365 0.6836,0.701172 -0.044,0.160819 0.2304,0.877119 0.6113,1.591797 0.3814,0.715574 0.6934,2.192687 0.6934,3.28711 0,1.471702 0.211,2.178434 0.8125,2.722656 1.0775,0.97505 1.0303,1.715369 -0.1016,1.589844 -0.5024,-0.05571 -1.0435,-0.116209 -1.2031,-0.134766 -0.7252,-0.08455 -1.207,-1.777244 -0.7754,-2.724609 0.5025,-1.10278 0.2662,-1.239028 -0.6172,-0.355469 -0.7741,0.774145 -1.326,0.774145 -1.623,0 -0.1285,-0.33498 -0.3818,-0.609375 -0.5626,-0.609375 -0.1809,0 0,0.686019 0.4043,1.523437 1.4714,3.059524 1.9627,4.411194 2.42,6.644532 0.6206,3.030546 2.9749,5.073251 5.4824,4.759765 1.0408,-0.130129 1.1812,0.05628 2.3574,3.111328 0.6877,1.786489 1.6785,3.928738 2.2012,4.761719 0.5228,0.832978 0.9491,1.65621 0.9492,1.828125 10e-5,0.831296 4.2499,6.789757 6.6758,9.361328 2.454,2.601362 3.065,3.910889 1.7187,3.679688 -0.5122,-0.08795 -2.2456,0.358579 -7.3789,1.896484 -2.4713,0.740353 -3.3455,1.19434 -3.6543,1.902344 -0.3077,0.705063 -0.6755,0.899759 -1.5215,0.800781 -0.7998,-0.0935 -1.1171,0.05074 -1.1171,0.507813 0,0.602917 -0.5094,0.836429 -1.4219,0.652343 -0.2233,-0.04505 -0.2714,0.0528 -0.1074,0.216797 0.4281,0.42807 -0.9456,1.363559 -2.0235,1.378906 -0.5025,0.0072 -0.914,0.222045 -0.914,0.476567 0,0.59939 -1.2402,1.53811 -2.0547,1.55468 -0.3488,0.007 -1.04,0.56052 -1.5352,1.23047 -0.9226,1.24781 -2.0937,1.63322 -2.0937,0.68945 0,-0.2903 0.2183,-0.7457 0.4863,-1.01367 0.379,-0.37888 0.379,-0.48828 0,-0.48828 -0.2679,0 -0.4863,0.18293 -0.4863,0.40625 0,0.2233 -0.2151,0.40625 -0.4766,0.40625 -0.2616,0 -0.7626,0.25561 -1.1152,0.56641 -0.3526,0.31079 -1.9172,1.07082 -3.4766,1.68945 -1.5596,0.61863 -3.0802,1.36917 -3.3789,1.66797 -0.2986,0.29877 -0.6917,0.54297 -0.873,0.54297 -0.1814,0 -0.4424,0.40964 -0.5801,0.91211 -0.2094,0.76334 -0.3168,0.81358 -0.6543,0.30468 -0.297,-0.44816 -0.1896,-0.78714 0.4062,-1.2832 0.9165,-0.76322 0.9685,-1.23227 0.209,-1.55469 l -1.7226,3.53321 -1.1426,0.28711 c -0.6274,0.15745 -1.5904,0.64144 -2.1406,1.07422 -0.5502,0.43277 -1.2602,0.78711 -1.5782,0.78711 -0.3183,0 -0.4659,0.18097 -0.3281,0.40429 0.1379,0.2233 -0.1243,0.40625 -0.584,0.40625 -0.4598,0 -0.8359,0.18958 -0.8359,0.41992 0,0.23033 -0.2949,0.53001 -0.6543,0.66797 -0.3594,0.13788 -1.1136,0.68028 -1.6777,1.20313 -0.619,0.57349 -1.1692,0.72903 -1.92,0.74414 v 94.0039 h 2.2149 49.6328 l -0.2481,-1.7246 c -0.2396,-1.6698 -1.1472,-18.07643 -1.6914,-30.56446 l -0.2656,-6.09961 1.3613,-0.59961 c 0.7486,-0.32927 1.3398,-0.73791 1.3125,-0.9082 -0.027,-0.17031 -0.1762,-1.58612 -0.33,-3.14648 -0.2725,-2.76645 -0.3091,-2.83594 -1.4121,-2.83594 h -1.1309 l -0.2617,-4.56836 c -0.3789,-6.57647 -0.3294,-14.02344 0.098,-14.28711 0.2014,-0.12457 0.562,0.32826 0.7989,1.00781 0.7456,2.13864 2.0837,3.62224 4.25,4.70899 1.1528,0.57832 2.9424,1.65475 3.9765,2.39062 1.0341,0.73588 2.4826,1.65054 3.2188,2.03125 1.2539,0.64869 1.3698,0.64771 1.8379,0.008 0.5354,-0.73218 2.1992,-6.52838 2.1992,-7.66211 0,-0.37557 -0.1829,-0.68164 -0.4063,-0.68164 -0.2234,0 -0.4062,-0.18293 -0.4062,-0.40625 0,-0.22329 0.2744,-0.40625 0.6094,-0.40625 0.3349,0 0.6093,-0.168 0.6093,-0.37304 0,-0.20504 0.1108,-0.66044 0.2461,-1.01368 0.1674,-0.43669 0,-0.65933 -0.5078,-0.6914 -0.5915,-0.037 -0.6136,-0.0846 -0.1055,-0.2207 0.4355,-0.11675 0.7684,-0.93151 1.0157,-2.49024 0.3674,-2.31579 0.3678,-2.31576 1.707,-2.18164 0.7371,0.0738 1.5869,-0.0722 1.8906,-0.32422 0.7645,-0.63456 8.6217,-0.86796 9.0723,-0.26953 0.1901,0.2527 0.6806,1.35981 1.0879,2.46094 1.9269,5.20906 5.8101,10.25169 8.541,11.08984 1.3448,0.41269 1.5441,0.36492 2.3437,-0.55469 0.4809,-0.55312 1.1991,-1.86429 1.5938,-2.91406 0.6871,-1.82733 3.0291,-4.81469 3.4473,-4.39648 0.2657,0.26555 -0.6234,2.94461 -1.5645,4.71484 -0.4138,0.77827 -0.7519,1.90924 -0.7519,2.51367 0,1.22642 -2.4008,9.38789 -3.502,11.90625 -0.3905,0.89326 -0.6745,1.76576 -0.6309,1.93946 0.043,0.1737 -0.1953,0.42187 -0.5312,0.55078 -0.3356,0.12884 -0.5164,0.38582 -0.4024,0.57031 0.1141,0.18448 0.022,0.44959 -0.205,0.58984 -0.2271,0.14026 -0.4141,1.26439 -0.4141,2.49805 0,2.60949 -0.7028,5.52794 -4.3379,18.00977 -1.4634,5.02452 -2.8387,9.77503 -3.0566,10.55664 -0.2177,0.78158 -1.0169,3.48648 -1.7774,6.01172 -0.7605,2.52523 -1.3847,4.85573 -1.3847,5.17773 0,0.50794 10.6952,0.58594 80.7988,0.58594 12.7377,0 21.9689,-0.0203 32.7129,-0.0332 V 101.46289 c -3.9716,-1.723966 -3.804,-1.67459 -4.0606,-1.00586 -0.1988,0.51862 -0.4726,0.39928 -1.4589,-0.632811 -1.2071,-1.263013 -2.1468,-1.791957 -1.2383,-0.697266 0.2842,0.342728 0.3225,0.666956 0.094,0.808594 -0.2109,0.130243 -0.4892,-0.03548 -0.6172,-0.369141 -0.1591,-0.414765 -0.8145,-0.605469 -2.0722,-0.605468 -1.8824,0 -2.2113,-0.27906 -1.3516,-1.138672 0.5226,-0.522611 0.1053,-0.66466 -1.457,-0.498047 -0.4215,0.04498 -0.879,-0.0711 -1.0156,-0.257813 -0.1368,-0.186708 -0.6357,-0.554485 -1.1075,-0.816406 -0.6817,-0.378452 -0.9763,-0.355684 -1.4394,0.107422 -0.5063,0.506256 -0.6864,0.487534 -1.375,-0.136719 -0.4358,-0.395172 -1.2863,-0.937707 -1.8887,-1.205078 -0.9654,-0.428587 -1.1236,-0.39105 -1.3457,0.308594 -0.1549,0.488685 -0.593,0.776811 -1.1387,0.751953 -1.0685,-0.04879 -3.127,-0.673077 -2.4082,-0.730469 0.725,-0.05783 0.6302,-0.853515 -0.1015,-0.853515 -0.3349,0 -0.6094,-0.272443 -0.6094,-0.607422 0,-0.33498 -0.1829,-0.609375 -0.4063,-0.609375 -0.2234,0 -0.3605,0.228679 -0.3046,0.507812 0.056,0.279156 -0.1731,0.505859 -0.5079,0.505859 -0.3349,0 -0.7421,0.182931 -0.9062,0.40625 -0.164,0.223333 -0.3016,0.0035 -0.3047,-0.490234 0,-0.699564 -0.3582,-0.992851 -1.6035,-1.328125 -0.8789,-0.236712 -1.7479,-0.406321 -1.9297,-0.375 -1.103,0.189392 -1.752,-0.125991 -1.752,-0.851562 0,-1.078114 -0.1187,-1.094807 2.8829,0.435547 0.9026,0.460126 1.587,0.187216 0.9472,-0.376954 -0.3145,-0.277115 -4.3056,-1.763619 -16.6191,-6.1875 -0.67,-0.24068 -2.2231,-0.807447 -3.4512,-1.259765 -1.2283,-0.452296 -2.6478,-0.825056 -3.1543,-0.828125 -0.5066,-0.0028 -1.0198,-0.163974 -1.1406,-0.359375 -0.3337,-0.539755 -2.0448,-0.423771 -2.5391,0.171875 -0.5792,0.697799 -2.5898,0.639165 -2.8301,-0.08203 -0.1342,-0.40293 0.051,-0.505588 0.6329,-0.353515 0.4518,0.118148 1.0691,0.03987 1.373,-0.173828 0.3734,-0.26264 -0.01,-0.324294 -1.1738,-0.191407 -0.9491,0.108208 -1.7246,0.02999 -1.7246,-0.171874 0,-0.202054 -0.1934,-0.367188 -0.4297,-0.367188 -0.3907,0 -3.0039,-1.887075 -4.3653,-3.152344 -0.3039,-0.282519 -1.22,-1.01232 -2.0351,-1.623047 -2.7893,-2.090271 -3.8111,-3.142801 -4.627,-4.765625 -0.4492,-0.893246 -1.2504,-2.20389 -1.7812,-2.912109 -0.8827,-1.177848 -0.9806,-1.775111 -1.1524,-7.003906 -0.1032,-3.143921 -0.093,-5.716797 0.025,-5.716797 0.1171,0 0.4874,0.274395 0.8223,0.609375 1.0108,1.010729 2.3253,0.702392 3.9004,-0.914063 2.5,-2.565573 2.7802,-3.742853 2.9687,-12.441406 0.1455,-6.721364 0.096,-7.599778 -0.3769,-6.583984 -0.6228,1.337483 -0.8005,1.167398 -1.457,-1.376953 -0.2593,-1.004913 -0.8266,-2.600244 -1.2598,-3.546875 -1.0788,-2.356997 -0.9623,-4.167969 0.2695,-4.167969 1.2098,0 0.257,-4.816556 -1.291,-6.527344 -0.3939,-0.43522 -1.2788,-0.938918 -1.9668,-1.117187 l -1.2519,-0.324219 -0.037,-7.583985 c -0.03,-6.4598124 -0.1376,-7.6965721 -0.7109,-8.3300776 -0.3704,-0.4091641 -0.6746,-0.9134173 -0.6758,-1.1191406 0,-0.2057197 -0.7307,-1.8345943 -1.6211,-3.6210938 -0.8905,-1.7864995 -1.6199,-3.5784433 -1.6211,-3.9824219 0,-0.4570393 -0.1829,-0.6240972 -0.4785,-0.4414062 -0.3209,0.1984252 -0.3893,0.070271 -0.2109,-0.3945313 0.1452,-0.3782438 -0.04,-1.4462642 -0.4121,-2.375 -0.4946,-1.2362041 -0.5454,-1.7322172 -0.1934,-1.8496094 0.5825,-0.194192 0.646,-1.3105472 0.074,-1.3105472 -0.2234,0 -0.4062,-0.274395 -0.4062,-0.609375 0,-0.396196 -0.3979,-0.609375 -1.1367,-0.609375 -0.6631,0 -2.2917,-0.761243 -3.916,-1.828125 -2.8359,-1.862645 -2.7126,-2.49037 0.1972,-1.005859 0.9259,0.472373 1.6074,0.633166 1.6074,0.378906 0,-0.523101 -2.7907,-3.228515 -3.33,-3.228515 -0.2052,0 -0.2596,-0.181593 -0.1231,-0.402344 0.1421,-0.229833 -0.02,-0.298109 -0.3808,-0.160156 -0.3454,0.13251 -0.526,0.405558 -0.4024,0.605468 0.1235,0.199937 -0.081,0.361329 -0.4531,0.361329 -0.4499,0 -0.5936,-0.213376 -0.4297,-0.640626 0.1357,-0.353233 0.2461,-0.810579 0.2461,-1.015624 0,-0.535488 2.3392,-0.461054 2.5195,0.08008 0.083,0.249108 0.5092,0.359517 0.9473,0.246093 0.7472,-0.193511 0.7398,-0.22479 -0.1172,-0.5 -0.8318,-0.267137 -1.0932,-0.682237 -0.9609,-1.519531 0.026,-0.167471 -0.2863,-0.302734 -0.6953,-0.302734 -0.4089,0 -0.9675,-0.411616 -1.2422,-0.914063 -0.2748,-0.50245 -1.3571,-1.55435 -2.4043,-2.335937 -1.0472,-0.781607 -2.2376,-1.831536 -2.6446,-2.333985 -0.407,-0.502447 -0.898,-0.914062 -1.0937,-0.914062 -0.1954,0 -0.8488,-0.455395 -1.4512,-1.013672 -0.6024,-0.558276 -1.2965,-1.018833 -1.543,-1.023437 -0.2464,-0.0043 -1.1292,-0.596879 -1.9609,-1.31836 -1.3827,-1.199423 -3.7616,-2.508705 -9.5488,-5.251953 -1.1703,-0.554765 -1.9917,-1.157216 -1.8262,-1.339844 0.1655,-0.182615 0.078,-0.205769 -0.1914,-0.05078 -0.2698,0.154976 -1.3656,4.38e-4 -2.4355,-0.34375 -2.3911,-0.76922 -3.9536,-1.109138 -5.2618,-1.064453 z m -14.2675,0.5 c -0.1954,0.02305 -0.5078,0.220741 -0.7969,0.523437 -0.67,0.701501 -0.6587,0.712991 0.248,0.248047 0.5216,-0.267492 0.8353,-0.598259 0.6992,-0.734375 -0.034,-0.03402 -0.085,-0.04478 -0.1503,-0.03711 z m -3.2735,0.429687 c -0.073,0.0081 -0.1672,0.03366 -0.2832,0.07813 -0.3556,0.136502 -0.8078,0.248047 -1.0058,0.248047 -0.1981,0 -0.26,0.263106 -0.1368,0.583985 0.2676,0.697111 1.2151,0.417828 1.5508,-0.457032 0.1285,-0.334832 0.095,-0.477416 -0.125,-0.453125 z m 19.7676,1.15625 c 0.2884,0.02842 0.4824,0.154239 0.4824,0.388672 0,0.223314 -0.3509,0.40625 -0.7793,0.40625 -0.4284,0 -1.1124,0.106513 -1.5215,0.236328 -0.6805,0.216099 -0.678,0.181386 0.043,-0.40625 0.5502,-0.448285 1.2947,-0.672382 1.7754,-0.625 z m -10.4805,0.441407 c -0.184,0 -0.368,0.02767 -0.5078,0.08398 -0.2789,0.112562 -0.05,0.205078 0.5078,0.205078 0.5583,0 0.787,-0.09244 0.5078,-0.205078 -0.1394,-0.05632 -0.3238,-0.08398 -0.5078,-0.08398 z m 3.6543,0.410156 c -0.3348,4e-6 -0.9752,0.157692 -1.4219,0.349609 -0.5118,0.219889 -0.585,0.347656 -0.2011,0.347656 0.3348,0 0.9733,-0.155728 1.4199,-0.347656 0.5119,-0.219889 0.5871,-0.349609 0.2031,-0.349609 z m -14.5312,0.785156 c -0.1576,-0.0046 -0.393,0.118064 -0.5996,0.326172 -0.398,0.400984 -0.3521,0.446909 0.2265,0.226563 0.4004,-0.152474 0.6251,-0.378839 0.5,-0.503907 -0.03,-0.03126 -0.074,-0.04728 -0.1269,-0.04883 z m -6.9688,0.871094 c -0.6752,-0.0192 -1.2678,0.216377 -1.3984,0.556641 -0.172,0.448368 -0.058,0.504316 0.4746,0.230468 0.3858,-0.198637 0.9132,-0.284707 1.1719,-0.191406 0.2585,0.09326 0.5727,0.006 0.6972,-0.195312 0.1244,-0.201332 -0.3012,-0.382128 -0.9453,-0.400391 z m 5.627,1.142578 c -0.3561,-0.0068 -0.9786,0.352207 -1.3828,0.798828 -0.4042,0.44662 -1.2431,0.8125 -1.8653,0.8125 -1.2915,0 -1.8906,0.607049 -0.9531,0.966797 0.3594,0.137941 0.521,0.06968 0.3789,-0.160156 -0.1364,-0.220747 -0.053,-0.400391 0.1836,-0.400391 0.2366,0 0.4297,0.276003 0.4297,0.615235 0,0.46126 -0.2822,0.555201 -1.1172,0.373046 -0.803,-0.175169 -0.9553,-0.130911 -0.543,0.158204 0.4865,0.341063 0.4703,0.506307 -0.1054,1.082031 -0.3735,0.373239 -0.5858,0.831344 -0.4707,1.017578 0.1149,0.186236 -0.017,0.429871 -0.2989,0.542969 -0.3937,0.158657 -0.3883,0.21357 0.025,0.238281 1.2296,0.07378 4.7256,-2.589981 4.3008,-3.277344 -0.1168,-0.189139 0.026,-0.348917 0.3184,-0.353515 0.2921,-0.0049 0.9866,-0.36604 1.5449,-0.802735 1.0923,-0.854433 0.848,-1.077411 -0.4317,-0.392578 -1.0029,0.536761 -1.0731,-0.211273 -0.074,-0.792969 0.6075,-0.353918 0.6167,-0.415037 0.062,-0.425781 z m 13.0019,0.08984 c -0.085,0.0051 -0.1779,0.02209 -0.2754,0.05078 -0.3908,0.114803 -1.4407,0.332146 -2.3339,0.484375 -0.8933,0.152198 -1.8994,0.431261 -2.2344,0.619141 -0.8221,0.4612 -0.322,0.445449 2.707,-0.08203 1.414,-0.246236 2.5723,-0.622467 2.5723,-0.83789 0,-0.161636 -0.1809,-0.249561 -0.4356,-0.234375 z m 14.3418,0.320312 c 1.2032,-0.03103 0.7849,0.678576 -0.5586,0.947266 -0.6978,0.139616 -1.5667,0.238814 -1.9297,0.220703 -0.8318,-0.04159 1.5143,-1.1428 2.4883,-1.167969 z m -14.7539,1.25 c -0.1405,-0.0055 -0.3014,0.01977 -0.4472,0.07813 -0.324,0.129596 -0.2268,0.226607 0.246,0.246094 0.428,0.01761 0.6662,-0.078 0.5313,-0.212891 -0.067,-0.06711 -0.188,-0.105243 -0.3281,-0.111328 z m 17.8653,0 c 0.1409,0.0058 0.2624,0.0439 0.33,0.111328 0.135,0.134982 -0.105,0.230538 -0.5332,0.212891 -0.4729,-0.0195 -0.5681,-0.116426 -0.2441,-0.246094 0.1466,-0.05862 0.3061,-0.08394 0.4473,-0.07813 z m -15.834,0.40625 c -0.141,-0.0058 -0.3009,0.01949 -0.4473,0.07813 -0.3239,0.129612 -0.2287,0.226599 0.2441,0.246094 0.428,0.01761 0.6682,-0.078 0.5332,-0.212891 -0.067,-0.06744 -0.1891,-0.105526 -0.33,-0.111328 z m -5.041,0.558594 c -0.5157,0 -0.8536,0.13721 -0.75,0.304687 0.1035,0.167486 0.4414,0.304688 0.75,0.304688 0.3087,0 0.6464,-0.137209 0.75,-0.304688 0.1035,-0.167484 -0.2342,-0.304687 -0.75,-0.304687 z m 13.7265,0.244141 c 1.4533,0.03455 1.5545,0.08759 0.6875,0.365234 -1.4777,0.47323 -2.9331,0.47323 -2.6406,0 0.1379,-0.223298 1.0172,-0.387485 1.9531,-0.365234 z m -25.4492,0.07617 c 0.091,-0.0052 0.1492,0.04127 0.1484,0.138671 0,0.194831 -0.6076,0.765131 -1.3457,1.267579 -1.7203,1.171213 -2.3802,1.192406 -0.8379,0.02734 0.6443,-0.486614 1.3986,-1.05496 1.6778,-1.265625 0.1394,-0.105362 0.2659,-0.162746 0.3574,-0.167968 z m -5.3848,0.787109 c -0.4257,-0.0744 -1.3672,0.412207 -1.3672,0.777344 0,0.207318 0.3816,0.173259 0.8477,-0.07617 0.4658,-0.249256 0.7649,-0.533986 0.666,-0.632813 -0.034,-0.03553 -0.086,-0.05772 -0.1465,-0.06836 z m 39.2364,0.361328 c 0.331,0 0.6608,0.02388 0.9121,0.07227 0.5024,0.09679 0.093,0.175781 -0.9121,0.175781 -1.0049,0 -1.4166,-0.07895 -0.9141,-0.175781 0.2513,-0.04842 0.5829,-0.07227 0.9141,-0.07227 z m -30.502,0.5 c -0.026,-0.0082 -0.081,-0.0024 -0.166,0.01367 -0.1134,0.02139 -0.2801,0.06126 -0.502,0.117187 -0.5059,0.127507 -1.0192,0.393495 -1.1406,0.589844 -0.3435,0.555669 0.4007,0.419723 1.2734,-0.232422 0.4278,-0.319547 0.6125,-0.463569 0.5352,-0.488281 z m 25.5918,0.314453 v 0 c 0.1401,0.0061 0.2612,0.04421 0.3281,0.111328 0.135,0.134842 -0.1031,0.230537 -0.5313,0.212891 -0.473,-0.0195 -0.5701,-0.11643 -0.2461,-0.246094 0.146,-0.05837 0.3066,-0.08365 0.4473,-0.07813 z m 3.4883,0.791016 c 1.0324,0.02083 0.8967,0.129993 -0.8848,0.71289 -1.156,0.378243 -2.2371,0.823007 -2.4023,0.988282 -0.1652,0.165241 -0.8642,0.274528 -1.5528,0.24414 -0.9563,-0.04222 -1.0357,-0.09603 -0.3378,-0.230468 0.5023,-0.09676 0.914,-0.337877 0.914,-0.535157 0,-0.465128 2.6972,-1.211299 4.2637,-1.179687 z m -37.8828,0.376953 c -0.2446,0 -0.9386,0.457349 -1.541,1.015625 -0.6024,0.558278 -0.8949,1.015625 -0.6504,1.015625 0.2445,0 0.9386,-0.457347 1.541,-1.015625 0.6023,-0.558276 0.8948,-1.015625 0.6504,-1.015625 z m -5.4141,0.01367 v 0 c 0.5773,0.01134 0.567,0.08348 -0.072,0.568359 -0.5478,0.415394 -0.5991,0.608967 -0.2031,0.767578 0.291,0.116523 0.3463,0.210938 0.123,0.210938 -0.2234,0 -0.6413,-0.09525 -0.9297,-0.210938 -0.7068,-0.283578 0.1583,-1.353892 1.0801,-1.335937 z m 43.6055,1.921875 c 0.8261,-0.0042 1.7138,0.0099 2.6347,0.04492 2.2759,0.08636 1.4372,0.753957 -1.3164,1.048828 -1.4491,0.155225 -2.738,0.452419 -2.8652,0.658203 -0.2895,0.468752 0.092,0.470726 1.6934,0.01172 0.7248,-0.207837 1.5015,-0.210028 1.8242,-0.0059 0.4676,0.296164 0.4601,0.36225 -0.047,0.396485 -0.3349,0.02268 -0.06,0.206387 0.6094,0.408203 0.6699,0.201638 1.7656,0.26579 2.4355,0.142578 0.8321,-0.152958 1.9903,0.125247 3.6543,0.876953 2.963,1.338467 2.9646,1.337446 2.2227,1.806641 -0.5055,0.319672 -0.4933,0.380162 0.088,0.384765 0.3775,0.0032 0.7995,0.1888 0.9375,0.41211 0.5122,0.828899 -2.4991,0.218901 -3.5586,-0.720703 -1.0281,-0.911812 -4.6815,-2.121094 -6.4063,-2.121094 -0.8087,0 -1.6079,-0.137217 -1.7754,-0.304688 -0.1674,-0.167471 -0.4273,-0.319635 -0.5761,-0.33789 -1.2952,-0.1584 -2.502,-0.773157 -2.502,-1.273438 0,-0.457349 -0.3553,-0.567812 -1.4219,-0.443359 -1.6441,0.191962 -1.7324,0.11843 -0.5879,-0.494141 0.5595,-0.299338 2.4788,-0.478408 4.9571,-0.490234 z m -45.5879,0.0918 c 0.034,0.0155 -0.09,0.183081 -0.3477,0.511718 -0.3065,0.390792 -0.7472,0.708985 -0.9804,0.708985 -0.2332,0 -0.3489,-0.05009 -0.2559,-0.113282 0.093,-0.06319 0.5358,-0.383339 0.9824,-0.710937 0.3757,-0.275452 0.5673,-0.411931 0.6016,-0.396484 z m 33.6738,0.05273 c -0.141,-0.0057 -0.3028,0.02161 -0.4492,0.08008 -0.3239,0.1296 -0.2267,0.224676 0.2461,0.244141 0.4279,0.01776 0.6681,-0.078 0.5332,-0.212891 -0.067,-0.06746 -0.1891,-0.105545 -0.3301,-0.111328 z m -17.2051,0.002 c 0.085,-4.04e-4 0.1689,0.01097 0.2422,0.03516 0.3043,0.101367 0.1192,0.286058 -0.4297,0.429688 -0.6753,0.176617 -0.8345,0.123568 -0.5332,-0.177734 0.1769,-0.176958 0.4644,-0.285447 0.7207,-0.28711 z m -7.9804,1.294922 c -0.3043,0.02608 -0.8243,0.197074 -1.5508,0.517578 -1.1122,0.490651 -1.4862,0.833825 -1.1445,1.050781 0.8262,0.524655 1.4722,0.385205 2.3691,-0.511718 0.7408,-0.74081 0.8333,-1.100249 0.3262,-1.056641 z m 22.2988,0.306641 c 0.5212,0.02079 0.4669,0.132339 -0.2266,0.466797 -0.5024,0.242304 -0.914,0.595975 -0.914,0.785156 0,0.189203 -0.2724,0.34375 -0.6075,0.34375 -0.3347,0 -0.6093,0.147048 -0.6093,0.328125 0,0.181077 -0.9605,0.575374 -2.1328,0.875 -2.2092,0.56457 -3.3299,1.074347 -4.2754,1.943359 -0.3039,0.279156 -0.5852,0.494167 -0.625,0.478516 -0.04,-0.0155 -0.4256,-0.166842 -0.8575,-0.335938 -0.4892,-0.19166 -0.6186,-0.411004 -0.3417,-0.582031 0.2441,-0.150841 0.7347,-0.161795 1.0898,-0.02539 0.4232,0.162369 0.6465,0.0261 0.6465,-0.396484 0,-0.366009 0.4814,-0.763812 1.1152,-0.919922 0.6142,-0.151219 1.4831,-0.509828 1.9297,-0.794922 0.4466,-0.28509 1.6816,-0.734658 2.7461,-1 1.0645,-0.265323 2.0352,-0.642031 2.1562,-0.83789 0.121,-0.195855 0.5287,-0.343469 0.9063,-0.328126 z m -26.1016,1.082031 c -0.2381,0.0049 -0.4912,0.131928 -0.8711,0.380859 -0.4934,0.323263 -0.9977,0.850305 -1.1211,1.171875 -0.2573,0.670436 0.2569,0.75476 1.2793,0.208985 0.3878,-0.207005 1.0515,-0.486974 1.4766,-0.621094 0.7519,-0.237203 0.7531,-0.259627 0.02,-0.796875 -0.3197,-0.233839 -0.5431,-0.34889 -0.7812,-0.34375 z m 29.1543,0.06836 c 0.4416,-0.0029 0.7712,0.0083 0.8828,0.0332 0.2234,0.05004 1.4105,0.08539 2.6387,0.07617 2.5806,-0.01814 1.9633,0.39011 -1.7246,1.138672 -1.284,0.260636 -2.3359,0.642321 -2.3359,0.84961 v 0.002 c 0,0.207307 -0.5011,0.372239 -1.1153,0.36914 -0.87,-0.0049 -0.9824,-0.09173 -0.5078,-0.398437 0.5072,-0.327799 0.4731,-0.401742 -0.2031,-0.4375 -0.5131,-0.02721 -0.2884,-0.207617 0.6094,-0.490235 l 1.4199,-0.447265 -1.6231,-0.269532 -1.625,-0.271484 2.0313,-0.105469 c 0.5583,-0.02948 1.1112,-0.04607 1.5527,-0.04883 z m 10.1133,1.298828 c 0.532,0 1.1682,0.120863 1.7324,0.363282 0.6092,0.26177 0.3241,0.357589 -1.1406,0.378906 -1.2047,0.01776 -1.856,-0.128399 -1.7012,-0.378906 0.1501,-0.242457 0.5774,-0.363282 1.1094,-0.363282 z m -32.5195,0.769532 c 0.2181,0 0.2971,0.161038 0.1758,0.357421 -0.2979,0.481781 -1.8575,0.868889 -1.8575,0.460938 0,-0.33668 0.9893,-0.818359 1.6817,-0.818359 z m 39.3476,0.0332 v 0 c 0.5715,-0.01776 1.3818,0.219614 1.8027,0.527344 2.0556,1.503124 -3.1042,2.644277 -5.7402,1.269531 -1.4194,-0.740342 -2.861,-0.788317 -3.0918,-0.103516 -0.094,0.279156 0.094,0.702472 0.418,0.941406 0.4823,0.355427 0.3404,0.554099 -0.7696,1.091797 -1.5192,0.73578 -1.9459,0.626729 -1.1777,-0.298828 0.6016,-0.724962 0.2811,-0.792933 -0.8574,-0.183594 -0.6548,0.350438 -0.7177,0.548951 -0.3223,1.025391 0.2694,0.324813 0.4196,0.646245 0.332,0.714844 -0.088,0.06864 -0.6119,0.430156 -1.164,0.802734 -0.8023,0.54144 -0.8604,0.677734 -0.2852,0.677735 0.3957,0 1.2775,-0.289194 1.9571,-0.640626 1.2647,-0.654019 1.8558,-0.564555 1.3789,0.207032 -0.147,0.238186 -0.6111,0.433594 -1.0313,0.433594 -0.4203,0 -0.882,0.189608 -1.0254,0.421874 -0.1694,0.273789 0.1069,0.328963 0.7871,0.158204 0.577,-0.14487 1.0508,-0.165378 1.0508,-0.04492 0,0.120491 -1.4919,0.690049 -3.3144,1.263672 -3.8667,1.217057 -5.0192,1.347806 -3.6973,0.421875 0.4962,-0.34749 0.789,-0.875645 0.6641,-1.201172 -0.1463,-0.381661 0.137,-0.670281 0.8281,-0.84375 0.5786,-0.14521 1.0527,-0.425748 1.0527,-0.623047 0,-0.197291 -0.7257,-0.06921 -1.6113,0.285156 -2.4878,0.995411 -2.7932,0.466321 -0.584,-1.009766 1.0956,-0.732082 1.7177,-1.271498 1.3828,-1.199218 -0.3349,0.07226 -0.6536,-0.04966 -0.707,-0.271485 -0.053,-0.221782 0.1315,-0.407924 0.4082,-0.414062 0.2767,-0.0057 0.6849,-0.110419 0.9082,-0.232422 0.3391,-0.185159 1.9494,-0.685139 4.5605,-1.414063 0.2835,-0.07918 0.3903,-0.430284 0.2442,-0.810546 -0.1973,-0.5145 -0.078,-0.61995 0.5136,-0.453125 1.7111,0.482502 7.0645,0.747227 7.0645,0.349609 0,-0.223748 -0.2285,-0.498687 -0.5078,-0.611328 -0.2789,-0.112706 -0.04,-0.218678 0.5312,-0.236328 z m -16.0351,0.373047 c 0.3216,0 0.5859,0.182929 0.5859,0.40625 0,0.223332 -0.3761,0.40625 -0.8359,0.40625 -0.4599,0 -0.7239,-0.182933 -0.586,-0.40625 0.138,-0.223295 0.5142,-0.40625 0.836,-0.40625 z m -2.6973,0.863281 c 0.141,0.0057 0.2624,0.04195 0.3301,0.109375 0.1349,0.134967 -0.1054,0.232494 -0.5332,0.214844 -0.473,-0.01965 -0.5681,-0.116456 -0.2441,-0.246094 0.1465,-0.05862 0.3061,-0.08394 0.4472,-0.07813 z m -16.1738,0.144531 c 0.073,-0.01026 0.1381,-0.0086 0.1933,0.002 0.1104,0.02117 0.1797,0.08155 0.1797,0.177735 0,0.192415 -0.2743,0.455382 -0.6093,0.583984 -0.3349,0.128504 -0.6075,0.07714 -0.6075,-0.115234 0,-0.192416 0.2724,-0.455386 0.6075,-0.583985 0.084,-0.03213 0.1636,-0.0542 0.2363,-0.06445 z M 2018,-18.375 c 0.2661,-0.0032 0.5964,0.177062 0.7344,0.400391 0.3114,0.504075 0.1705,0.504075 -0.6094,0 -0.3659,-0.236485 -0.4158,-0.397318 -0.125,-0.400391 z m -45.7891,0.04492 c 0.141,0.0057 0.2625,0.04195 0.3301,0.109375 0.1349,0.135005 -0.105,0.232494 -0.5332,0.214844 -0.473,-0.01965 -0.5681,-0.116456 -0.2441,-0.246094 0.1466,-0.05862 0.3061,-0.08394 0.4472,-0.07813 z m -18.0097,0.761719 c -0.099,0 -0.2917,0.182929 -0.4297,0.40625 -0.138,0.223294 -0.057,0.404296 0.1797,0.404297 0.2366,0 0.4297,-0.18098 0.4297,-0.404297 0,-0.223295 -0.082,-0.40625 -0.1797,-0.40625 z m 27.1035,0.115234 c 0.181,0.0053 0.2793,0.07998 0.2793,0.228516 0,0.219779 -0.2286,0.492827 -0.5078,0.605468 -0.279,0.112706 -0.042,0.218678 0.5273,0.236329 0.5695,0.01776 1.2555,-0.187125 1.5235,-0.455079 0.3291,-0.329196 0.4863,-0.342541 0.4863,-0.04102 0,0.628547 -3.2079,2.274376 -4.668,2.394531 -0.6699,0.05514 -1.6303,0.227621 -2.1328,0.382813 -1.5255,0.471207 -1.0256,-0.362509 1.0156,-1.69336 1.6427,-1.071273 2.9336,-1.674368 3.4766,-1.658203 z m -30.0606,0.291016 c -0.1772,0 -0.5511,0.363908 -0.83,0.810547 -0.2809,0.449827 -0.3302,0.812499 -0.1114,0.8125 0.2174,0 0.5911,-0.365901 0.8301,-0.8125 0.2389,-0.446623 0.2886,-0.810547 0.1113,-0.810547 z m 46.5098,0.111328 c 0.5308,-0.01361 0.8165,0.07162 0.7149,0.236328 -0.2971,0.480457 -3.4819,0.799384 -3.7442,0.375 -0.1081,-0.174992 0.043,-0.329754 0.3359,-0.345703 0.2922,-0.01587 1.2324,-0.114851 2.0879,-0.21875 0.2261,-0.02759 0.4286,-0.0423 0.6055,-0.04687 z m -22.4629,0.292969 c 0.3349,0 0.6094,0.182929 0.6094,0.40625 0,0.223293 -0.2744,0.40625 -0.6094,0.40625 -0.3349,0 -0.6094,-0.182934 -0.6094,-0.40625 0,-0.223295 0.2744,-0.40625 0.6094,-0.40625 z m -22.3086,0.40625 c -0.099,0 -0.2916,0.182932 -0.4297,0.40625 -0.1379,0.223293 -0.057,0.406249 0.1797,0.40625 0.2366,0 0.4297,-0.182931 0.4297,-0.40625 0,-0.223295 -0.081,-0.406251 -0.1797,-0.40625 z m 6.9219,0 c 0.088,0 0.1602,0.274396 0.1602,0.609374 0,0.33498 -0.1762,0.609375 -0.3926,0.609376 -0.2166,0 -0.2887,-0.274396 -0.1602,-0.609376 0.1285,-0.334978 0.3047,-0.609375 0.3926,-0.609374 z m 57.4512,0.236328 c 0.4675,0.01323 0.7695,0.06571 0.7695,0.166015 0,0.178243 -0.2874,0.434809 -0.6406,0.570313 -1.0118,0.388244 -5.75,0.276311 -5.043,-0.119141 0.6272,-0.350816 3.5113,-0.656222 4.9141,-0.617187 z m -30.334,1.185546 c 0.4452,0.0378 0.3535,0.185884 -0.4063,0.433594 -0.4227,0.13784 -1.2948,0.448157 -1.9375,0.689453 -1.3206,0.495837 -4.3023,0.644514 -4.5605,0.226563 -0.2336,-0.377915 0.7732,-0.653888 4.0898,-1.119141 1.3868,-0.194532 2.3692,-0.268191 2.8145,-0.230469 z m 22.1719,0.609376 c 0.4466,0 0.8125,0.182929 0.8125,0.40625 0,0.223293 -0.366,0.406249 -0.8125,0.40625 -0.4467,0 -0.8125,-0.182934 -0.8125,-0.40625 0,-0.223295 0.3659,-0.406251 0.8125,-0.40625 z m -18.3907,0.189453 c 0.2642,-0.03515 0.449,0.02425 0.5762,0.177734 0.1996,0.239962 0.2453,0.354744 0.1035,0.253906 -0.1417,-0.100875 -0.7737,0.08407 -1.4043,0.410157 -1.2031,0.622162 -1.5918,0.72021 -1.5918,0.40039 0,-0.105902 0.5701,-0.487951 1.2657,-0.847656 0.4436,-0.229417 0.7866,-0.359348 1.0507,-0.394531 z m -4.1679,0.623047 c 0.3004,0 0.6574,0.289335 0.7929,0.642578 0.3326,0.866453 0.3131,0.980468 -0.1601,0.980468 -0.2234,0 -0.4063,-0.272442 -0.4063,-0.607422 0,-0.758414 -0.3821,-0.755628 -1.3965,0.01172 -0.8822,0.667385 -1.4453,0.76737 -1.4453,0.25586 0,-0.394798 1.8108,-1.283204 2.6153,-1.283203 z m -7.0567,0.404296 c 0.2102,0 0.3809,0.182929 0.3809,0.40625 0,0.223333 -0.2846,0.40625 -0.6328,0.40625 -0.3481,0 -0.5188,-0.182932 -0.3809,-0.40625 0.138,-0.223294 0.4227,-0.40625 0.6328,-0.40625 z m 48.4942,0.138672 c 0.5533,-0.06576 1.5692,0.481932 2.1855,1.22461 0.6457,0.777993 0.01,1.163637 -0.6855,0.414062 -0.2926,-0.316422 -0.6584,-0.4994 -0.8125,-0.40625 -0.1542,0.09313 -0.5063,-0.07724 -0.7832,-0.376953 -0.3081,-0.333468 -0.3521,-0.638256 -0.1114,-0.787109 0.058,-0.03553 0.1277,-0.05895 0.2071,-0.06836 z m -28.0977,0.353516 c 0.3417,-0.0613 0.122,0.106848 -0.7285,0.693359 -0.67,0.462123 -1.3941,0.842212 -1.6094,0.84375 -0.6882,0.0049 0.7591,-1.118348 1.8125,-1.40625 0.2362,-0.06455 0.4116,-0.110408 0.5254,-0.130859 z m 32.541,1.132812 c 0.3481,0 0.6328,0.182929 0.6328,0.40625 0,0.223295 -0.1725,0.40625 -0.3828,0.40625 -0.2101,0 -0.4948,-0.182929 -0.6328,-0.40625 -0.1379,-0.223294 0.035,-0.40625 0.3828,-0.40625 z m -0.3828,1.8261722 0.9141,0.7734376 c 0.5024,0.4254159 0.914,0.8370244 0.914,0.9140624 0,0.324926 -0.3277,0.085052 -1.0547,-0.7734374 z m -26.0312,0.4667969 c 0.109,-0.00526 0.202,-4.636e-4 0.2734,0.013672 0.1429,0.028346 0.2015,0.091954 0.1426,0.1875 -0.2079,0.3364157 -1.791,0.5075024 -1.791,0.1933594 0,-0.085644 0.4523,-0.2422453 1.0039,-0.3476563 0.1379,-0.026362 0.262,-0.041617 0.3711,-0.046875 z m -59.4121,4.203125 c 0.2366,0 0.3176,0.1829291 0.1796,0.40625 -0.1379,0.2232945 -0.3309,0.40625 -0.4296,0.40625 -0.099,0 -0.1797,-0.182929 -0.1797,-0.40625 0,-0.2232945 0.193,-0.40625 0.4297,-0.40625 z m 24.5839,1.2421875 c -0.1661,0.022938 -0.2461,0.1233297 -0.2461,0.3027344 0,0.1802079 0.5031,0.5151088 1.1172,0.7441406 1.5263,0.5692196 2.0411,0.1952459 0.6934,-0.5039062 -0.6182,-0.3206929 -1.071,-0.4997517 -1.3691,-0.5390625 -0.075,-0.00983 -0.14,-0.011548 -0.1954,-0.00391 z m 52.5371,6.4726563 c 0.2234,0 0.4063,0.1829328 0.4063,0.40625 0,0.2232945 -0.1828,0.40625 -0.4063,0.40625 -0.2233,0 -0.4062,-0.1829291 -0.4062,-0.40625 0,-0.2232945 0.1828,-0.40625 0.4062,-0.40625 z m -4.0312,2.4355469 c -0.5811,0 -0.8418,0.2607436 -0.8418,0.8417968 0,1.0404964 1.343,0.9236268 1.5469,-0.1347656 0.094,-0.4872265 -0.124,-0.7070313 -0.7051,-0.7070312 z m 3.8281,0.40625 c 0.3349,0 0.6094,0.182929 0.6094,0.40625 0,0.2232943 -0.2744,0.40625 -0.6094,0.40625 -0.3348,0 -0.6094,-0.182933 -0.6094,-0.40625 0,-0.2232945 0.2744,-0.40625 0.6094,-0.40625 z m -9.9707,0.40625 c -0.4598,0 -0.7239,0.1829328 -0.5859,0.40625 0.1379,0.2232943 0.5141,0.4062499 0.8359,0.40625 0.3217,0 0.584,-0.1829292 0.584,-0.40625 0,-0.2232945 -0.3742,-0.4062502 -0.834,-0.40625 z m 9.4395,1.6308593 c 0.3775,-0.00322 0.7995,0.175109 0.9375,0.3984375 0.3175,0.5138608 -0.2206,0.5138608 -1.0157,0 -0.5249,-0.3391748 -0.5131,-0.3930668 0.078,-0.3984375 z m -1.2637,0.1933594 c 0.2185,-0.023811 0.373,0.056533 0.373,0.21875 0,0.2163024 -0.2743,0.3925781 -0.6093,0.3925781 -0.3349,0 -0.6075,-0.070443 -0.6074,-0.1582031 0,-0.087761 0.2724,-0.2659895 0.6074,-0.3945313 0.084,-0.032126 0.1637,-0.050619 0.2363,-0.058594 z m -0.057,2.6425785 c 0.2366,0 0.4296,0.182929 0.4296,0.40625 0,0.223332 -0.079,0.404297 -0.1777,0.404296 -0.099,0 -0.2936,-0.180975 -0.4316,-0.404296 -0.138,-0.223295 -0.057,-0.40625 0.1797,-0.40625 z m -63.4297,4.919922 c 0.1719,-0.01096 0.3102,0.01138 0.3711,0.07226 0.1217,0.121777 0.1594,0.519162 0.084,0.882813 -0.1223,0.58964 -0.2248,0.596018 -0.9492,0.06055 -0.7638,-0.564751 -0.7686,-0.617395 -0.084,-0.882812 0.2004,-0.07756 0.4061,-0.121777 0.5782,-0.132812 z m 54.4863,1.21875 v 0.002 c -0.141,-0.0057 -0.3008,0.01966 -0.4473,0.07813 -0.3239,0.1296 -0.2286,0.226629 0.2442,0.246093 0.4279,0.01776 0.6681,-0.07995 0.5332,-0.214843 -0.067,-0.06746 -0.1891,-0.105509 -0.3301,-0.111328 z m 6.3926,0.113281 c -0.1743,-0.02079 -0.3615,0.06805 -0.4668,0.238281 -0.1402,0.226961 0.031,0.412109 0.3789,0.412109 0.7132,0 0.8169,-0.243725 0.2539,-0.591797 -0.052,-0.03213 -0.1078,-0.05164 -0.166,-0.05859 z m -53.8965,1.105469 c -0.141,-0.0057 -0.3008,0.01966 -0.4473,0.07812 -0.3239,0.1296 -0.2287,0.22663 0.2442,0.246094 0.4279,0.01776 0.6681,-0.078 0.5332,-0.21289 -0.067,-0.06746 -0.1891,-0.105547 -0.3301,-0.111328 z m -7.0098,0.449218 v 0 c 0.091,-0.02835 0.1387,0.391657 0.1387,1.261719 0,0.818816 -0.1788,1.488281 -0.3965,1.488281 -0.2275,0 -0.289,-0.562079 -0.1446,-1.320312 0.1761,-0.925176 0.3094,-1.401175 0.4004,-1.429688 z m 11.3653,1.552735 c -0.1583,0.02694 -0.3152,0.142816 -0.4453,0.353515 -0.1274,0.206287 0.089,0.459708 0.4824,0.5625 0.3931,0.102577 0.7559,0.208448 0.8047,0.234375 0.049,0.02608 -0.015,-0.227516 -0.1446,-0.5625 -0.1315,-0.342474 -0.3304,-0.542385 -0.539,-0.585937 -0.052,-0.01034 -0.1042,-0.01077 -0.1563,-0.002 z m 47.707,14.203125 c 0.6916,-0.03099 1.4911,0.07942 1.9238,0.353515 0.3784,0.23966 -0.051,0.402933 -1.3203,0.503907 -1.3181,0.104805 -1.8789,-0.0034 -1.8789,-0.361329 0,-0.293518 0.5838,-0.465113 1.2754,-0.496093 z m -26.6523,0.798828 c -0.3349,0 -0.6094,0.04626 -0.6094,0.103515 0,0.0573 -0.1691,0.695636 -0.377,1.419922 -0.4366,1.52237 0.044,1.730236 0.9649,0.416016 0.7991,-1.140941 0.8068,-1.939453 0.022,-1.939453 z m 60.0019,0.152344 c -0.043,0.04271 -0.072,0.185379 -0.082,0.421874 -0.019,0.4281 0.078,0.668091 0.2129,0.533204 0.1349,-0.13493 0.1509,-0.484242 0.035,-0.777344 -0.065,-0.161953 -0.1213,-0.220405 -0.164,-0.177734 z M 2047.3066,35.75 c 0.1414,0.02003 0.2741,0.06661 0.3946,0.142578 1.3741,0.866786 2.8732,6.308642 2.332,8.464844 -0.2423,0.965673 -0.3008,0.983646 -1.2148,0.384766 -0.9473,-0.620659 -0.9597,-0.610736 -0.8496,0.707031 0.061,0.734906 -0.073,1.564609 -0.2989,1.84375 -0.4773,0.590456 -2.5891,0.685131 -2.9316,0.130859 -0.1285,-0.207874 -0.049,-0.494507 0.1777,-0.634766 0.7478,-0.462102 0.4708,-2.583655 -0.3984,-3.048828 -0.6148,-0.329121 -0.8219,-0.307182 -0.8496,0.08789 -0.019,0.28698 -0.216,-0.1039 -0.4356,-0.869141 -0.2676,-0.931423 -0.2613,-1.67084 0.02,-2.234375 0.2297,-0.46298 0.6834,-1.511968 1.0097,-2.332031 0.6409,-1.610467 2.056,-2.781997 3.0449,-2.642578 z m -32.2265,0.681641 c 0.3348,0 0.6094,0.182929 0.6094,0.40625 0,0.223294 -0.2744,0.40625 -0.6094,0.40625 -0.3349,0 -0.6094,-0.182933 -0.6094,-0.40625 0,-0.223295 0.2744,-0.40625 0.6094,-0.40625 z m -46.3887,0.40625 c 0.6748,0 0.7272,0.102578 0.3066,0.609375 -0.5434,0.654862 -3.0584,0.839895 -3.4218,0.251953 -0.2211,-0.357959 1.5995,-0.861328 3.1152,-0.861328 z m 63.1406,1.667968 c 0.1161,0.03569 0.093,0.198247 -0.029,0.517579 -0.164,0.427739 0.07,1.159999 0.5996,1.876953 0.7839,1.060221 0.8455,1.518141 0.625,4.642578 -0.1904,2.699958 -0.4756,3.86121 -1.2929,5.255859 -0.577,0.984639 -1.0043,1.946155 -0.9492,2.136719 0.055,0.190564 -0.1159,0.733936 -0.379,1.207031 -0.2629,0.473095 -0.3469,0.991114 -0.1874,1.150391 0.159,0.159307 -0.065,0.548529 -0.4981,0.865234 -0.4332,0.316687 -0.5917,0.574219 -0.3516,0.574219 0.5652,0 0.88,1.659523 0.5059,2.667969 -0.2615,0.704768 -0.3366,0.667629 -0.7422,-0.361329 -0.4074,-1.033197 -0.5131,-1.082557 -1.0801,-0.515624 -0.3454,0.345523 -0.5726,0.947095 -0.5058,1.33789 0.07,0.411598 -0.1355,0.716515 -0.4883,0.722656 -0.3757,0.0068 -0.6094,0.398497 -0.6094,1.023438 0,0.731149 -0.2052,0.995211 -0.7383,0.951172 -0.4793,-0.03961 -0.6611,0.138806 -0.5195,0.507812 0.1198,0.312718 0.014,0.56836 -0.2324,0.56836 -0.2464,0 -0.8694,0.457332 -1.3867,1.015625 -0.5174,0.558277 -1.3619,1.00363 -1.875,0.988281 -1.0719,-0.03175 -2.7598,-0.767383 -2.7598,-1.203125 0,-0.162104 -0.5425,-0.520494 -1.2051,-0.794922 -0.6625,-0.274394 -1.314,-0.84563 -1.4492,-1.271484 -0.1353,-0.425798 -0.3941,-0.682799 -0.5762,-0.570313 -0.1818,0.112479 -0.306,-0.04926 -0.2754,-0.359375 0.1051,-1.063612 -7.4289,-9.143494 -8.5449,-9.164062 -0.3382,-0.0064 -0.3765,-0.364078 -0.1308,-1.220703 0.3378,-1.177966 -0.1287,-2.147918 -0.5411,-1.125 -0.113,0.280515 -0.2343,0.05243 -0.2695,-0.50586 -0.034,-0.558323 -0.1569,-0.785 -0.2695,-0.505859 -0.1126,0.279156 -0.4629,0.505859 -0.7793,0.505859 -0.7772,0 -0.7244,0.395878 0.1894,1.396484 1.1134,1.219401 1.4846,2.664063 0.6836,2.664063 -0.35,0 -0.6367,0.163836 -0.6367,0.363281 0,0.563709 -1.3073,0.929041 -1.748,0.488282 -0.5471,-0.547095 -0.6522,-6.109136 -0.1387,-7.347657 0.4475,-1.079312 2.5165,-3.248047 3.0977,-3.248047 0.1907,0 0.406,-0.137216 0.4804,-0.304687 0.074,-0.167471 0.958,-0.743069 1.9629,-1.279297 1.0049,-0.536224 2.1984,-1.42064 2.6524,-1.966797 l 0.8261,-0.994141 1.7324,0.904297 c 1.5776,0.822286 1.9382,0.862131 4.0137,0.445313 1.254,-0.25183 2.6454,-0.458984 3.0938,-0.458984 0.7863,0 0.7832,0.03465 -0.1075,0.982421 -0.5075,0.540322 -1.4974,1.195183 -2.2011,1.455079 -0.7037,0.259879 -1.5967,0.641026 -1.9844,0.845703 -0.3877,0.204699 -2.3982,0.379466 -4.4668,0.388671 -3.5449,0.0155 -3.6986,0.04965 -2.6602,0.613282 0.6727,0.365064 1.0164,0.822709 0.8809,1.175781 -0.3485,0.907654 2.5196,2.110378 5.7774,2.421875 3.3246,0.317934 6.4927,-0.567045 6.0605,-1.693359 -0.1281,-0.333959 -0.045,-0.831729 0.1816,-1.105469 0.2272,-0.273751 0.7533,-1.575609 1.17,-2.892578 0.4666,-1.474757 1.0113,-2.444513 1.4199,-2.525391 0.9882,-0.195553 0.8269,1.123825 -0.3496,2.855469 -0.5999,0.882346 -0.8488,1.594257 -0.6094,1.742187 0.2226,0.137613 0.4062,0.605627 0.4062,1.039063 0,1.382283 0.764,0.84606 1.2227,-0.857422 0.2438,-0.904755 0.6889,-1.739762 0.9902,-1.855469 0.3013,-0.115615 0.6644,-0.829891 0.8067,-1.58789 0.2082,-1.10945 0.5128,-1.452564 1.5625,-1.75586 0.7171,-0.207231 1.6563,-0.518715 2.0859,-0.693359 0.158,-0.06421 0.2821,-0.108535 0.377,-0.128906 0.071,-0.01529 0.1253,-0.01581 0.164,-0.0039 z m -55.9101,2.041016 c 0.504,0.01965 0.7193,0.135964 0.5957,0.335937 -0.3028,0.489975 -2.6485,0.578419 -2.6485,0.09961 0,-0.177676 0.6553,-0.368002 1.4551,-0.421875 0.2302,-0.0155 0.4297,-0.0201 0.5977,-0.01367 z m 22.5078,0.632813 c 1.1894,-0.002 1.2594,0.19681 1.3594,0.9375 0.075,0.558276 0.4627,1.379533 0.8613,1.826171 0.7368,0.825646 1.352,3.044922 0.8437,3.044922 -0.1534,0 -0.3016,0.594534 -0.3281,1.320313 -0.026,0.72576 -0.1686,2.098729 -0.3164,3.050781 -0.1931,1.241987 -0.094,1.999281 0.3535,2.681641 0.6709,1.023821 0.6423,3.028381 -0.07,4.822265 -0.3997,1.005759 -0.3061,1.250398 0.9668,2.523438 1.371,1.370952 1.7809,2.248047 1.0508,2.248047 -0.1973,0 -0.4526,0.357533 -0.5664,0.792968 -0.2823,1.078908 -2.6464,2.453545 -4.2246,2.455078 -1.9316,0.0025 -3.4076,0.668768 -3.1231,1.410157 0.3723,0.969709 -0.8451,0.753646 -2.2051,-0.390625 -0.8723,-0.734155 -1.2794,-1.514053 -1.4785,-2.841797 -0.3424,-2.28257 -0.8487,-2.349694 -1.1992,-0.158203 -0.2585,1.616628 -0.3099,1.663815 -1.5293,1.419922 -2.936,-0.587203 -3.9791,-3.588852 -2.3535,-6.775391 0.6937,-1.359708 1.0056,-1.601924 1.9297,-1.505859 1.0485,0.109001 1.7932,0.881067 2.3594,2.447265 0.5655,1.564218 1.0844,0.663291 0.8613,-1.498047 -0.1482,-1.435256 -0.073,-2.262849 0.2168,-2.359375 0.2472,-0.08247 0.3057,-0.375422 0.1309,-0.658203 -0.2438,-0.394307 -0.4852,-0.356075 -1.0665,0.169922 -0.7203,0.651935 -0.7643,0.592745 -1.0293,-1.404297 -0.1519,-1.146251 -0.435,-2.180932 -0.6289,-2.300781 -0.1938,-0.119811 -0.3515,-0.572408 -0.3515,-1.005859 0,-0.433444 -0.1601,-0.789063 -0.3555,-0.789063 -0.4954,0 -0.8866,2.209276 -0.6289,3.552734 0.158,0.824006 -0.064,1.435047 -0.8477,2.333985 -1.1278,1.293109 -3.8535,5.76057 -3.8535,6.316406 0,0.18172 -0.2043,0.845969 -0.455,1.474609 -0.2506,0.628653 -0.5003,1.603508 -0.5547,2.167969 -0.054,0.56445 -0.4884,1.790609 -0.9649,2.72461 -0.4765,0.934019 -0.8672,1.940135 -0.8672,2.234375 0,0.773257 -1.6015,2.027531 -2.2636,1.773437 -0.3895,-0.149442 -0.5337,0.06272 -0.4688,0.683594 0.056,0.538095 -0.1102,0.855689 -0.414,0.794922 -0.2794,-0.05582 -0.5079,0.08139 -0.5079,0.304687 0,0.223333 -0.1368,0.40346 -0.3047,0.400391 -0.4669,-0.0083 -2.9348,-2.974328 -2.9394,-3.533203 0,-0.271446 -0.5508,-1.05294 -1.2207,-1.738282 -0.6699,-0.68534 -1.2188,-1.514516 -1.2188,-1.841796 0,-0.32727 -0.2391,-0.595704 -0.5312,-0.595704 -0.5696,0 -1.9043,-2.665693 -1.9043,-3.802734 0,-0.378591 -0.3201,-0.804857 -0.7109,-0.947266 -0.3908,-0.142373 -1.0769,-0.721401 -1.5235,-1.285156 -0.4466,-0.563758 -1.4011,-1.631129 -2.123,-2.373047 -0.7219,-0.741921 -1.6141,-1.928144 -1.9805,-2.636718 -0.714,-1.38073 -1.1365,-5.011088 -0.6699,-5.757813 0.4937,-0.790303 0.536,-1.962264 0.09,-2.5 -0.5856,-0.705653 -0.058,-0.978795 2.4629,-1.277344 1.8707,-0.221556 2.0844,-0.163331 2.291,0.626954 0.2918,1.115492 0.83,1.104088 1.7539,-0.03711 l 0.7344,-0.908203 1.0899,2.300781 c 0.8239,1.740053 1.3917,2.405399 2.3242,2.730469 l 1.2324,0.431641 -0.9453,0.765625 -0.9453,0.765625 1.2011,0.24414 c 1.7878,0.365443 4.6191,0.04008 6.6797,-0.767578 2.1773,-0.853357 4.2342,-2.613539 3.6895,-3.158203 -0.2075,-0.207345 -0.2792,-0.632762 -0.1602,-0.943359 0.1191,-0.310602 0.01,-0.815118 -0.248,-1.123047 -0.3919,-0.472173 -0.7816,-0.440701 -2.4863,0.207031 -2.4392,0.926835 -5.052,0.984538 -7.0391,0.154297 -1.5887,-0.66381 -1.9508,-1.416016 -0.6836,-1.416016 0.5415,0 0.8236,-0.328043 0.9121,-1.054687 l 0.1289,-1.052735 0.9746,0.851563 c 0.5366,0.467875 1.1954,0.849609 1.4629,0.849609 1.2142,0 2.9755,-0.938722 3.461,-1.845703 0.6024,-1.125702 1.4485,-1.248581 2.6035,-0.375 0.4784,0.361852 1.6961,0.597656 3.0976,0.597656 1.6025,0 2.4708,0.194424 2.8379,0.636719 0.291,0.350551 0.873,0.547379 1.293,0.4375 0.4444,-0.11622 0.8576,0.04893 0.9902,0.394531 0.2884,0.751525 1.3444,-1.143744 1.3535,-2.429687 0.015,-1.890758 1.2891,-2.584129 5.084,-2.763672 0.6878,-0.0325 1.209,-0.05405 1.6055,-0.05469 z m -21.2891,0.53125 c 0.2102,0 0.3828,0.274396 0.3828,0.609374 0,0.627886 -0.4783,0.806865 -0.9355,0.34961 -0.3243,-0.324397 0.041,-0.958985 0.5527,-0.958984 z m -16.8594,1.738281 c 0.076,0.01701 0.1728,0.05611 0.2911,0.123047 1.5398,0.870379 3.1315,2.301061 2.9277,2.630859 -0.3997,0.64676 -1.0169,0.42453 -2.25,-0.808594 -1.0433,-1.043301 -1.504,-2.064696 -0.9688,-1.945312 z m 30.5254,4.820312 c -0.042,0.01096 -0.1136,0.257346 -0.2539,0.75 -0.2574,0.906565 0.059,3.827232 0.5606,5.175781 0.2642,0.710412 0.5239,0.634587 1.0234,-0.298828 0.3338,-0.623864 0.2464,-1.171336 -0.3906,-2.419922 -0.4528,-0.887519 -0.843,-2.031617 -0.8652,-2.542968 -0.019,-0.451265 -0.03,-0.675035 -0.074,-0.664063 z m 56.4082,0.814453 c 0.3171,-0.0079 0.5235,0.774062 0.6973,2.4375 0.1433,1.376667 0.2145,2.550797 0.1582,2.607422 -0.057,0.05658 -0.5593,-0.150216 -1.1172,-0.458984 -0.5579,-0.308788 -1.3147,-0.568503 -1.6816,-0.576172 -0.7059,-0.01512 -1.1775,-0.826894 -1.3789,-2.375 -0.1187,-0.911981 -0.092,-0.919091 0.8965,-0.271484 0.5595,0.366614 1.0669,0.606862 1.1289,0.533203 0.062,-0.07366 0.3264,-0.546378 0.5879,-1.048828 0.2883,-0.553917 0.5188,-0.842845 0.7089,-0.847657 z m -79.0527,0.746094 c -0.2366,0 -0.3176,0.182929 -0.1797,0.40625 0.138,0.223295 0.3314,0.40625 0.4297,0.40625 0.099,0 0.1797,-0.182933 0.1797,-0.40625 0,-0.223294 -0.193,-0.40625 -0.4297,-0.40625 z m 34.2813,1.783203 c 0.1477,0.0049 0.2539,0.166634 0.2539,0.427735 0,0.713189 -0.2437,0.817067 -0.5918,0.253906 -0.1285,-0.207874 -0.049,-0.492554 0.1777,-0.632813 0.057,-0.03515 0.111,-0.05049 0.1602,-0.04883 z m 41.4746,1.253907 c 0.5419,0.07914 1.3188,1.137775 1.2656,2.060546 -0.03,0.545598 -0.2896,0.993986 -0.5742,0.994141 -0.6382,3.51e-4 -1.4265,-1.954516 -1.1153,-2.765625 0.089,-0.232554 0.2434,-0.315481 0.4239,-0.289062 z m -38.9336,2.654296 c 0.6253,0.0053 0.6529,0.07314 0.1601,0.384766 -0.8679,0.548916 -0.2266,0.967021 1.3887,0.90625 1.0755,-0.04044 1.6039,0.201343 2.2598,1.035156 0.4708,0.598526 0.7714,1.406462 0.6699,1.794922 -0.1017,0.38846 -0.011,0.764011 0.1973,0.833984 0.7043,0.234785 -0.789,2.945211 -2.0196,3.666016 -0.6672,0.390792 -1.2744,0.697334 -1.3515,0.679688 -0.81,-0.18497 -1.3119,-0.704838 -2.0586,-2.136719 -0.9443,-1.81067 -0.9663,-2.675851 -0.1153,-4.419922 0.2975,-0.60912 0.4426,-1.478084 0.3243,-1.929687 -0.1592,-0.608735 -0.017,-0.819057 0.5449,-0.814454 z m 26.623,0.0918 c 0.3842,0.14177 0.4315,1.282372 0.066,2.642578 -0.2687,1.00266 -0.7778,1.200896 -1.0449,0.40625 -0.2804,-0.834364 0.2494,-2.863475 0.7949,-3.044921 0.068,-0.02268 0.1284,-0.02413 0.1836,-0.0039 z m -19.4609,5.339844 c 0.05,-0.01678 0.1071,-0.01672 0.168,0 0.1621,0.0446 0.3604,0.212264 0.5878,0.517578 0.3051,0.40961 1.8902,1.825404 3.5235,3.146485 3.1391,2.539081 5.7597,5.336851 5.7597,6.148437 0,0.267439 0.2986,0.733787 0.6641,1.037109 1.2333,1.023496 2.2431,4.050675 2.0469,6.140625 -0.1002,1.068291 -0.043,2.028731 0.1289,2.134766 0.577,0.356636 0.7207,2.298396 0.2598,3.519531 -0.313,0.828699 -0.8139,1.283878 -1.5821,1.4375 -0.7855,0.157115 -1.1975,0.542248 -1.375,1.28711 -0.1394,0.585611 -0.4344,1.293124 -0.6543,1.572265 -0.2849,0.361739 -0.2096,0.507813 0.2598,0.507813 0.9158,0 0.8223,0.363388 -0.3223,1.263672 -0.5388,0.423802 -1.3958,1.637395 -1.9062,2.697265 -0.5104,1.059863 -1.1664,2.167789 -1.4571,2.462891 -0.2906,0.295068 -0.5293,0.676134 -0.5292,0.845703 0,0.169587 -1.05,0.320189 -2.334,0.333984 -3.1931,0.03477 -3.703,0.103395 -3.9746,0.542969 -0.1293,0.209084 -0.6581,0.380859 -1.1758,0.38086 -0.5178,0 -1.1494,0.251461 -1.4043,0.558593 -0.7931,0.955559 -3.6884,1.459914 -9.3809,1.634766 -3.0147,0.0926 -5.9835,0.296961 -6.5976,0.455078 -0.7088,0.182438 -1.1172,0.127303 -1.1172,-0.152344 0,-0.242305 -0.2561,-0.342505 -0.5684,-0.222656 -0.3126,0.119849 -0.6828,0.02967 -0.8242,-0.199219 -0.1414,-0.22885 -0.5257,-0.311367 -0.8535,-0.185547 -0.3277,0.125783 -0.5957,0.02659 -0.5957,-0.220703 0,-0.247219 -0.2125,-0.451172 -0.4707,-0.451172 -0.7229,0 -3.0247,-1.882499 -4.0332,-3.298828 -0.7551,-1.060331 -0.823,-1.402644 -0.4121,-2.060547 0.4227,-0.677234 0.3882,-0.773411 -0.2403,-0.68164 -2.3225,0.339401 -3.4173,-1.392632 -2.0117,-3.181641 1.6147,-2.055171 5.4514,-5.449932 7.2305,-6.396484 1.7978,-0.956534 10.3398,-2.827635 14.7558,-3.232422 11.3287,-1.038448 12.0736,-1.044851 13.1094,-0.107422 0.4335,0.392296 1.7283,0.824663 2.8789,0.960938 1.6792,0.198877 2.2507,0.105916 2.8965,-0.478516 0.7966,-0.720926 0.7917,-0.740872 -0.5137,-1.986328 -1.2168,-1.160999 -1.5366,-1.257813 -4.1601,-1.257813 -1.976,0 -2.8573,-0.154944 -2.8926,-0.507812 -0.026,-0.279156 -0.074,-0.645003 -0.1016,-0.8125 -0.081,-0.478745 -2.8176,-0.552776 -3.1074,-0.08398 -0.1429,0.231232 -0.5888,0.318777 -0.9902,0.191407 -0.451,-0.143131 -0.8231,0.01153 -0.9746,0.40625 -0.1943,0.506332 -0.415,0.546951 -1.0684,0.197265 -0.6507,-0.348283 -0.8746,-0.309231 -1.0644,0.185547 -0.1323,0.34458 -0.4569,0.626953 -0.7207,0.626953 -0.2639,0 -1.1963,0.363947 -2.0723,0.810547 -0.8761,0.446623 -1.975,0.8125 -2.4414,0.8125 -0.4664,0 -1.0203,0.165323 -1.2324,0.367188 -0.3156,0.300321 -6.7601,0.812514 -10.6641,0.847656 -1.0873,0.0098 -2.975,0.905357 -4.8164,2.283203 -0.7094,0.530827 -1.7138,1.03019 -2.2324,1.109375 -0.7147,0.109077 -0.9998,0.476982 -1.1739,1.523437 -0.2789,1.676826 -0.8429,2.767003 -1.955,3.773438 -0.8274,0.748732 -0.8477,0.743276 -1.3047,-0.410156 -0.2551,-0.643582 -0.6126,-2.448525 -0.7949,-4.011719 -0.1822,-1.563175 -0.4491,-3.22909 -0.5938,-3.701172 -0.3315,-1.081504 2.1978,-6.241073 3.5996,-7.34375 0.8464,-0.66579 2.028,-2.94683 2.8516,-5.501953 0.419,-1.299919 1.0664,-0.73283 1.0664,0.933594 0,1.255676 0.2532,1.879893 1.0742,2.640625 0.5909,0.547612 1.3664,1.008817 1.7246,1.02539 1.7959,0.08319 2.6299,0.535091 4.4297,2.402344 1.7472,1.812711 2.1465,2.033203 3.6816,2.033203 3.0461,0 5.1272,-0.771209 6.9571,-2.576172 0.9411,-0.928414 1.8568,-2.067426 2.0351,-2.53125 0.237,-0.616316 1.0719,-1.041457 3.1016,-1.580078 1.5276,-0.405354 2.9865,-0.900118 3.2422,-1.099609 0.754,-0.588019 1.0103,-2.950822 0.5449,-5.027344 -0.3181,-1.420261 -0.2347,-2.337656 0.1172,-2.455078 z m -57.4942,1.496094 c 0.1864,0.03364 0.4725,0.249794 0.8731,0.65039 0.4253,0.425295 0.6816,1.333786 0.6816,2.416016 0,2.996462 -0.9557,3.075512 -2.5644,0.212891 -0.4547,-0.809027 -0.4391,-1.058594 0.1015,-1.65625 0.3504,-0.386986 0.6368,-0.918122 0.6368,-1.179688 0,-0.328554 0.085,-0.476842 0.2714,-0.443359 z m 2.6622,3.24414 c 0.06,0.0064 0.1656,0.169541 0.3535,0.492188 0.2313,0.397806 0.3587,1.038098 0.2812,1.421875 -0.1285,0.637187 -0.1665,0.632354 -0.4336,-0.04687 -0.161,-0.409055 -0.2873,-1.047389 -0.2812,-1.419922 0.01,-0.302098 0.019,-0.453642 0.08,-0.447266 z m 72.7832,5.730469 c 0.1077,-0.01361 0.2207,-0.01309 0.3378,0.0039 0.6727,0.09676 0.8595,0.36794 0.7754,1.121094 -0.061,0.545666 -0.3601,1.274232 -0.664,1.621094 -0.3826,0.43635 -0.5082,1.449054 -0.4082,3.285156 0.1508,2.774427 -0.3421,5.569587 -0.7852,4.451172 -0.7158,-1.806807 -1.402,-6.583546 -1.0976,-7.644531 0.5415,-1.88826 1.0863,-2.743531 1.8418,-2.837891 z m -16.4161,9.695313 c -0.4494,0.03704 -1.0078,0.305941 -1.4433,0.787109 -0.4068,0.449552 -1.2511,0.8125 -1.8906,0.8125 -0.6354,0 -1.1543,0.170647 -1.1543,0.378906 0,0.208252 -0.3198,0.479366 -0.711,0.603516 -0.3913,0.124195 -0.9447,0.598333 -1.2285,1.052734 -0.4537,0.726418 -0.4034,0.867515 0.4082,1.167969 0.6915,0.256025 1.2767,0.100364 2.3359,-0.619141 0.7777,-0.528196 1.654,-0.960937 1.9473,-0.960937 0.7374,0 2.5254,-1.854187 2.5254,-2.619141 0,-0.445198 -0.3397,-0.640657 -0.7891,-0.603515 z m 52.3204,3.273437 c 0.1409,0.0057 0.2624,0.0439 0.33,0.111328 0.135,0.134854 -0.105,0.230541 -0.5332,0.212891 -0.4729,-0.01965 -0.5681,-0.116418 -0.2441,-0.246094 0.1466,-0.05862 0.3061,-0.08393 0.4473,-0.07813 z m -46.8282,0.941406 c -0.1243,-0.01928 -0.3276,0.05803 -0.6426,0.226563 -0.4465,0.239017 -0.8105,0.821551 -0.8105,1.294922 0,0.835007 0.021,0.839889 0.8105,0.126953 0.4466,-0.40419 0.8126,-0.986705 0.8126,-1.294922 0,-0.217323 -0.046,-0.33424 -0.17,-0.353516 z m -25.4433,0.277344 c -0.141,-0.0057 -0.3009,0.01966 -0.4473,0.07813 -0.3239,0.1296 -0.2287,0.226629 0.2441,0.246094 0.428,0.01776 0.6682,-0.078 0.5332,-0.212891 -0.067,-0.06743 -0.1891,-0.105545 -0.33,-0.111328 z m 3.248,0 c -0.141,-0.0057 -0.3008,0.01966 -0.4473,0.07813 -0.3238,0.1296 -0.2286,0.226629 0.2442,0.246094 0.4279,0.01776 0.6681,-0.078 0.5332,-0.212891 -0.067,-0.06743 -0.1891,-0.105545 -0.3301,-0.111328 z m 44.9453,1.306641 c 0.3614,0.05412 -0.4503,2.103685 -3.4804,9.207031 -2.0012,4.691047 -4.5719,11.495047 -5.711,15.121087 -2.67,8.50005 -6.4512,20.16848 -6.875,21.21094 -0.1814,0.44662 -0.5673,1.59637 -0.8554,2.55664 -0.288,0.96028 -0.6574,1.82902 -0.8204,1.92969 -0.1629,0.10069 -0.3062,-2.31488 -0.3183,-5.36719 -0.015,-3.80394 -0.1735,-5.64277 -0.502,-5.8457 -0.2891,-0.17866 -0.4992,-1.47945 -0.5312,-3.28125 -0.048,-2.67866 -0.1312,-2.9726 -0.8125,-2.85352 -0.9467,0.16536 -1.4416,-0.57704 -1.4492,-2.17773 0,-0.96922 0.3858,-1.56137 1.8242,-2.76367 1.0068,-0.84165 2.1895,-2.23242 2.6269,-3.08985 0.4374,-0.85741 2.7255,-3.35385 5.086,-5.54883 2.4807,-2.30685 4.394,-4.42321 4.5351,-5.01562 0.3663,-1.535305 6.1887,-13.281265 6.8594,-13.837888 0.1954,-0.16233 0.3405,-0.25665 0.4238,-0.24414 z m 30.836,0.673828 c 0.3216,0 0.5859,0.180976 0.5859,0.404297 0,0.223294 -0.3762,0.40625 -0.8359,0.40625 -0.4599,0 -0.724,-0.182929 -0.586,-0.40625 0.138,-0.223333 0.5142,-0.404297 0.836,-0.404297 z m -2.6289,0.404297 c 0.4725,0 0.7733,0.213096 0.6836,0.482422 -0.1977,0.593389 -0.8739,0.850774 -1.25,0.474609 -0.5296,-0.529489 -0.2773,-0.957031 0.5664,-0.957031 z m -66.6563,0.05078 c -0.141,-0.0057 -0.3008,0.01966 -0.4473,0.07813 -0.3239,0.1296 -0.2286,0.226629 0.2442,0.246094 0.4279,0.01776 0.6681,-0.078 0.5332,-0.212891 -0.067,-0.06743 -0.1891,-0.105545 -0.3301,-0.111328 z m 71.9453,0.109375 c 0.2018,0.0098 0.4864,0.09992 0.8672,0.273438 0.6011,0.273901 1.0167,0.621251 0.9238,0.771484 -0.093,0.150236 0.3894,0.190043 1.0723,0.08984 1.1435,-0.167849 1.9386,0.338588 1.957,1.24414 0.011,0.623558 -2.6796,0.206435 -4.0254,-0.623047 -0.9182,-0.56601 -1.4469,-0.700249 -1.5488,-0.394531 -0.1735,0.520037 -1.3203,0.219752 -1.3203,-0.345703 0,-0.199408 0.3494,-0.363281 0.7773,-0.363281 0.4281,0 0.8434,-0.196257 0.9239,-0.4375 0.051,-0.152807 0.1712,-0.22452 0.373,-0.214844 z m 5.6387,1.464844 c 0.2234,0 0.4062,0.182929 0.4062,0.40625 0,0.223332 -0.1831,0.40625 -0.4062,0.40625 -0.2234,0 -0.4063,-0.182929 -0.4063,-0.40625 0,-0.223295 0.1828,-0.40625 0.4063,-0.40625 z m -92.5723,0.8125 c -0.2233,0 -0.4062,0.182929 -0.4062,0.40625 0,0.223294 0.1827,0.404297 0.4062,0.404297 0.2234,0 0.4063,-0.18098 0.4063,-0.404297 0,-0.223333 -0.1832,-0.40625 -0.4063,-0.40625 z m 95.2676,0.07422 c 0.077,0.04524 -0.1674,0.198864 -0.6641,0.5 -0.5582,0.338571 -1.3211,0.621238 -1.6933,0.628907 -0.3723,0.0079 -0.7682,0.242366 -0.8809,0.521484 -0.1126,0.27908 -0.2168,0.324857 -0.2304,0.101563 -0.054,-0.854295 0.6302,-1.35557 2.1953,-1.607422 0.794,-0.127786 1.1957,-0.189771 1.2734,-0.144532 z m -1.25,2.361329 c 0.099,0 0.1797,0.182929 0.1797,0.40625 0,0.223294 -0.1934,0.40625 -0.4297,0.40625 -0.2366,0 -0.3176,-0.182933 -0.1797,-0.40625 0.138,-0.223333 0.3313,-0.40625 0.4297,-0.40625 z m -107.416,0.8125 c 0.2234,0 0.4062,0.365896 0.4062,0.8125 0,0.446619 -0.1831,0.810546 -0.4062,0.810547 -0.2234,0 -0.4063,-0.363909 -0.4063,-0.810547 0,-0.44662 0.1828,-0.8125 0.4063,-0.8125 z m 41.0078,2.435547 c 0.2234,0 0.4063,0.182932 0.4063,0.40625 0,0.223293 -0.1829,0.406249 -0.4063,0.40625 -0.2234,0 -0.4062,-0.182931 -0.4062,-0.40625 0,-0.223295 0.1827,-0.406251 0.4062,-0.40625 z m 92.168,1.625 c -0.2234,0 -0.4063,0.180975 -0.4063,0.404296 0,0.223333 0.1828,0.40625 0.4063,0.40625 0.2233,0 0.4043,-0.182929 0.4043,-0.40625 0,-0.223294 -0.1809,-0.404297 -0.4043,-0.404296 z m -130.4199,10.679688 c 0.2821,0.0203 0.6423,0.1202 1.1699,0.28906 1.953,0.62506 4.5996,2.06603 4.5996,2.5039 0,0.50242 -0.5666,0.39749 -1.4434,-0.26562 -0.4335,-0.32788 -1.1549,-0.59603 -1.6015,-0.5957 -1.2144,8.1e-4 -4.0823,2.14691 -3.9414,2.94921 0.065,0.37361 -0.072,0.67969 -0.3047,0.67969 -0.7876,0 -0.4963,-4.01533 0.3574,-4.93164 0.353,-0.37878 0.5847,-0.57656 0.9043,-0.62305 0.08,-0.0116 0.1657,-0.0125 0.2598,-0.006 z m 4.1328,4.55664 c 0.2237,0.0517 0.4199,0.20369 0.4199,0.41796 0,0.0985 -0.2846,0.17969 -0.6328,0.17969 -0.3481,0 -0.5192,-0.18517 -0.3789,-0.41211 0.1156,-0.1875 0.3679,-0.23725 0.5918,-0.18554 z m -3.2344,0.59765 c 0.2234,0 0.4062,0.18293 0.4062,0.40625 0,0.22333 -0.1827,0.40625 -0.4062,0.40625 -0.2234,0 -0.4063,-0.18293 -0.4063,-0.40625 0,-0.22329 0.1828,-0.40625 0.4063,-0.40625 z m -52.127,0.8125 c -0.3282,0 -0.701,0.17723 -0.8457,0.39453 v 0.30274 c 0.066,0.0694 0.1816,0.11523 0.3438,0.11523 0.3348,0 0.7233,-0.18293 0.8613,-0.40625 0.138,-0.22333 -0.024,-0.40625 -0.3594,-0.40625 z m 53.75,1.62305 c 0.2234,0 0.4063,0.18293 0.4063,0.40625 0,0.22333 -0.1828,0.40625 -0.4063,0.40625 -0.2233,0 -0.4062,-0.18293 -0.4062,-0.40625 0,-0.2233 0.1828,-0.40625 0.4062,-0.40625 z m -3.5742,0.61133 c 0.1765,0.0299 0.2859,0.15894 0.2246,0.40429 -0.056,0.2233 -0.2307,0.36316 -0.3886,0.31055 -0.158,-0.0526 -0.4016,0.58568 -0.5411,1.41992 -0.3849,2.30232 -0.5266,2.49287 -0.5312,0.70508 0,-0.89325 0.1195,-1.90254 0.2715,-2.24219 0.1889,-0.42315 0.6704,-0.64757 0.9648,-0.59765 z m 15.7559,1.01367 c 0.2233,0 0.4062,0.18293 0.4062,0.40625 0,0.22329 -0.1828,0.40625 -0.4062,0.40625 -0.2234,0 -0.4063,-0.18293 -0.4063,-0.40625 0,-0.22333 0.1828,-0.40625 0.4063,-0.40625 z m -13.8047,1.62305 c 0.2234,0 0.4062,0.18293 0.4062,0.40625 0,0.22333 -0.1827,0.40625 -0.4062,0.40625 -0.2234,0 -0.4063,-0.18293 -0.4063,-0.40625 0,-0.2233 0.1828,-0.40625 0.4063,-0.40625 z m 38.166,0 c 0.2234,0 0.4063,0.18293 0.4063,0.40625 0,0.22333 -0.1828,0.40625 -0.4063,0.40625 -0.2234,0 -0.4062,-0.18293 -0.4062,-0.40625 0,-0.2233 0.1827,-0.40625 0.4062,-0.40625 z m -8.9766,0.22461 c 0.09,0.005 0.1571,0.0264 0.1934,0.0625 0.1202,0.12033 -0.4274,1.06383 -1.2168,2.09765 -1.3229,1.73257 -1.5762,1.87989 -3.2383,1.89063 -0.9917,0.006 -1.9829,-0.16638 -2.2011,-0.38477 -0.6962,-0.69617 -0.4265,-1.45354 0.5175,-1.45508 0.5025,-8.1e-4 1.4609,-0.3339 2.1309,-0.74023 1.3387,-0.81194 3.1814,-1.50389 3.8144,-1.4707 z m -13.1074,0.32226 c 0.049,0.008 0.1023,0.0282 0.1582,0.0625 0.2234,0.13799 0.4063,0.33115 0.4063,0.42969 0,0.0985 -0.1828,0.17969 -0.4063,0.17969 -0.2233,0 -0.4062,-0.1932 -0.4062,-0.42969 0,-0.17734 0.1025,-0.26668 0.248,-0.24219 z m -4.082,0.26563 c 0.099,0 0.1797,0.18292 0.1797,0.40625 0,0.22329 -0.1934,0.40625 -0.4297,0.40625 -0.2366,0 -0.3177,-0.18294 -0.1797,-0.40625 0.138,-0.22334 0.3313,-0.40625 0.4297,-0.40625 z m -10.377,1.625 c 0.2234,0 0.4063,0.18293 0.4063,0.40625 0,0.22333 -0.1828,0.40429 -0.4063,0.40429 -0.2233,0 -0.4062,-0.18097 -0.4062,-0.40429 0,-0.2233 0.1828,-0.40625 0.4062,-0.40625 z m -9.9023,0.15429 c 0.049,-0.002 0.1023,0.0145 0.1582,0.0488 0.2234,0.13803 0.4062,0.42268 0.4062,0.63281 0,0.21014 -0.1828,0.38086 -0.4062,0.38086 -0.2234,0 -0.4063,-0.28466 -0.4063,-0.63281 0,-0.26113 0.1026,-0.42323 0.2481,-0.42969 z m 6.6543,0.65625 c 0.2234,0 0.4062,0.18293 0.4062,0.40625 0,0.2233 -0.1827,0.40625 -0.4062,0.40625 -0.2234,0 -0.4063,-0.18293 -0.4063,-0.40625 0,-0.22329 0.1828,-0.40625 0.4063,-0.40625 z m -3.8125,0.14063 c 0.048,0.008 0.1026,0.0282 0.1582,0.0625 0.2234,0.13803 0.4062,0.33116 0.4062,0.42968 0,0.0985 -0.1827,0.17969 -0.4062,0.17969 -0.2234,0 -0.4063,-0.1932 -0.4063,-0.42969 0,-0.17732 0.1026,-0.26667 0.2481,-0.24218 z m 47.8672,0.26562 c 0.3613,0 0.5423,0.18294 0.4043,0.40625 -0.138,0.2233 -0.3188,0.40625 -0.4043,0.40625 -0.085,0 -0.2682,-0.18293 -0.4063,-0.40625 -0.1379,-0.22333 0.045,-0.40625 0.4063,-0.40625 z m -29.0684,0.0508 v 0 c 0.1401,0.006 0.2608,0.0442 0.3281,0.11133 0.135,0.13482 -0.1049,0.23054 -0.5332,0.21289 -0.4729,-0.0197 -0.5681,-0.11645 -0.2442,-0.24609 0.146,-0.0584 0.3065,-0.0837 0.4473,-0.0781 z m -6.8887,0.76172 c 0.2366,0 0.4297,0.18293 0.4297,0.40625 0,0.2233 -0.081,0.40625 -0.1797,0.40625 -0.099,0 -0.2916,-0.18293 -0.4296,-0.40625 -0.138,-0.22333 -0.057,-0.40625 0.1796,-0.40625 z m -2.8535,0.86133 c 0.141,0.006 0.2625,0.0439 0.3301,0.11133 0.1349,0.13481 -0.105,0.23249 -0.5332,0.21484 -0.473,-0.0197 -0.5681,-0.11645 -0.2441,-0.24609 0.1466,-0.0586 0.3061,-0.0859 0.4472,-0.0801 z m -2.9863,0.35742 c 0.099,0 0.1777,0.18293 0.1777,0.40625 0,0.2233 -0.193,0.40625 -0.4297,0.40625 -0.2366,0 -0.3156,-0.18293 -0.1777,-0.40625 0.138,-0.22333 0.3314,-0.40625 0.4297,-0.40625 z m -7.9414,0.20313 c 0.2978,0 0.618,0.22868 0.7109,0.50781 0.1006,0.30191 -0.1875,0.50586 -0.7109,0.50586 -0.5233,0 -0.8116,-0.20394 -0.7109,-0.50586 0.093,-0.27916 0.4131,-0.50781 0.7109,-0.50781 z m 24.3613,0.20312 c 0.2234,0 0.4063,0.18098 0.4063,0.4043 0,0.22333 -0.1832,0.40625 -0.4063,0.40625 -0.2233,0 -0.4062,-0.18293 -0.4062,-0.40625 0,-0.2233 0.1827,-0.4043 0.4062,-0.4043 z m 3.4512,0 c 0.3613,0 0.5442,0.18098 0.4062,0.4043 -0.1379,0.22333 -0.3207,0.40625 -0.4062,0.40625 -0.085,0 -0.2682,-0.18293 -0.4063,-0.40625 -0.1379,-0.2233 0.045,-0.4043 0.4063,-0.4043 z m -6.0449,0.13867 c 0.048,0.008 0.1022,0.0301 0.1582,0.0645 0.2233,0.13803 0.4043,0.33119 0.4043,0.42969 0,0.0985 -0.1812,0.17773 -0.4043,0.17773 -0.2234,0 -0.4063,-0.1932 -0.4063,-0.42969 0,-0.17733 0.1026,-0.26668 0.2481,-0.24219 z m -3.0918,0.26758 c 0.2233,0 0.4062,0.18098 0.4062,0.4043 0,0.22333 -0.1828,0.40625 -0.4062,0.40625 -0.2234,0 -0.4043,-0.18293 -0.4043,-0.40625 0,-0.22333 0.1808,-0.4043 0.4043,-0.4043 z m -15.6543,0.4043 c 0.3481,0 0.6328,0.18293 0.6328,0.40625 0,0.22329 -0.1726,0.40625 -0.3828,0.40625 -0.2102,0 -0.4948,-0.18293 -0.6328,-0.40625 -0.138,-0.22333 0.035,-0.40625 0.3828,-0.40625 z m 2.2558,0 c 0.2234,0 0.4063,0.18293 0.4063,0.40625 0,0.22329 -0.1828,0.40625 -0.4063,0.40625 -0.2233,0 -0.4062,-0.18293 -0.4062,-0.40625 0,-0.22333 0.1828,-0.40625 0.4062,-0.40625 z m 44.4141,0.15625 c 0.1455,0.006 0.25,0.16859 0.25,0.42969 0,0.34813 -0.1829,0.63281 -0.4062,0.63281 -0.2234,0 -0.4063,-0.1727 -0.4063,-0.38281 0,-0.21014 0.1828,-0.49486 0.4063,-0.63282 0.056,-0.0344 0.1078,-0.049 0.1562,-0.0469 z m -24.291,1.46875 c 0.3481,0 0.5188,0.18293 0.3808,0.40625 -0.1379,0.22329 -0.4226,0.40625 -0.6328,0.40625 -0.2101,0 -0.3808,-0.18293 -0.3808,-0.40625 0,-0.22333 0.2846,-0.40625 0.6328,-0.40625 z m -17.6856,0.40625 c 0.2234,0 0.4043,0.18293 0.4043,0.40625 0,0.22333 -0.1808,0.40625 -0.4043,0.40625 -0.2233,0 -0.4062,-0.18293 -0.4062,-0.40625 0,-0.2233 0.1828,-0.40625 0.4062,-0.40625 z m 28.42,0 c 0.2233,0 0.4062,0.18293 0.4062,0.40625 0,0.22333 -0.1828,0.40625 -0.4062,0.40625 -0.2234,0 -0.4043,-0.18293 -0.4043,-0.40625 0,-0.2233 0.1808,-0.40625 0.4043,-0.40625 z m 4.0605,0 c 0.2234,0 0.4063,0.18293 0.4063,0.40625 0,0.22333 -0.1828,0.40625 -0.4063,0.40625 -0.2234,0 -0.4062,-0.18293 -0.4062,-0.40625 0,-0.2233 0.1828,-0.40625 0.4062,-0.40625 z m 4.0371,0 c 0.2366,0 0.4297,0.18293 0.4297,0.40625 0,0.22333 -0.081,0.40625 -0.1797,0.40625 -0.099,0 -0.2916,-0.18293 -0.4297,-0.40625 -0.1379,-0.2233 -0.057,-0.40625 0.1797,-0.40625 z m -43.2422,0.40625 c 0.3481,0 0.6328,0.18293 0.6328,0.40625 0,0.22333 -0.1706,0.4043 -0.3808,0.4043 -0.2102,0 -0.4949,-0.18098 -0.6328,-0.4043 -0.138,-0.22333 0.033,-0.40625 0.3808,-0.40625 z m 14.4375,0.40625 c 0.2234,0 0.4063,0.18098 0.4063,0.4043 0,0.22329 -0.1828,0.40625 -0.4063,0.40625 -0.2233,0 -0.4043,-0.18294 -0.4043,-0.40625 0,-0.22334 0.1809,-0.4043 0.4043,-0.4043 z m -10.7597,0.4043 c 0.3348,0 0.6093,0.18293 0.6093,0.40625 0,0.22333 -0.2743,0.40625 -0.6093,0.40625 -0.3349,0 -0.6075,-0.18293 -0.6075,-0.40625 0,-0.2233 0.2724,-0.40625 0.6075,-0.40625 z m 33.9277,0.40625 c 0.2101,0 0.3828,0.18293 0.3828,0.40625 0,0.22333 -0.2846,0.40625 -0.6328,0.40625 -0.3481,0 -0.5208,-0.18293 -0.3828,-0.40625 0.1379,-0.2233 0.4227,-0.40625 0.6328,-0.40625 z m -28.4453,0.40625 c 0.2234,0 0.4062,0.18293 0.4062,0.40625 0,0.22333 -0.1828,0.40625 -0.4062,0.40625 -0.2234,0 -0.4063,-0.18294 -0.4063,-0.40625 0,-0.22334 0.1828,-0.40625 0.4063,-0.40625 z m 13.2187,0 c 0.099,0 0.1797,0.18293 0.1797,0.40625 0,0.22333 -0.1934,0.40625 -0.4297,0.40625 -0.2366,0 -0.3176,-0.18294 -0.1797,-0.40625 0.138,-0.22334 0.3314,-0.40625 0.4297,-0.40625 z m 3.6543,0 c 0.099,0 0.1797,0.18293 0.1797,0.40625 0,0.22333 -0.1934,0.40625 -0.4297,0.40625 -0.2366,0 -0.3176,-0.18294 -0.1797,-0.40625 0.138,-0.22334 0.3314,-0.40625 0.4297,-0.40625 z m 8.4336,0.97461 c 0.1743,-0.0268 0.3571,0.0504 0.4551,0.20898 0.1308,0.21154 0.063,0.4923 -0.1484,0.62305 -0.2117,0.13077 -0.4904,0.065 -0.6211,-0.14649 -0.1308,-0.21154 -0.065,-0.4923 0.1465,-0.62304 0.053,-0.0325 0.1097,-0.0536 0.1679,-0.0625 z m 8.8223,0.65039 c 0.2366,0 0.3176,0.18293 0.1797,0.40625 -0.138,0.22329 -0.331,0.40625 -0.4297,0.40625 -0.099,0 -0.1797,-0.18294 -0.1797,-0.40625 0,-0.22334 0.193,-0.40625 0.4297,-0.40625 z m -42.25,0.40625 c 0.2234,0 0.4062,0.18293 0.4062,0.40625 0,0.22333 -0.1827,0.40429 -0.4062,0.40429 -0.2234,0 -0.4063,-0.18097 -0.4063,-0.40429 0,-0.2233 0.1828,-0.40625 0.4063,-0.40625 z m 2.8418,0.81054 c 0.2234,0 0.4062,0.18293 0.4062,0.40625 0,0.2233 -0.1827,0.40625 -0.4062,0.40625 -0.2234,0 -0.4043,-0.18293 -0.4043,-0.40625 0,-0.22333 0.1808,-0.40625 0.4043,-0.40625 z m 19.8965,0 c 0.2233,0 0.4062,0.18293 0.4062,0.40625 0,0.2233 -0.1828,0.40625 -0.4062,0.40625 -0.2234,0 -0.4063,-0.18293 -0.4063,-0.40625 0,-0.22333 0.1828,-0.40625 0.4063,-0.40625 z m 13.2187,0.40625 c 0.3481,0 0.5208,0.18293 0.3828,0.40625 -0.1379,0.2233 -0.4226,0.40625 -0.6328,0.40625 -0.2101,0 -0.3828,-0.18293 -0.3828,-0.40625 0,-0.22333 0.2846,-0.40625 0.6328,-0.40625 z m 3.8203,0.21485 c 0.2238,0.0517 0.42,0.20369 0.42,0.41797 0,0.0984 -0.2846,0.17968 -0.6329,0.17968 -0.3481,0 -0.5191,-0.18516 -0.3789,-0.41211 0.1157,-0.1875 0.3679,-0.23725 0.5918,-0.18554 z m -31.6797,0.1914 c 0.2366,0 0.4297,0.18294 0.4297,0.40625 0,0.22334 -0.081,0.40625 -0.1797,0.40625 -0.099,0 -0.2916,-0.18293 -0.4296,-0.40625 -0.138,-0.22329 -0.057,-0.40625 0.1796,-0.40625 z m -2.7265,1.60547 c 0.1674,-0.0283 0.3184,0.0697 0.3437,0.3125 0.015,0.16192 -0.1892,0.3677 -0.457,0.45703 -0.268,0.0893 -0.4136,-0.0563 -0.3242,-0.32422 0.087,-0.26173 0.27,-0.41706 0.4375,-0.44531 z m 31.9844,0.0195 c 0.2233,0 0.4043,0.18293 0.4043,0.40625 0,0.22334 -0.1809,0.4043 -0.4043,0.4043 -0.2234,0 -0.4063,-0.18098 -0.4063,-0.4043 0,-0.22329 0.1832,-0.40625 0.4063,-0.40625 z m -26.3926,0.40625 c 0.2234,0 0.4062,0.18098 0.4062,0.4043 0,0.22333 -0.1827,0.40625 -0.4062,0.40625 -0.2234,0 -0.4063,-0.18293 -0.4063,-0.40625 0,-0.22329 0.1828,-0.4043 0.4063,-0.4043 z m -3.1153,1.37891 c 0.1743,-0.0268 0.3571,0.0504 0.4551,0.20898 0.1308,0.21154 0.065,0.49231 -0.1465,0.62305 -0.2116,0.13077 -0.4922,0.0651 -0.623,-0.14648 -0.1308,-0.21154 -0.065,-0.49231 0.1465,-0.62305 0.053,-0.0325 0.1097,-0.0536 0.1679,-0.0625 z m 5.9571,0.24414 c 0.2233,0 0.4062,0.18293 0.4062,0.40625 0,0.22333 -0.1831,0.40625 -0.4062,0.40625 -0.2234,0 -0.4063,-0.18293 -0.4063,-0.40625 0,-0.22329 0.1828,-0.40625 0.4063,-0.40625 z m -8.9317,1.21875 c 0.2234,0 0.4063,0.18293 0.4063,0.40625 0,0.22333 -0.1828,0.4043 -0.4063,0.4043 -0.2233,0 -0.4062,-0.18098 -0.4062,-0.4043 0,-0.22329 0.1828,-0.40625 0.4062,-0.40625 z m -2.8418,0.40625 c 0.2234,0 0.4063,0.18098 0.4063,0.4043 0,0.22329 -0.1828,0.40625 -0.4063,0.40625 -0.2233,0 -0.4062,-0.18293 -0.4062,-0.40625 0,-0.22334 0.1828,-0.4043 0.4062,-0.4043 z m 15.6309,1.2168 c 0.3613,0 0.5442,0.18293 0.4062,0.40625 -0.1378,0.22329 -0.3207,0.40625 -0.4062,0.40625 -0.085,0 -0.2683,-0.18293 -0.4062,-0.40625 -0.138,-0.22334 0.045,-0.40625 0.4062,-0.40625 z m -7.918,0.40625 c 0.2234,0 0.4063,0.18293 0.4063,0.40625 0,0.22329 -0.1828,0.40625 -0.4063,0.40625 -0.2233,0 -0.4043,-0.18293 -0.4043,-0.40625 0,-0.22334 0.1809,-0.40625 0.4043,-0.40625 z m 25.9864,0.40625 c 0.2233,0 0.4062,0.18293 0.4062,0.40625 0,0.22333 -0.1828,0.40625 -0.4062,0.40625 -0.2234,0 -0.4063,-0.18294 -0.4063,-0.40625 0,-0.22334 0.1828,-0.40625 0.4063,-0.40625 z m -21.1368,0.40625 c 0.2366,0 0.4297,0.18293 0.4297,0.40625 0,0.22333 -0.081,0.40625 -0.1797,0.40625 -0.099,0 -0.2916,-0.18293 -0.4296,-0.40625 -0.138,-0.22334 -0.057,-0.40625 0.1796,-0.40625 z m -10.9394,0.8125 c 0.2234,0 0.4062,0.18293 0.4062,0.40625 0,0.22333 -0.1827,0.40429 -0.4062,0.40429 -0.2234,0 -0.4063,-0.18097 -0.4063,-0.40429 0,-0.2233 0.1828,-0.40625 0.4063,-0.40625 z m 5.2793,1.21679 c 0.2234,0 0.4062,0.18293 0.4062,0.40625 0,0.22334 -0.1827,0.40625 -0.4062,0.40625 -0.2234,0 -0.4063,-0.18293 -0.4063,-0.40625 0,-0.22329 0.1828,-0.40625 0.4063,-0.40625 z m 28.0019,0.6211 c 0.2238,0.0517 0.42,0.20369 0.42,0.41797 0,0.0985 -0.2866,0.17968 -0.6348,0.17968 -0.3481,0 -0.5172,-0.18513 -0.377,-0.41211 0.1161,-0.1875 0.3679,-0.23725 0.5918,-0.18554 z m -30.666,0.59765 c 0.3481,0 0.6328,0.18293 0.6328,0.40625 0,0.22334 -0.1706,0.40625 -0.3808,0.40625 -0.2102,0 -0.4949,-0.18293 -0.6328,-0.40625 -0.138,-0.22329 0.033,-0.40625 0.3808,-0.40625 z m 5.709,0.8125 c 0.3613,0 0.5442,0.18293 0.4063,0.40625 -0.138,0.2233 -0.3211,0.4043 -0.4063,0.4043 -0.085,0 -0.2682,-0.18098 -0.4062,-0.4043 -0.138,-0.22333 0.045,-0.40625 0.4062,-0.40625 z m 29.4238,0.6211 c 0.2238,0.0517 0.418,0.20369 0.418,0.41797 0,0.0985 -0.2846,0.17773 -0.6328,0.17773 -0.3481,0 -0.5173,-0.18517 -0.377,-0.41211 0.1157,-0.1875 0.368,-0.2353 0.5918,-0.18359 z m -3.2363,0.5957 c 0.2234,0 0.4063,0.18293 0.4063,0.40625 0,0.2233 -0.1828,0.40625 -0.4063,0.40625 -0.2234,0 -0.4062,-0.18293 -0.4062,-0.40625 0,-0.22333 0.1828,-0.40625 0.4062,-0.40625 z m -29.209,0.40625 c 0.2102,0 0.3828,0.2744 0.3828,0.60938 0,0.62786 -0.4802,0.80683 -0.9375,0.34961 -0.3242,-0.3244 0.043,-0.95899 0.5547,-0.95899 z m 30.834,2.03125 c 0.2234,0 0.4063,0.18293 0.4063,0.40625 0,0.22333 -0.1832,0.4043 -0.4063,0.4043 -0.2234,0 -0.4062,-0.18098 -0.4062,-0.4043 0,-0.22329 0.1831,-0.40625 0.4062,-0.40625 z m -28.2187,0.40625 c 0.3348,0 0.6093,0.18098 0.6093,0.4043 0,0.22333 -0.2743,0.40625 -0.6093,0.40625 -0.3349,0 -0.6094,-0.18293 -0.6094,-0.40625 0,-0.2233 0.2743,-0.4043 0.6094,-0.4043 z m 2.5468,2.08203 c 0.1489,-0.0276 0.3457,0.0371 0.541,0.23242 0.2918,0.29159 0.2969,0.52001 0.022,0.69141 -0.2275,0.14052 -0.536,0.0563 -0.6855,-0.18555 -0.2411,-0.39014 -0.1249,-0.69263 0.123,-0.73828 z"
         transform="scale(0.26458333)" />
    </g>
  </g>
</svg>
