<?xml version="1.0" encoding="UTF-8" standalone="no"?>
<!-- Created with Inkscape (http://www.inkscape.org/) -->

<svg
   width="193.50348mm"
   height="137.6438mm"
   viewBox="0 0 193.50348 137.6438"
   version="1.1"
   id="svg531"
   inkscape:version="1.2 (dc2aedaf03, 2022-05-15)"
   sodipodi:docname="note_target03.svg"
   xmlns:inkscape="http://www.inkscape.org/namespaces/inkscape"
   xmlns:sodipodi="http://sodipodi.sourceforge.net/DTD/sodipodi-0.dtd"
   xmlns="http://www.w3.org/2000/svg"
   xmlns:svg="http://www.w3.org/2000/svg">
  <sodipodi:namedview
     id="namedview533"
     pagecolor="#ffffff"
     bordercolor="#000000"
     borderopacity="0.25"
     inkscape:showpageshadow="2"
     inkscape:pageopacity="0.0"
     inkscape:pagecheckerboard="0"
     inkscape:deskcolor="#d1d1d1"
     inkscape:document-units="mm"
     showgrid="false"
     inkscape:zoom="0.73851712"
     inkscape:cx="167.227"
     inkscape:cy="64.995108"
     inkscape:window-width="1920"
     inkscape:window-height="1009"
     inkscape:window-x="-8"
     inkscape:window-y="-8"
     inkscape:window-maximized="1"
     inkscape:current-layer="layer1" />
  <defs
     id="defs528" />
  <g
     inkscape:label="Vrstva 1"
     inkscape:groupmode="layer"
     id="layer1"
     transform="translate(-60.842542,-131.37628)">
    <path
       id="path13692"
       style="fill:#000000;stroke:none;stroke-width:3.66501;stroke-linecap:round;stroke-linejoin:round;stroke-dashoffset:347.717;paint-order:stroke markers fill"
       d="m 60.842542,131.37628 v 113.8571 h 26.99421 v 23.7867 l 13.733518,-23.7867 h 152.77575 v -113.8571 z" />
    <g
       aria-label="a stavba bytů zase pomůže proti bytové krizi!"
       id="text13700"
       style="font-size:21.3399px;line-height:1;font-family:'AlterEgo BB';-inkscape-font-specification:'AlterEgo BB';text-align:center;letter-spacing:0px;word-spacing:0px;text-anchor:middle;stroke-width:0.5335"
       transform="translate(-12.09584,-407.1035)">
      <path
         d="m 127.23431,560.9212 h -3.43572 l -2.39007,14.93793 h 2.15533 l 0.40546,-2.71017 h 2.88089 l 0.40545,2.71017 h 2.36873 z m -1.83523,2.64615 1.13102,7.55432 h -2.26203 z"
         style="font-family:'Bebas Neue';-inkscape-font-specification:'Bebas Neue';fill:#ffffff"
         id="path24495" />
      <path
         d="m 133.72165,564.5063 c 0,4.26798 4.58808,4.84416 4.58808,7.91711 0,1.06699 -0.46948,1.45111 -1.21638,1.45111 -0.74689,0 -1.21637,-0.38412 -1.21637,-1.45111 v -1.067 h -2.21935 v 0.91762 c 0,2.39007 1.19503,3.75582 3.49974,3.75582 2.30471,0 3.49975,-1.36575 3.49975,-3.75582 0,-4.26798 -4.58808,-4.84416 -4.58808,-7.9171 0,-1.067 0.4268,-1.47246 1.17369,-1.47246 0.7469,0 1.1737,0.40546 1.1737,1.47246 v 0.61885 h 2.21935 v -0.46948 c 0,-2.39006 -1.1737,-3.75582 -3.45707,-3.75582 -2.28337,0 -3.45706,1.36576 -3.45706,3.75582 z"
         style="font-family:'Bebas Neue';-inkscape-font-specification:'Bebas Neue';fill:#ffffff"
         id="path24497" />
      <path
         d="m 141.31867,563.05519 h 2.45408 v 12.80394 h 2.34739 v -12.80394 h 2.45409 v -2.13399 h -7.25556 z"
         style="font-family:'Bebas Neue';-inkscape-font-specification:'Bebas Neue';fill:#ffffff"
         id="path24499" />
      <path
         d="m 153.99458,560.9212 h -3.43572 l -2.39007,14.93793 h 2.15533 l 0.40546,-2.71017 h 2.88088 l 0.40546,2.71017 h 2.36873 z m -1.83523,2.64615 1.13102,7.55432 h -2.26203 z"
         style="font-family:'Bebas Neue';-inkscape-font-specification:'Bebas Neue';fill:#ffffff"
         id="path24501" />
      <path
         d="m 158.68936,560.9212 h -2.36873 l 2.30471,14.93793 h 3.49974 l 2.30471,-14.93793 h -2.15533 l -1.79255,12.18508 z"
         style="font-family:'Bebas Neue';-inkscape-font-specification:'Bebas Neue';fill:#ffffff"
         id="path24503" />
      <path
         d="m 169.06056,560.9212 h -3.54242 v 14.93793 h 3.6918 c 2.34739,0 3.56376,-1.23771 3.56376,-3.54242 v -1.21638 c 0,-1.57915 -0.49082,-2.71016 -1.74987,-3.20098 1.04566,-0.49082 1.51513,-1.47245 1.51513,-3.00893 v -0.53349 c 0,-2.30471 -1.04565,-3.43573 -3.4784,-3.43573 z m -0.14938,8.21586 c 1.067,0 1.51513,0.4268 1.51513,1.81389 v 1.30174 c 0,1.10967 -0.42679,1.47245 -1.21637,1.47245 h -1.34441 v -4.58808 z m 0.0854,-6.08187 c 0.83226,0 1.19503,0.46948 1.19503,1.53647 v 0.83226 c 0,1.19503 -0.53349,1.57915 -1.40843,1.57915 h -0.91761 v -3.94788 z"
         style="font-family:'Bebas Neue';-inkscape-font-specification:'Bebas Neue';fill:#ffffff"
         id="path24505" />
      <path
         d="m 179.38907,560.9212 h -3.43572 l -2.39007,14.93793 h 2.15533 l 0.40546,-2.71017 h 2.88088 l 0.40546,2.71017 h 2.36873 z m -1.83523,2.64615 1.13102,7.55432 h -2.26203 z"
         style="font-family:'Bebas Neue';-inkscape-font-specification:'Bebas Neue';fill:#ffffff"
         id="path24507" />
      <path
         d="m 189.71759,560.9212 h -3.54242 v 14.93793 h 3.6918 c 2.34739,0 3.56376,-1.23771 3.56376,-3.54242 v -1.21638 c 0,-1.57915 -0.49081,-2.71016 -1.74987,-3.20098 1.04566,-0.49082 1.51514,-1.47245 1.51514,-3.00893 v -0.53349 c 0,-2.30471 -1.04566,-3.43573 -3.47841,-3.43573 z m -0.14938,8.21586 c 1.067,0 1.51514,0.4268 1.51514,1.81389 v 1.30174 c 0,1.10967 -0.4268,1.47245 -1.21638,1.47245 h -1.34441 v -4.58808 z m 0.0854,-6.08187 c 0.83226,0 1.19504,0.46948 1.19504,1.53647 v 0.83226 c 0,1.19503 -0.5335,1.57915 -1.40844,1.57915 h -0.91761 v -3.94788 z"
         style="font-family:'Bebas Neue';-inkscape-font-specification:'Bebas Neue';fill:#ffffff"
         id="path24509" />
      <path
         d="m 196.7171,575.85913 h 2.34738 v -4.95086 l 2.96625,-9.98707 h -2.24069 l -1.79255,6.80743 -1.79255,-6.80743 h -2.45409 l 2.96625,9.98707 z"
         style="font-family:'Bebas Neue';-inkscape-font-specification:'Bebas Neue';fill:#ffffff"
         id="path24511" />
      <path
         d="m 202.28681,563.05519 h 2.45409 v 12.80394 h 2.34739 v -12.80394 h 2.45408 v -2.13399 h -7.25556 z"
         style="font-family:'Bebas Neue';-inkscape-font-specification:'Bebas Neue';fill:#ffffff"
         id="path24513" />
      <path
         d="m 210.46001,560.9212 v 11.37417 c 0,2.39007 1.19503,3.75582 3.49974,3.75582 2.30471,0 3.49975,-1.36575 3.49975,-3.75582 V 560.9212 h -2.21935 v 11.52355 c 0,1.06699 -0.46948,1.45111 -1.21638,1.45111 -0.74689,0 -1.21637,-0.38412 -1.21637,-1.45111 V 560.9212 Z m 1.81389,-2.43275 c 0,0.9603 0.7469,1.70719 1.70719,1.70719 0.9603,0 1.70719,-0.74689 1.70719,-1.70719 0,-0.96029 -0.74689,-1.70719 -1.70719,-1.70719 -0.96029,0 -1.70719,0.7469 -1.70719,1.70719 z m 1.067,0 c 0,-0.36278 0.27741,-0.64019 0.64019,-0.64019 0.36278,0 0.6402,0.27741 0.6402,0.64019 0,0.36278 -0.27742,0.6402 -0.6402,0.6402 -0.36278,0 -0.64019,-0.27742 -0.64019,-0.6402 z"
         style="font-family:'Bebas Neue';-inkscape-font-specification:'Bebas Neue';fill:#ffffff"
         id="path24515" />
      <path
         d="m 106.37453,584.82189 v 2.13399 h 4.24664 l -4.46004,10.71263 v 2.09131 h 6.87145 v -2.13399 h -4.46004 l 4.46004,-10.71263 v -2.09131 z"
         style="font-family:'Bebas Neue';-inkscape-font-specification:'Bebas Neue';fill:#ffffff"
         id="path24517" />
      <path
         d="m 119.62663,584.82189 h -3.43573 l -2.39007,14.93793 h 2.15533 l 0.40546,-2.71017 h 2.88089 l 0.40546,2.71017 h 2.36873 z m -1.83523,2.64615 1.13101,7.55432 h -2.26203 z"
         style="font-family:'Bebas Neue';-inkscape-font-specification:'Bebas Neue';fill:#ffffff"
         id="path24519" />
      <path
         d="m 122.80626,588.40699 c 0,4.26798 4.58808,4.84416 4.58808,7.9171 0,1.067 -0.46947,1.45112 -1.21637,1.45112 -0.7469,0 -1.21638,-0.38412 -1.21638,-1.45112 v -1.06699 h -2.21935 v 0.91761 c 0,2.39007 1.19504,3.75583 3.49975,3.75583 2.30471,0 3.49974,-1.36576 3.49974,-3.75583 0,-4.26798 -4.58808,-4.84415 -4.58808,-7.9171 0,-1.06699 0.4268,-1.47245 1.1737,-1.47245 0.74689,0 1.17369,0.40546 1.17369,1.47245 v 0.61886 h 2.21935 v -0.46948 c 0,-2.39007 -1.17369,-3.75582 -3.45706,-3.75582 -2.28337,0 -3.45707,1.36575 -3.45707,3.75582 z"
         style="font-family:'Bebas Neue';-inkscape-font-specification:'Bebas Neue';fill:#ffffff"
         id="path24521" />
      <path
         d="m 133.43354,586.95588 h 4.05459 v -2.13399 h -6.40197 v 14.93793 h 6.40197 v -2.13399 h -4.05459 v -4.37468 h 3.22233 v -2.13399 h -3.22233 z"
         style="font-family:'Bebas Neue';-inkscape-font-specification:'Bebas Neue';fill:#ffffff"
         id="path24523" />
      <path
         d="m 145.704,584.82189 h -3.45706 v 14.93793 h 2.34739 v -5.6124 h 1.10967 c 2.34739,0 3.49974,-1.30173 3.49974,-3.6918 v -1.94193 c 0,-2.39007 -1.15235,-3.6918 -3.49974,-3.6918 z m 0,2.13399 c 0.7469,0 1.15236,0.34144 1.15236,1.40843 v 2.24069 c 0,1.067 -0.40546,1.40843 -1.15236,1.40843 h -1.10967 v -5.05755 z"
         style="font-family:'Bebas Neue';-inkscape-font-specification:'Bebas Neue';fill:#ffffff"
         id="path24525" />
      <path
         d="m 152.44743,588.25761 c 0,-1.06699 0.46948,-1.47245 1.21637,-1.47245 0.7469,0 1.21638,0.40546 1.21638,1.47245 v 8.06648 c 0,1.067 -0.46948,1.47246 -1.21638,1.47246 -0.74689,0 -1.21637,-0.40546 -1.21637,-1.47246 z m -2.34739,7.9171 c 0,2.39007 1.25905,3.75583 3.56376,3.75583 2.30471,0 3.56377,-1.36576 3.56377,-3.75583 v -7.76772 c 0,-2.39007 -1.25906,-3.75582 -3.56377,-3.75582 -2.30471,0 -3.56376,1.36575 -3.56376,3.75582 z"
         style="font-family:'Bebas Neue';-inkscape-font-specification:'Bebas Neue';fill:#ffffff"
         id="path24527" />
      <path
         d="m 161.98636,584.82189 h -3.265 v 14.93793 h 2.04863 v -10.56325 l 1.74987,10.56325 h 2.21935 l 1.62183,-10.71263 v 10.71263 h 2.21935 v -14.93793 h -3.26501 l -1.60049,10.60593 z"
         style="font-family:'Bebas Neue';-inkscape-font-specification:'Bebas Neue';fill:#ffffff"
         id="path24529" />
      <path
         d="m 170.18089,584.82189 v 11.37416 c 0,2.39007 1.19504,3.75583 3.49974,3.75583 2.30471,0 3.49975,-1.36576 3.49975,-3.75583 v -11.37416 h -2.21935 v 11.52354 c 0,1.067 -0.46948,1.45112 -1.21638,1.45112 -0.74689,0 -1.21637,-0.38412 -1.21637,-1.45112 v -11.52354 z m 1.81389,-2.43275 c 0,0.9603 0.7469,1.70719 1.70719,1.70719 0.9603,0 1.7072,-0.74689 1.7072,-1.70719 0,-0.9603 -0.7469,-1.70719 -1.7072,-1.70719 -0.96029,0 -1.70719,0.74689 -1.70719,1.70719 z m 1.067,0 c 0,-0.36278 0.27742,-0.6402 0.64019,-0.6402 0.36278,0 0.6402,0.27742 0.6402,0.6402 0,0.36278 -0.27742,0.6402 -0.6402,0.6402 -0.36277,0 -0.64019,-0.27742 -0.64019,-0.6402 z"
         style="font-family:'Bebas Neue';-inkscape-font-specification:'Bebas Neue';fill:#ffffff"
         id="path24531" />
      <path
         d="m 178.63151,584.82189 v 2.13399 h 4.24664 l -4.46004,10.71263 v 2.09131 h 6.87144 v -2.13399 h -4.46004 l 4.46004,-10.71263 v -2.09131 z m 0.32009,-3.15831 1.89925,2.36873 h 2.11265 l 1.89926,-2.36873 h -2.00595 l -0.9603,1.19504 -0.93896,-1.19504 z"
         style="font-family:'Bebas Neue';-inkscape-font-specification:'Bebas Neue';fill:#ffffff"
         id="path24533" />
      <path
         d="m 189.02406,586.95588 h 4.05458 v -2.13399 h -6.40197 v 14.93793 h 6.40197 v -2.13399 h -4.05458 v -4.37468 h 3.22232 v -2.13399 h -3.22232 z"
         style="font-family:'Bebas Neue';-inkscape-font-specification:'Bebas Neue';fill:#ffffff"
         id="path24535" />
      <path
         d="m 201.29451,584.82189 h -3.45706 v 14.93793 h 2.34739 v -5.6124 h 1.10967 c 2.34739,0 3.49975,-1.30173 3.49975,-3.6918 v -1.94193 c 0,-2.39007 -1.15236,-3.6918 -3.49975,-3.6918 z m 0,2.13399 c 0.7469,0 1.15236,0.34144 1.15236,1.40843 v 2.24069 c 0,1.067 -0.40546,1.40843 -1.15236,1.40843 h -1.10967 v -5.05755 z"
         style="font-family:'Bebas Neue';-inkscape-font-specification:'Bebas Neue';fill:#ffffff"
         id="path24537" />
      <path
         d="m 213.18085,599.75982 c -0.23474,-0.55484 -0.25608,-1.08834 -0.25608,-1.81389 v -2.30471 c 0,-1.55782 -0.38411,-2.68883 -1.55781,-3.17965 1.04566,-0.49082 1.53647,-1.49379 1.53647,-3.03026 v -1.1737 c 0,-2.30471 -1.04565,-3.43572 -3.4784,-3.43572 h -3.54242 v 14.93793 H 208.23 v -6.08187 h 0.81091 c 1.067,0 1.53648,0.51215 1.53648,1.89925 v 2.34739 c 0,1.21637 0.0854,1.45111 0.21339,1.83523 z m -3.81984,-12.80394 c 0.83226,0 1.19504,0.46948 1.19504,1.53647 v 1.47245 c 0,1.19504 -0.5335,1.57916 -1.40844,1.57916 H 208.23 v -4.58808 z"
         style="font-family:'Bebas Neue';-inkscape-font-specification:'Bebas Neue';fill:#ffffff"
         id="path24539" />
      <path
         d="m 216.61659,588.25761 c 0,-1.06699 0.46948,-1.47245 1.21637,-1.47245 0.7469,0 1.21638,0.40546 1.21638,1.47245 v 8.06648 c 0,1.067 -0.46948,1.47246 -1.21638,1.47246 -0.74689,0 -1.21637,-0.40546 -1.21637,-1.47246 z m -2.34739,7.9171 c 0,2.39007 1.25905,3.75583 3.56376,3.75583 2.30471,0 3.56377,-1.36576 3.56377,-3.75583 v -7.76772 c 0,-2.39007 -1.25906,-3.75582 -3.56377,-3.75582 -2.30471,0 -3.56376,1.36575 -3.56376,3.75582 z"
         style="font-family:'Bebas Neue';-inkscape-font-specification:'Bebas Neue';fill:#ffffff"
         id="path24541" />
      <path
         d="m 222.22897,586.95588 h 2.45409 v 12.80394 h 2.34739 v -12.80394 h 2.45409 v -2.13399 h -7.25557 z"
         style="font-family:'Bebas Neue';-inkscape-font-specification:'Bebas Neue';fill:#ffffff"
         id="path24543" />
      <path
         d="m 230.50887,599.75982 h 2.34739 v -14.93793 h -2.34739 z"
         style="font-family:'Bebas Neue';-inkscape-font-specification:'Bebas Neue';fill:#ffffff"
         id="path24545" />
      <path
         d="m 129.06954,608.72258 h -3.54243 v 14.93792 h 3.69181 c 2.34738,0 3.56376,-1.23771 3.56376,-3.54242 v -1.21637 c 0,-1.57916 -0.49082,-2.71017 -1.74987,-3.20099 1.04565,-0.49082 1.51513,-1.47245 1.51513,-3.00892 v -0.5335 c 0,-2.30471 -1.04565,-3.43572 -3.4784,-3.43572 z m -0.14938,8.21586 c 1.06699,0 1.51513,0.42679 1.51513,1.81389 v 1.30173 c 0,1.10968 -0.4268,1.47245 -1.21637,1.47245 h -1.34442 v -4.58807 z m 0.0854,-6.08187 c 0.83225,0 1.19503,0.46947 1.19503,1.53647 v 0.83225 c 0,1.19504 -0.5335,1.57916 -1.40843,1.57916 h -0.91762 v -3.94788 z"
         style="font-family:'Bebas Neue';-inkscape-font-specification:'Bebas Neue';fill:#ffffff"
         id="path24547" />
      <path
         d="m 136.06904,623.6605 h 2.34739 v -4.95085 l 2.96624,-9.98707 h -2.24068 l -1.79256,6.80742 -1.79255,-6.80742 h -2.45409 l 2.96625,9.98707 z"
         style="font-family:'Bebas Neue';-inkscape-font-specification:'Bebas Neue';fill:#ffffff"
         id="path24549" />
      <path
         d="m 141.63875,610.85657 h 2.45409 v 12.80393 h 2.34739 v -12.80393 h 2.45409 v -2.13399 h -7.25557 z"
         style="font-family:'Bebas Neue';-inkscape-font-specification:'Bebas Neue';fill:#ffffff"
         id="path24551" />
      <path
         d="m 152.07398,612.1583 c 0,-1.067 0.46948,-1.47245 1.21638,-1.47245 0.74689,0 1.21637,0.40545 1.21637,1.47245 v 8.06648 c 0,1.067 -0.46948,1.47245 -1.21637,1.47245 -0.7469,0 -1.21638,-0.40545 -1.21638,-1.47245 z m -2.34739,7.9171 c 0,2.39007 1.25906,3.75582 3.56377,3.75582 2.30471,0 3.56376,-1.36575 3.56376,-3.75582 v -7.76772 c 0,-2.39007 -1.25905,-3.75582 -3.56376,-3.75582 -2.30471,0 -3.56377,1.36575 -3.56377,3.75582 z"
         style="font-family:'Bebas Neue';-inkscape-font-specification:'Bebas Neue';fill:#ffffff"
         id="path24553" />
      <path
         d="m 160.09779,608.72258 h -2.36873 l 2.30471,14.93792 h 3.49975 l 2.30471,-14.93792 h -2.15533 l -1.79256,12.18508 z"
         style="font-family:'Bebas Neue';-inkscape-font-specification:'Bebas Neue';fill:#ffffff"
         id="path24555" />
      <path
         d="m 169.27396,610.85657 h 4.05458 v -2.13399 h -6.40197 v 14.93792 h 6.40197 v -2.13399 h -4.05458 v -4.37467 h 3.22232 v -2.13399 h -3.22232 z m 1.04565,-5.2923 -1.45111,2.36873 h 1.57915 l 2.17667,-2.36873 z"
         style="font-family:'Bebas Neue';-inkscape-font-specification:'Bebas Neue';fill:#ffffff"
         id="path24557" />
      <path
         d="m 183.44367,623.6605 h 2.4114 l -3.265,-8.27988 3.265,-6.65804 h -2.34738 l -3.07295,6.50866 v -6.50866 h -2.34739 v 14.93792 h 2.34739 v -4.58807 l 0.72556,-1.36576 z"
         style="font-family:'Bebas Neue';-inkscape-font-specification:'Bebas Neue';fill:#ffffff"
         id="path24559" />
      <path
         d="m 194.22031,623.6605 c -0.23474,-0.55483 -0.25608,-1.08833 -0.25608,-1.81389 v -2.30471 c 0,-1.55781 -0.38412,-2.68882 -1.55782,-3.17964 1.04566,-0.49082 1.53648,-1.49379 1.53648,-3.03027 v -1.17369 c 0,-2.30471 -1.04566,-3.43572 -3.47841,-3.43572 h -3.54242 v 14.93792 h 2.34739 v -6.08187 h 0.81092 c 1.06699,0 1.53647,0.51216 1.53647,1.89925 v 2.34739 c 0,1.21638 0.0854,1.45112 0.2134,1.83523 z m -3.81985,-12.80393 c 0.83226,0 1.19504,0.46947 1.19504,1.53647 v 1.47245 c 0,1.19504 -0.5335,1.57915 -1.40844,1.57915 h -0.91761 v -4.58807 z"
         style="font-family:'Bebas Neue';-inkscape-font-specification:'Bebas Neue';fill:#ffffff"
         id="path24561" />
      <path
         d="m 195.50071,623.6605 h 2.34739 v -14.93792 h -2.34739 z"
         style="font-family:'Bebas Neue';-inkscape-font-specification:'Bebas Neue';fill:#ffffff"
         id="path24563" />
      <path
         d="m 199.40592,608.72258 v 2.13399 h 4.24664 l -4.46003,10.71262 v 2.09131 h 6.87144 v -2.13399 h -4.46004 l 4.46004,-10.71262 v -2.09131 z"
         style="font-family:'Bebas Neue';-inkscape-font-specification:'Bebas Neue';fill:#ffffff"
         id="path24565" />
      <path
         d="m 207.45109,623.6605 h 2.34739 v -14.93792 h -2.34739 z"
         style="font-family:'Bebas Neue';-inkscape-font-specification:'Bebas Neue';fill:#ffffff"
         id="path24567" />
      <path
         d="m 213.55431,620.35282 0.29875,-5.39899 v -6.23125 h -2.34739 v 6.23125 l 0.29876,5.39899 z m -2.00596,1.04566 v 2.26202 h 2.26203 v -2.26202 z"
         style="font-family:'Bebas Neue';-inkscape-font-specification:'Bebas Neue';fill:#ffffff"
         id="path24569" />
    </g>
  </g>
</svg>
