<?xml version="1.0" encoding="UTF-8" standalone="no"?>
<!-- Created with Inkscape (http://www.inkscape.org/) -->

<svg
   width="23.9839mm"
   height="38.984764mm"
   viewBox="0 0 23.983901 38.984765"
   preserveAspectRatio="none"
   version="1.1"
   id="svg479"
   inkscape:export-filename="target_18.svg"
   inkscape:export-xdpi="96"
   inkscape:export-ydpi="96"
   sodipodi:docname="target_17.svg"
   inkscape:version="1.2 (1:1.2.1+202207142221+cd75a1ee6d)"
   xmlns:inkscape="http://www.inkscape.org/namespaces/inkscape"
   xmlns:sodipodi="http://sodipodi.sourceforge.net/DTD/sodipodi-0.dtd"
   xmlns="http://www.w3.org/2000/svg"
   xmlns:svg="http://www.w3.org/2000/svg">
  <sodipodi:namedview
     id="namedview481"
     pagecolor="#ffffff"
     bordercolor="#666666"
     borderopacity="1.0"
     inkscape:showpageshadow="2"
     inkscape:pageopacity="0.0"
     inkscape:pagecheckerboard="0"
     inkscape:deskcolor="#d1d1d1"
     inkscape:document-units="mm"
     showgrid="false"
     inkscape:zoom="6.7868394"
     inkscape:cx="45.455621"
     inkscape:cy="70.798787"
     inkscape:window-width="2560"
     inkscape:window-height="1376"
     inkscape:window-x="1920"
     inkscape:window-y="27"
     inkscape:window-maximized="1"
     inkscape:current-layer="layer1" />
  <defs
     id="defs476" />
  <g
     inkscape:label="Layer 1"
     inkscape:groupmode="layer"
     id="layer1"
     transform="translate(-8.26794,29.993336)">
    <path
       id="rect125223"
       style="fill:#000000;stroke-width:0.483536;stroke-linecap:round;stroke-linejoin:round;stroke-dashoffset:347.717;paint-order:stroke markers fill"
       d="m 19.472278,-10.390091 h 1.575146 V 5.7773063 h -1.575146 z" />
    <path
       id="ellipse125221"
       style="fill:#ffffff;stroke-width:0.345784;stroke-linecap:round;stroke-linejoin:round;stroke-dashoffset:347.717;paint-order:stroke markers fill"
       d="m 29.053059,-17.870133 a 8.7932051,8.9091405 0 0 1 -8.793206,8.9091371 8.7932051,8.9091405 0 0 1 -8.793204,-8.9091371 8.7932051,8.9091405 0 0 1 8.793204,-8.909142 8.7932051,8.9091405 0 0 1 8.793206,8.909142 z" />
    <path
       id="path124980"
       style="fill:#ffffff;fill-opacity:1;fill-rule:nonzero;stroke:none;stroke-width:0.147029"
       d="m 20.723095,-23.430602 c -1.064753,0.06866 -2.424885,0.445783 -2.734197,1.609692 -0.16667,0.347272 0.256723,0.715341 0.0398,0.991965 -0.216423,0.283589 0.351253,0.827831 -0.193537,0.694793 0.01,0.356725 0.419911,0.750466 0.190055,1.05719 -0.196025,0.286574 0.353242,0.82196 -0.191547,0.685838 0.128859,0.765989 0.585288,1.474364 1.336052,1.747903 1.373119,0.563746 3.114405,0.521705 4.321898,-0.404985 0.378119,-0.310953 0.718973,-0.918828 0.388567,-1.347844 0.257717,-0.301002 0.05274,-0.673847 0.03483,-0.944998 0.272146,-0.313441 -0.08209,-0.654096 0.02488,-0.929725 0.26319,-0.31344 -0.166671,-0.619468 0.01493,-0.88838 0.369661,-1.012413 -0.636831,-1.841189 -1.521679,-2.067762 -0.549466,-0.173636 -1.133013,-0.229856 -1.707355,-0.203985 z" />
    <path
       id="path124978"
       style="fill:#000000;fill-opacity:1;fill-rule:nonzero;stroke:none;stroke-width:0.147029"
       d="m 23.594758,-21.596974 c 0,-0.77594 -1.16182,-1.40496 -2.595338,-1.40496 -1.433518,0 -2.595387,0.62902 -2.595387,1.40496 0,0.775939 1.161869,1.40486 2.595387,1.40486 1.433518,0 2.595338,-0.628921 2.595338,-1.40486 m -5.172615,1.027438 c 0.150252,0.698574 1.246299,1.240876 2.577277,1.240876 1.337645,0 2.438418,-0.547725 2.579715,-1.251225 0.005,-0.05473 -0.01493,-0.10647 -0.06219,-0.121893 -0.05174,-0.01493 -0.08956,0.0099 -0.126869,0.05224 0,1.49e-4 0,0 0,1.49e-4 -0.394039,0.503445 -1.315356,0.857036 -2.389561,0.857036 -1.079828,0 -2.004676,-0.357223 -2.395532,-0.864797 -0.03483,-0.0398 -0.07164,-0.0597 -0.119903,-0.04478 -0.05174,0.01493 -0.07065,0.07363 -0.06219,0.131844 m 0,0.871364 c 0.150253,0.698425 1.2463,1.240926 2.577327,1.240926 1.337546,0 2.438369,-0.547874 2.579716,-1.251374 0.005,-0.05473 -0.01493,-0.10647 -0.06219,-0.121893 -0.05174,-0.01493 -0.08956,0.0099 -0.127366,0.05224 0,1.49e-4 0,0 0,2.98e-4 -0.39404,0.503495 -1.315406,0.856937 -2.389562,0.856937 -1.079827,0 -2.004676,-0.357223 -2.395531,-0.864847 -0.03483,-0.0398 -0.07115,-0.0602 -0.119406,-0.04478 -0.05174,0.01493 -0.07065,0.07363 -0.06219,0.132341 m 0,0.871216 c 0.150253,0.698624 1.2463,1.240926 2.577327,1.240926 1.337595,0 2.438369,-0.547725 2.579716,-1.251374 0.005,-0.05473 -0.01493,-0.105973 -0.06219,-0.121894 -0.05174,-0.01493 -0.08955,0.0099 -0.127366,0.05224 0,0 0,0 0,1.49e-4 -0.39404,0.503694 -1.315406,0.856937 -2.389611,0.856937 -1.079828,0 -2.004627,-0.357223 -2.395582,-0.864648 -0.03483,-0.0398 -0.07115,-0.0602 -0.119406,-0.04478 -0.05174,0.01493 -0.07065,0.07363 -0.06219,0.132342 m 0,0.871215 c 0.150252,0.698575 1.246349,1.240927 2.577377,1.240927 1.337545,0 2.438318,-0.547576 2.579665,-1.251225 0.005,-0.05473 -0.01493,-0.106471 -0.06219,-0.121894 -0.05224,-0.01493 -0.08956,0.01 -0.127367,0.05224 v 0 c -0.394039,0.503645 -1.315405,0.857136 -2.389611,0.857136 -1.079778,0 -2.004626,-0.357223 -2.395531,-0.864847 -0.03483,-0.0398 -0.07115,-0.0602 -0.119406,-0.04478 -0.05174,0.01493 -0.07065,0.07363 -0.06219,0.131844"
       inkscape:connector-curvature="0"
       inkscape:export-filename="C:\Users\Filip\OneDrive\Plocha\ss\path86.png"
       inkscape:export-xdpi="1360.8566"
       inkscape:export-ydpi="1360.8566" />
    <path
       id="path125092"
       style="fill:#ffffff;fill-opacity:1;fill-rule:nonzero;stroke:none;stroke-width:0.147029"
       d="m 17.251517,-20.206443 c -1.066743,0.06766 -2.420457,0.447275 -2.735789,1.609692 -0.187566,0.316425 0.393045,0.944948 -0.157217,0.816089 0.0099,0.358716 0.432349,0.760964 0.184581,1.066693 -0.08856,0.390557 0.224881,0.737531 -0.15871,0.754845 0.04975,0.376128 0.402,0.741162 0.147267,1.07321 -0.03483,0.956641 1.010125,1.498097 1.821488,1.690092 1.329435,0.293539 2.976043,0.176621 3.929798,-0.907635 0.243787,-0.298514 0.371651,-0.762008 0.123884,-1.068285 0.255727,-0.301002 0.05572,-0.674693 0.03483,-0.945048 0.272644,-0.310455 -0.08209,-0.65121 0.02488,-0.924898 0.261698,-0.314933 -0.157218,-0.622254 0.01492,-0.891564 0.374636,-1.009478 -0.633796,-1.844026 -1.518445,-2.069404 -0.550063,-0.173139 -1.133958,-0.229857 -1.708948,-0.203986 z" />
    <path
       id="path98"
       style="fill:#000000;fill-opacity:1;fill-rule:nonzero;stroke:none;stroke-width:0.147029"
       d="m 20.124075,-18.372766 c 0,-0.775889 -1.161819,-1.40496 -2.595287,-1.40496 -1.433568,0 -2.595437,0.629071 -2.595437,1.40496 0,0.77599 1.161869,1.404861 2.595437,1.404861 1.433468,0 2.595287,-0.628871 2.595287,-1.404861 m -5.172664,1.027439 c 0.150252,0.698574 1.246349,1.240926 2.577377,1.240926 1.337595,0 2.438368,-0.547725 2.579665,-1.251275 0.005,-0.05473 -0.01493,-0.10647 -0.06219,-0.121893 -0.05174,-0.01493 -0.08955,0.0099 -0.126868,0.05224 0,9.9e-5 0,0 0,9.9e-5 -0.39404,0.503545 -1.315406,0.857086 -2.389611,0.857086 -1.079828,0 -2.004677,-0.357223 -2.395532,-0.864798 -0.03483,-0.0398 -0.07164,-0.0597 -0.119903,-0.04478 -0.05174,0.01493 -0.07065,0.07363 -0.06219,0.131844 m 0,0.871315 c 0.150252,0.698425 1.246349,1.240926 2.577377,1.240926 1.337545,0 2.438368,-0.547874 2.579665,-1.251374 0.005,-0.05473 -0.01493,-0.10647 -0.06219,-0.121893 -0.05174,-0.01493 -0.08956,0.0099 -0.127367,0.05224 0,1.99e-4 0,0 0,2.98e-4 -0.394039,0.503495 -1.315405,0.856937 -2.389561,0.856937 -1.079827,0 -2.004626,-0.357223 -2.395531,-0.864798 -0.03483,-0.0398 -0.07115,-0.0602 -0.119904,-0.04478 -0.05174,0.01493 -0.07065,0.07363 -0.06169,0.132342 m 0,0.871215 c 0.150253,0.698575 1.246349,1.240926 2.577377,1.240926 1.337545,0 2.438319,-0.547774 2.579715,-1.251374 0.005,-0.05473 -0.01493,-0.105973 -0.06219,-0.121893 -0.05174,-0.01493 -0.08955,0.0099 -0.127367,0.05224 0,0 0,0 0,9.9e-5 -0.394039,0.503694 -1.315405,0.856937 -2.389611,0.856937 -1.079827,0 -2.004626,-0.357223 -2.395531,-0.864599 -0.03483,-0.0398 -0.07115,-0.0602 -0.119406,-0.04478 -0.05174,0.01493 -0.07065,0.07363 -0.06219,0.132342 m 0,0.871215 c 0.150253,0.698575 1.246349,1.240926 2.577377,1.240926 1.337545,0 2.438319,-0.547625 2.579665,-1.251225 0.005,-0.05473 -0.01492,-0.10647 -0.06219,-0.121893 -0.05174,-0.01493 -0.08956,0.0099 -0.127366,0.05224 v 0 c -0.39404,0.503694 -1.315406,0.857135 -2.389612,0.857135 -1.079827,0 -2.004626,-0.357222 -2.395531,-0.864847 -0.03483,-0.0398 -0.07115,-0.0602 -0.119406,-0.04478 -0.05174,0.01493 -0.07065,0.07363 -0.06219,0.131844"
       inkscape:connector-curvature="0"
       inkscape:export-filename="C:\Users\Filip\OneDrive\Plocha\ss\path86.png"
       inkscape:export-xdpi="1360.8566"
       inkscape:export-ydpi="1360.8566" />
    <path
       id="path125094"
       style="fill:#ffffff;fill-opacity:1;fill-rule:nonzero;stroke:none;stroke-width:0.147029"
       d="m 22.699064,-20.206443 c -1.066693,0.06816 -2.420507,0.447275 -2.735838,1.609692 -0.187567,0.316425 0.393044,0.944948 -0.157218,0.816089 0.0099,0.358716 0.432349,0.760964 0.184581,1.066693 -0.08856,0.390557 0.224882,0.737531 -0.15871,0.754845 0.04478,0.374138 0.401503,0.737729 0.150253,1.069827 -0.05025,0.92669 0.955048,1.470136 1.73845,1.67422 1.343217,0.318914 3.013259,0.215429 3.993681,-0.869076 0.253737,-0.299012 0.393044,-0.774049 0.139804,-1.087589 0.25722,-0.300505 0.05523,-0.673549 0.03483,-0.945048 0.269161,-0.308963 -0.07562,-0.650115 0.02488,-0.924898 0.260703,-0.315431 -0.155725,-0.622752 0.01493,-0.893206 0.374636,-1.008831 -0.634643,-1.842185 -1.518446,-2.067762 -0.550013,-0.173637 -1.134107,-0.229857 -1.708947,-0.203986 z" />
    <path
       id="path124976"
       style="fill:#000000;fill-opacity:1;fill-rule:nonzero;stroke:none;stroke-width:0.147029"
       d="m 25.571722,-18.372766 c 0,-0.775889 -1.16182,-1.40496 -2.595288,-1.40496 -1.433568,0 -2.595437,0.629071 -2.595437,1.40496 0,0.77599 1.161919,1.404861 2.595437,1.404861 1.433468,0 2.595288,-0.628871 2.595288,-1.404861 m -5.172615,1.027439 c 0.150252,0.698574 1.246299,1.240926 2.577327,1.240926 1.337645,0 2.438369,-0.547725 2.579715,-1.251275 0.005,-0.05473 -0.01493,-0.10647 -0.06219,-0.121893 -0.05174,-0.01493 -0.08956,0.0099 -0.126869,0.05224 0,9.9e-5 0,0 0,9.9e-5 -0.39404,0.503545 -1.315455,0.857086 -2.389661,0.857086 -1.079778,0 -2.004626,-0.357223 -2.395531,-0.864798 -0.03483,-0.0398 -0.07115,-0.0597 -0.119406,-0.04478 -0.05174,0.01493 -0.07065,0.07363 -0.06219,0.131844 m 0,0.871315 c 0.150252,0.698425 1.246299,1.240926 2.577327,1.240926 1.337595,0 2.438369,-0.547874 2.579715,-1.251374 0.005,-0.05473 -0.01492,-0.10647 -0.06219,-0.121893 -0.05174,-0.01493 -0.08955,0.0099 -0.127367,0.05224 0,1.99e-4 0,0 0,2.98e-4 -0.394039,0.503495 -1.315405,0.856937 -2.389561,0.856937 -1.079827,0 -2.004676,-0.357223 -2.395581,-0.864798 -0.03483,-0.0398 -0.07115,-0.0602 -0.119406,-0.04478 -0.05174,0.01493 -0.07065,0.07363 -0.06219,0.132342 m 0,0.871215 c 0.150253,0.698575 1.2463,1.240926 2.577327,1.240926 1.337546,0 2.438369,-0.547774 2.579716,-1.251374 0.005,-0.05473 -0.01493,-0.105973 -0.06219,-0.121893 -0.05174,-0.01493 -0.08955,0.0099 -0.127366,0.05224 0,0 0,0 0,9.9e-5 -0.39404,0.503694 -1.315456,0.856937 -2.389611,0.856937 -1.079828,0 -2.004627,-0.357223 -2.395532,-0.864599 -0.03483,-0.0398 -0.07115,-0.0602 -0.119903,-0.04478 -0.05174,0.01493 -0.07065,0.07363 -0.06219,0.132342 m 0,0.871215 c 0.150253,0.698575 1.246349,1.240926 2.577377,1.240926 1.337545,0 2.438319,-0.547625 2.579665,-1.251225 0.005,-0.05473 -0.01492,-0.10647 -0.06219,-0.121893 -0.05174,-0.01493 -0.08956,0.0099 -0.127366,0.05224 v 0 c -0.39404,0.503694 -1.315406,0.857135 -2.389562,0.857135 -1.079827,0 -2.004676,-0.357222 -2.395531,-0.864847 -0.03483,-0.0398 -0.07164,-0.0602 -0.119406,-0.04478 -0.05174,0.01493 -0.07065,0.07363 -0.06219,0.131844"
       inkscape:connector-curvature="0"
       inkscape:export-filename="C:\Users\Filip\OneDrive\Plocha\ss\path86.png"
       inkscape:export-xdpi="1360.8566"
       inkscape:export-ydpi="1360.8566" />
    <path
       style="fill:#000000;stroke-width:0.00771514"
       d="m 17.13236,-21.00058 -0.52867,-0.45146 -0.0423,0.0495 c -0.0232,0.0272 -0.089,0.0953 -0.14525,0.15246 -0.70231,0.69945 -1.52291,1.04335 -2.4179,1.01345 -0.5034,-0.018 -0.97933,-0.12746 -1.368,-0.31779 -0.2628,-0.1288 -0.58731,-0.33388 -0.96421,-0.60969 -0.24545,-0.17947 -0.62437,-0.48037 -0.60694,-0.48176 0.002,-2.1e-4 0.11709,0.0473 0.25371,0.10583 0.34382,0.1466 0.63273,0.26068 0.75992,0.29962 0.1851,0.0567 0.37169,0.0867 0.58265,0.0939 0.13691,0.005 0.47341,-0.0225 0.63689,-0.05 0.48803,-0.084 0.93772,-0.28914 1.39332,-0.63501 0.21055,-0.15988 0.49021,-0.41968 0.63877,-0.59336 l 0.059,-0.0689 -0.52281,-0.44643 c -0.4526,-0.38651 -0.52138,-0.4472 -0.51214,-0.45233 0.009,-0.007 1.27397,-0.24404 2.68607,-0.50701 0.13939,-0.0259 0.35881,-0.0669 0.48737,-0.0912 0.12858,-0.0239 0.23599,-0.0428 0.23865,-0.0417 0.002,6.1e-4 0.002,0.0853 -6.3e-4,0.1869 -0.004,0.10156 -0.0113,0.42788 -0.0203,0.72508 -0.007,0.29722 -0.0227,0.81909 -0.0322,1.15973 -0.009,0.34064 -0.0225,0.79257 -0.0277,1.00425 -0.007,0.21167 -0.0113,0.38993 -0.0158,0.39603 -0.005,0.009 -0.0779,-0.0516 -0.53286,-0.44004 z"
       id="path124578-7" />
    <path
       style="fill:#000000;fill-opacity:1;stroke:none;stroke-width:0.00689292"
       d="m 24.79699,-20.0028 c -0.005,-0.002 -0.005,-0.0113 0,-0.0113 0,-0.005 0.0232,-0.10517 0.0471,-0.2256 0.0243,-0.12025 0.0475,-0.23466 0.0516,-0.25439 0.005,-0.0203 0.0455,-0.22361 0.0914,-0.45217 0.0462,-0.22911 0.0964,-0.47796 0.11169,-0.55394 0.0158,-0.0754 0.0441,-0.21708 0.0633,-0.31459 0.0203,-0.0971 0.0392,-0.19275 0.0435,-0.21235 0.005,-0.0203 0.0259,-0.12633 0.0475,-0.23671 0.0225,-0.11012 0.0703,-0.35102 0.10764,-0.53502 0.0376,-0.18398 0.0667,-0.33533 0.0653,-0.33634 -0.005,-0.002 -0.24789,0.0158 -0.76426,0.0504 -0.75686,0.0531 -1.11846,0.0775 -1.12125,0.0754 0,-0.001 0.0358,-0.0601 0.084,-0.12994 0.0482,-0.0702 0.13962,-0.20582 0.20402,-0.30093 0.0644,-0.0957 0.1502,-0.22204 0.19051,-0.28124 0.0405,-0.0592 0.13308,-0.19681 0.20649,-0.30549 0.0732,-0.10876 0.17407,-0.25847 0.22407,-0.33231 0.05,-0.0739 0.13939,-0.20627 0.19838,-0.29335 0.14953,-0.22158 0.2914,-0.43091 0.38681,-0.57183 0.0446,-0.0658 0.13308,-0.19682 0.19636,-0.29032 0.0633,-0.0941 0.21055,-0.31208 0.32733,-0.48505 0.11665,-0.17294 0.24881,-0.3682 0.29355,-0.43395 0.045,-0.0662 0.1502,-0.22204 0.23424,-0.34747 0.084,-0.12543 0.15628,-0.23014 0.16056,-0.23367 0.005,-0.005 0.007,3.1e-4 0.005,0.0113 -0.005,0.0158 -0.0435,0.20897 -0.30261,1.49096 -0.0736,0.36363 -0.2128,1.05105 -0.29761,1.46968 -0.018,0.084 -0.0299,0.15335 -0.0284,0.1547 0,0.001 0.0754,-0.004 0.16439,-0.0113 0.0889,-0.0113 0.46161,-0.0353 0.82823,-0.0597 0.69238,-0.0505 0.81036,-0.0581 0.8669,-0.0633 0.018,-0.002 0.034,-0.001 0.034,7.9e-4 0,0.002 -0.032,0.0504 -0.0705,0.10606 -0.0806,0.11732 -0.20875,0.307 -0.40574,0.59949 -0.0752,0.11169 -0.1824,0.2711 -0.23807,0.35352 -0.0556,0.0826 -0.152,0.22519 -0.21415,0.31715 -0.30028,0.44509 -0.45814,0.67896 -0.64277,0.95203 -0.0513,0.0754 -0.1547,0.22962 -0.2301,0.3414 -0.0754,0.11169 -0.17181,0.25493 -0.21415,0.31763 -0.0426,0.0628 -0.18893,0.27921 -0.32539,0.48201 -0.35352,0.52491 -0.37098,0.55035 -0.37559,0.54684 z"
       id="path160049"
       inkscape:connector-curvature="0" />
  </g>
</svg>
