<?xml version="1.0" encoding="UTF-8" standalone="no"?>
<!-- Created with Inkscape (http://www.inkscape.org/) -->

<svg
   width="120.30341mm"
   height="120.30318mm"
   viewBox="0 0 120.30341 120.30319"
   version="1.1"
   id="svg21136"
   inkscape:version="1.1.2 (b8e25be833, 2022-02-05)"
   sodipodi:docname="10-game22a_progress.svg"
   xmlns:inkscape="http://www.inkscape.org/namespaces/inkscape"
   xmlns:sodipodi="http://sodipodi.sourceforge.net/DTD/sodipodi-0.dtd"
   xmlns:xlink="http://www.w3.org/1999/xlink"
   xmlns="http://www.w3.org/2000/svg"
   xmlns:svg="http://www.w3.org/2000/svg">
  <sodipodi:namedview
     id="namedview21138"
     pagecolor="#ffffff"
     bordercolor="#666666"
     borderopacity="1.0"
     inkscape:pageshadow="2"
     inkscape:pageopacity="0.0"
     inkscape:pagecheckerboard="0"
     inkscape:document-units="mm"
     showgrid="false"
     inkscape:zoom="0.64"
     inkscape:cx="777.34375"
     inkscape:cy="420.3125"
     inkscape:window-width="1920"
     inkscape:window-height="1017"
     inkscape:window-x="-8"
     inkscape:window-y="-8"
     inkscape:window-maximized="1"
     inkscape:current-layer="layer1"
     fit-margin-top="0"
     fit-margin-left="0"
     fit-margin-right="0"
     fit-margin-bottom="0"
     inkscape:showpageshadow="2"
     inkscape:deskcolor="#d1d1d1" />
  <defs
     id="defs21133">
    <linearGradient
       inkscape:collect="always"
       id="linearGradient11469">
      <stop
         style="stop-color:#ffeeaa;stop-opacity:1;"
         offset="0"
         id="stop11465" />
      <stop
         style="stop-color:#ffeeaa;stop-opacity:0;"
         offset="1"
         id="stop11467" />
    </linearGradient>
    <radialGradient
       inkscape:collect="always"
       xlink:href="#linearGradient11469"
       id="radialGradient94452-2"
       gradientUnits="userSpaceOnUse"
       gradientTransform="matrix(-0.04159051,0.18110292,-0.18110334,-0.0415906,824.50986,-17.22455)"
       cx="1203.967"
       cy="745.15021"
       fx="1203.967"
       fy="745.15021"
       r="322.32761" />
  </defs>
  <g
     inkscape:label="Layer 1"
     inkscape:groupmode="layer"
     id="layer1"
     transform="translate(-579.33538,-109.67461)">
    <path
       id="path94360-6"
       style="fill:url(#radialGradient94452-2);fill-opacity:1;stroke-width:0.0131282;stroke-linecap:round;stroke-linejoin:round;stroke-dashoffset:347.717;paint-order:stroke markers fill"
       inkscape:transform-center-x="0.0063070872"
       inkscape:transform-center-y="-0.079974571"
       d="m 699.29536,176.9892 0.34347,-10.34273 -60.15153,3.17945 z m -59.80806,-7.16328 48.21366,36.10778 5.46885,-8.78538 z m 0,0 55.37694,-23.70061 -4.8744,-9.12846 -50.50313,32.82933 z m 0,0 36.10771,-48.21382 -8.78536,-5.46881 -27.32244,53.68262 z m 32.82924,50.5033 -32.82938,-50.50323 23.70053,55.37712 z m -29.65001,9.64857 -3.17949,-60.15164 -7.1632,59.80808 z m -3.17949,-60.15164 -36.10769,48.2136 8.78538,5.46885 z m 0,0 -23.70059,-55.37694 -9.12846,4.8744 32.8293,50.50312 z m 0,0 7.16328,-59.80806 -10.3427,-0.34348 z m 0,0 -48.21381,-36.10762 -5.4688,8.78529 53.68259,27.3224 z m 0,0 v 0 l -55.37701,23.70057 4.8744,9.12844 z m 0,0 -59.80815,-7.16333 -0.34348,10.34272 z" />
  </g>
</svg>
