<?xml version="1.0" encoding="UTF-8" standalone="no"?>
<!-- Created with Inkscape (http://www.inkscape.org/) -->

<svg
   width="6.7144871mm"
   height="6.7017469mm"
   viewBox="0 0 6.7144871 6.7017469"
   version="1.1"
   id="svg1487"
   inkscape:version="1.2 (dc2aedaf03, 2022-05-15)"
   sodipodi:docname="fb.svg"
   xmlns:inkscape="http://www.inkscape.org/namespaces/inkscape"
   xmlns:sodipodi="http://sodipodi.sourceforge.net/DTD/sodipodi-0.dtd"
   xmlns="http://www.w3.org/2000/svg"
   xmlns:svg="http://www.w3.org/2000/svg">
  <sodipodi:namedview
     id="namedview1489"
     pagecolor="#ffffff"
     bordercolor="#000000"
     borderopacity="0.25"
     inkscape:showpageshadow="2"
     inkscape:pageopacity="0.0"
     inkscape:pagecheckerboard="0"
     inkscape:deskcolor="#d1d1d1"
     inkscape:document-units="mm"
     showgrid="false"
     inkscape:zoom="0.73851712"
     inkscape:cx="-39.94491"
     inkscape:cy="71.765432"
     inkscape:window-width="1920"
     inkscape:window-height="1009"
     inkscape:window-x="-8"
     inkscape:window-y="-8"
     inkscape:window-maximized="1"
     inkscape:current-layer="layer1" />
  <defs
     id="defs1484" />
  <g
     inkscape:label="Vrstva 1"
     inkscape:groupmode="layer"
     id="layer1"
     transform="translate(-115.58606,-129.56469)">
    <path
       id="path46738"
       style="fill:#000000;stroke-width:0.022168"
       d="m 118.94826,129.56473 c -0.24747,-2.5e-4 -0.49482,0.0176 -0.66032,0.0534 -0.9155,0.19842 -1.69235,0.73269 -2.18576,1.50323 -0.18459,0.28828 -0.37641,0.76784 -0.44812,1.12039 -0.22696,1.11581 0.12166,2.25811 0.935,3.0636 0.50624,0.50136 1.12941,0.81585 1.85635,0.93682 0.26466,0.044 0.91371,0.0255 1.1904,-0.034 1.34924,-0.29013 2.38211,-1.35952 2.62436,-2.71705 0.0531,-0.29728 0.0539,-0.85219 0.002,-1.14166 -0.24874,-1.38143 -1.26546,-2.42781 -2.65275,-2.73017 -0.16591,-0.0362 -0.4135,-0.0544 -0.66097,-0.0546 z m 0.47103,1.16604 c 0.11827,0 0.25741,0.005 0.41924,0.0149 l 0.23623,0.0145 v 0.35131 0.35135 l -0.24939,2.6e-4 c -0.21571,2.5e-4 -0.26466,0.007 -0.36244,0.0529 -0.0637,0.0297 -0.13628,0.0852 -0.16626,0.12725 -0.0504,0.0707 -0.0536,0.0945 -0.0602,0.457 l -0.007,0.3824 h 0.40352 0.40357 l -0.0134,0.11322 c -0.007,0.0623 -0.0353,0.25155 -0.0619,0.42063 l -0.0485,0.30745 -0.33469,0.006 -0.33468,0.006 -0.006,1.05853 -0.006,1.05852 h -0.45401 -0.45401 l -0.006,-1.05852 -0.006,-1.05853 -0.38239,-0.006 -0.3824,-0.006 v -0.42063 -0.42067 h 0.38794 0.38794 v -0.41427 c 0,-0.30853 0.009,-0.45136 0.0361,-0.55974 0.0937,-0.37754 0.318,-0.63788 0.63425,-0.73631 0.0892,-0.0278 0.22831,-0.0415 0.42544,-0.0414 z" />
  </g>
</svg>
