<?xml version="1.0" encoding="UTF-8" standalone="no"?>
<!-- Created with Inkscape (http://www.inkscape.org/) -->

<svg
   width="264.14859mm"
   height="29.390745mm"
   viewBox="75 32 264.14858 29.390744"
   version="1.1"
   id="svg21136"
   inkscape:version="1.2 (56b05e47e7, 2022-06-09, custom)"
   sodipodi:docname="all.svg"
   xmlns:inkscape="http://www.inkscape.org/namespaces/inkscape"
   xmlns:sodipodi="http://sodipodi.sourceforge.net/DTD/sodipodi-0.dtd"
   xmlns="http://www.w3.org/2000/svg"
   xmlns:svg="http://www.w3.org/2000/svg">
  <sodipodi:namedview
     id="namedview21138"
     pagecolor="#ffffff"
     bordercolor="#666666"
     borderopacity="1.0"
     inkscape:pageshadow="2"
     inkscape:pageopacity="0.0"
     inkscape:pagecheckerboard="0"
     inkscape:document-units="mm"
     showgrid="false"
     inkscape:zoom="1.8101934"
     inkscape:cx="105.51359"
     inkscape:cy="243.8966"
     inkscape:window-width="1280"
     inkscape:window-height="1376"
     inkscape:window-x="3200"
     inkscape:window-y="27"
     inkscape:window-maximized="0"
     inkscape:current-layer="layer1"
     fit-margin-top="0"
     fit-margin-left="0"
     fit-margin-right="0"
     fit-margin-bottom="0"
     inkscape:showpageshadow="2"
     inkscape:deskcolor="#d1d1d1" />
  <defs
     id="defs21133" />
  <g
     inkscape:label="Layer 1"
     inkscape:groupmode="layer"
     id="layer1"
     transform="translate(-94.897147,-17.633401)">
    <g
       id="g71543"
       transform="matrix(0.4911428,0,0,0.4911428,-649.73586,-334.48093)"
       style="fill:#cccccc"
       inkscape:export-filename="../cd367369/mraky.svg"
       inkscape:export-xdpi="96"
       inkscape:export-ydpi="96">
      <path
         style="fill:#cccccc;stroke-width:0.0845278"
         d="m 1839.4016,796.28565 c -0.013,0 -0.028,0 -0.041,0 -1.2623,-0.003 -2.5611,0.48832 -3.3902,1.46307 -0.5951,0.76607 -0.8078,1.78625 -0.6807,2.73804 -0.2573,0.007 -0.5249,0.10625 -0.6771,0.32303 -0.058,0.0445 -0.117,0.15351 -0.1732,0.15774 -0.5127,-0.61399 -1.3287,-1.02174 -2.1386,-0.90024 -0.4913,0.082 -0.9471,0.34687 -1.2846,0.70953 -0.5027,0.57891 -0.6553,1.36184 -0.7339,2.1023 -0.025,0.11374 0,0.24863 -0.073,0.34525 -0.1368,0.12108 -0.3709,0.0753 -0.4718,0.24869 -0.1087,0.16301 -0.1019,0.37208 -0.1028,0.55978 0.01,0.13771 0.122,0.24942 0.2596,0.25815 0.2281,0.0303 0.4595,0.007 0.6889,0.0201 3.9065,0.0347 7.8134,0.0225 11.72,0.0164 1.11,-0.008 2.2214,-0.007 3.3299,-0.0644 0.2499,-0.0347 0.5465,-0.16036 0.6014,-0.43426 0.016,-0.14015 -0.082,-0.25963 -0.1728,-0.35144 -0.011,-0.14195 0.1108,-0.25202 0.1198,-0.39362 0.2022,-0.78815 -0.4464,-1.65524 -1.2549,-1.70215 -0.3206,-0.0295 -0.6325,0.0647 -0.9418,0.13039 -0.073,-0.0114 -0.084,-0.12108 -0.1307,-0.17172 -0.1229,-0.2359 -0.3187,-0.4713 -0.6013,-0.49958 -0.1004,-0.0206 -0.2209,0 -0.3098,-0.0331 0.145,-0.37262 0.2216,-0.77917 0.2248,-1.18131 0,-0.99566 -0.5389,-1.95234 -1.3342,-2.53871 -0.7024,-0.50551 -1.5636,-0.80383 -2.4317,-0.80248 z"
         id="path71487"
         inkscape:connector-curvature="0" />
      <path
         style="fill:#cccccc;stroke-width:0.154997"
         d="m 1871.0648,805.32014 c -3.9428,0 -6.8836,2.00042 -7.8555,5.34312 -0.3462,1.19122 -0.2312,3.03649 0.2476,3.97484 0.3056,0.59932 0.3088,0.63755 0.044,0.52755 -1.8739,-0.77761 -4.0921,-0.0888 -4.7768,1.48411 -0.1632,0.37548 -0.3071,0.70039 -0.3192,0.72206 -0.018,0.0238 -0.2598,-0.0798 -0.5507,-0.22589 -0.3128,-0.15696 -0.8644,-0.26091 -1.3497,-0.2546 -0.6686,0.009 -0.9257,0.0955 -1.3852,0.46735 -0.6801,0.55041 -0.7307,0.6721 -0.4436,1.0648 0.2179,0.29764 0.5712,0.30525 18.253,0.38113 19.4719,0.084 20.701,0.0732 21.0062,-0.18025 0.2767,-0.22954 0.2541,-0.99133 -0.044,-1.44491 -0.3109,-0.47468 -1.1257,-0.7475 -1.8349,-0.61441 -0.4907,0.0921 -0.5657,0.0607 -0.6998,-0.29168 -0.1595,-0.42069 -0.5853,-0.71833 -1.0461,-0.73201 -0.1613,-0.009 -0.5583,-0.39695 -0.9265,-0.91361 -0.5191,-0.72823 -0.8454,-1.00379 -1.6685,-1.40897 -0.9112,-0.44851 -1.1646,-0.50314 -2.313,-0.49786 -0.9972,0.005 -1.5016,0.0917 -2.223,0.38284 l -0.9329,0.37687 -0.1884,-0.73486 c -0.399,-1.55641 -1.6484,-2.84709 -3.1477,-3.25073 -0.423,-0.11388 -0.5836,-0.24089 -0.5836,-0.46119 0,-0.16742 -0.1467,-0.45116 -0.327,-0.63106 -0.2613,-0.26121 -0.4443,-0.30826 -0.9104,-0.234 -0.547,0.0877 -0.608,0.0552 -0.9852,-0.51455 -0.8256,-1.24721 -3.1727,-2.33451 -5.0397,-2.33451 z"
         id="path71489"
         inkscape:connector-curvature="0" />
      <path
         style="fill:#cccccc;stroke-width:0.0845278"
         d="m 1719.3147,815.41032 c -1.4487,0 -2.5956,0.22042 -3.4907,0.66321 -1.913,0.9463 -3.1666,2.88393 -3.1991,4.94445 -0.011,0.69895 -0.032,0.81642 -0.1398,0.76888 -0.07,-0.0308 -0.3741,-0.072 -0.6762,-0.0914 -0.4986,-0.032 -0.5864,-0.013 -0.9473,0.22009 -0.5291,0.33977 -0.8282,0.82131 -0.8402,1.35262 l -0.01,0.41103 -1.0247,0.17889 c -1.1032,0.19256 -3.4963,0.55047 -4.3212,0.64616 -0.5408,0.0627 -0.6591,0.10203 -0.5991,0.19897 0.021,0.0334 6.508,0.0593 14.4164,0.0575 15.6084,-0.005 14.5372,0.0292 14.5405,-0.44051 0,-0.23931 -0.4615,-0.69921 -0.7654,-0.75996 -0.2123,-0.0425 -0.2366,-0.0812 -0.2255,-0.35915 0.025,-0.63066 -0.3378,-1.07497 -1.0434,-1.27733 -0.5401,-0.1548 -1.4051,0.16087 -2.0217,0.73803 -0.1627,0.15222 -0.32,0.27721 -0.3496,0.2776 -0.03,0 -0.1122,-0.0887 -0.1838,-0.19793 -0.1754,-0.2676 -0.6974,-0.50612 -0.9828,-0.44905 -0.2,0.0401 -0.2417,0.01 -0.3329,-0.24247 -0.1945,-0.53779 -0.8607,-0.78594 -1.479,-0.55091 l -0.2116,0.0805 0.047,-0.5665 c 0.1237,-1.48605 -0.5526,-3.27966 -1.5935,-4.22618 -0.5314,-0.48324 -0.9931,-0.741 -1.8557,-1.03627 -0.689,-0.23577 -0.9471,-0.27805 -1.9759,-0.32377 -0.2535,-0.0114 -0.4986,-0.0167 -0.7357,-0.0164 z"
         id="path71491"
         inkscape:connector-curvature="0" />
      <path
         style="fill:#cccccc;stroke-width:0.15834"
         d="m 1792.9178,817.84947 c -2.1018,0.006 -4.3633,0.69199 -6.3664,1.97295 -0.6963,0.44521 -2.0746,1.79347 -2.0746,2.02929 0,0.0687 -0.6234,0.11913 -1.3856,0.11145 -1.51,-0.015 -2.533,0.24697 -3.5219,0.9017 -0.5842,0.38658 -1.2678,1.39163 -1.2678,1.8639 0,0.3122 0.086,0.31795 -0.9122,-0.0611 -1.7463,-0.66374 -4.5451,-0.28177 -6.0513,0.82576 -0.6725,0.49464 -0.7778,0.52075 -2.1368,0.53087 -2.0772,0.015 -3.7253,0.7181 -3.7253,1.58833 0,0.19903 0.1592,0.47412 0.3548,0.61066 0.3179,0.22287 2.3121,0.24395 19.3838,0.20667 l 19.0294,-0.0416 0.4086,-0.38382 c 0.892,-0.8382 0.2285,-2.26015 -1.1583,-2.48194 -0.4812,-0.077 -0.65,-0.17777 -0.65,-0.38826 0,-0.69949 -1.3517,-1.7336 -2.2658,-1.7336 -0.2973,0 -0.4131,-0.12457 -0.5549,-0.59728 -0.6386,-2.13141 -2.8687,-4.21041 -5.0729,-4.72922 -0.6496,-0.15286 -1.3324,-0.22679 -2.0328,-0.22531 z"
         id="path71493"
         inkscape:connector-curvature="0" />
      <path
         style="fill:#cccccc;stroke-width:0.0845278"
         d="m 1778.3418,802.67506 c -2.0886,-0.003 -3.8142,1.6265 -3.8659,3.65405 -0.01,0.31361 -0.022,0.57023 -0.031,0.57055 -0.01,0 -0.1612,-0.0852 -0.3381,-0.18989 -0.2524,-0.14912 -0.4513,-0.19018 -0.9223,-0.19018 h -0.6005 l -0.1352,-0.38037 c -0.2594,-0.72964 -1.1012,-1.055 -2.1316,-0.82386 l -0.5553,0.12452 -0.5105,-0.5316 c -0.5087,-0.52967 -0.949,-0.79775 -1.8482,-1.12515 -0.6753,-0.24585 -1.1567,-0.29215 -1.9104,-0.18367 -2.2459,0.32311 -3.7767,2.28343 -3.6557,4.68125 l 0.031,0.6151 -0.342,-0.0782 c -0.4688,-0.10724 -1.1494,0.18023 -1.4404,0.60841 -0.4482,0.65973 -0.1864,1.65224 0.5366,2.03401 0.3096,0.16351 0.5877,0.16605 18.2343,0.16711 15.7743,0 17.9003,-0.0148 17.7558,-0.12306 -0.09,-0.0683 -0.3037,-0.1242 -0.4744,-0.1242 -0.5654,0 -3.2855,-0.61182 -4.28,-0.96271 -0.5182,-0.18285 -1.6003,-0.72136 -2.247,-1.11829 -0.6764,-0.41508 -1.2768,-0.53038 -1.8084,-0.34726 l -0.3375,0.1162 -0.175,-0.30398 c -0.2582,-0.4487 -0.8296,-0.70982 -1.4545,-0.66458 -0.483,0.035 -0.4881,0.0326 -0.6477,-0.26159 -0.1074,-0.19836 -0.3151,-0.37772 -0.6257,-0.54054 -0.3933,-0.20619 -0.5299,-0.23633 -0.8875,-0.19574 l -0.4226,0.0479 -0.011,-0.63395 c -0.015,-0.87368 -0.3489,-1.55352 -1.1656,-2.36966 -0.9871,-0.98665 -2.2081,-1.46748 -3.7344,-1.47076 z"
         id="path71495"
         inkscape:connector-curvature="0" />
      <path
         style="fill:#cccccc;stroke-width:0.0845278"
         d="m 1677.6052,805.62799 c -1.0985,0 -2.2701,0.50675 -3.3316,1.48944 -0.7182,0.66501 -0.9189,1.12035 -0.8652,1.96366 0.033,0.51985 0.055,0.56721 0.4323,0.95065 0.2186,0.2219 0.3974,0.44839 0.3974,0.50329 0,0.16002 -0.2495,0.25339 -1.405,0.52565 -0.5987,0.14097 -1.2977,0.31205 -1.5534,0.37999 -0.2557,0.068 -0.8263,0.16531 -1.268,0.2164 -1.0283,0.1188 -1.1834,0.15206 -1.1834,0.25321 0,0.054 4.947,0.083 14.1233,0.083 10.6654,0 14.1151,-0.0241 14.0905,-0.0979 -0.037,-0.11295 -0.076,-0.11914 -1.2071,-0.19333 -4.6018,-0.30183 -8.5972,-0.62052 -9.1415,-0.72922 -0.3685,-0.0735 -0.5104,-0.16369 -0.9284,-0.58975 -0.5768,-0.58812 -0.8777,-0.71252 -1.5269,-0.6314 -0.2931,0.0367 -0.4486,0.0279 -0.4171,-0.023 0.066,-0.10673 -0.2669,-0.59143 -0.55,-0.80105 -0.1225,-0.0908 -0.3982,-0.18476 -0.6127,-0.20897 -0.3268,-0.0367 -0.4175,-0.0887 -0.5608,-0.32041 -0.094,-0.15206 -0.2302,-0.29927 -0.3028,-0.32711 -0.2203,-0.0846 -0.67,-0.0567 -0.7746,0.0478 -0.075,0.0748 -0.1369,0.01 -0.2595,-0.27475 -0.2442,-0.56605 -0.9308,-1.42531 -1.3527,-1.69285 -0.5525,-0.35037 -1.1653,-0.52256 -1.8028,-0.5233 z"
         id="path71497"
         inkscape:connector-curvature="0" />
      <path
         style="fill:#cccccc;stroke-width:0.0507642"
         d="m 1829.7139,831.56648 c -0.3846,0.0693 -0.7008,0.31515 -1.0293,0.50953 -0.6415,0.43559 -1.1857,1.05093 -1.4353,1.79388 -0.1026,0.35115 -0.095,0.72332 -0.054,1.08355 -0.4469,0.0193 -0.918,0.0996 -1.2795,0.38206 -0.5644,0.39991 -0.8999,1.10913 -0.8261,1.80001 0,0.11163 0.011,0.22368 -0.01,0.33396 -0.019,-0.005 -0.039,-0.0101 -0.059,-0.0148 -0.084,-0.0401 -0.1686,-0.0859 -0.2637,-0.0697 -0.1607,-0.018 -0.3492,-0.0732 -0.4888,0.0404 -0.031,0.0323 -0.07,0.0662 -0.1176,0.0525 -0.2916,0.0196 -0.5465,0.23665 -0.6491,0.50475 -0.1791,-0.0632 -0.373,-0.17537 -0.5664,-0.10089 -0.04,0.013 -0.073,0.0355 -0.1037,0.0624 -0.091,0.008 -0.1706,0.0236 -0.22,0.0489 -0.039,0.0201 -0.076,0.0425 -0.1111,0.0665 -0.038,0 -0.074,0.0101 -0.1071,0.0336 -0.1417,0.0686 -0.2314,0.23132 -0.2273,0.38711 -0.031,0.11816 0,0.21857 0.1111,0.25987 0,0 0.011,0 0.024,0 0.09,0.0574 0.2127,0.0582 0.3056,0.005 1.2208,0.0148 5.7126,0.0259 10.9995,0.0254 10.6467,0 11.2442,-0.005 11.3736,-0.0903 0.1364,-0.0893 0.1648,-0.16084 0.081,-0.27186 0.018,-0.0869 0.01,-0.1822 -0.048,-0.25617 -0.045,-0.0746 -0.1141,-0.1351 -0.1956,-0.16645 -0.01,-0.14065 -0.093,-0.28009 -0.2255,-0.3338 -0.1118,-0.16626 -0.3349,-0.18484 -0.5173,-0.16695 -0.069,0 -0.1481,0.01 -0.2116,0 0.043,-0.15595 0.023,-0.33092 -0.072,-0.46421 -0.2847,-0.59256 -0.7799,-1.10594 -1.4114,-1.31977 -0.4993,-0.1777 -1.0404,-0.15449 -1.5583,-0.0919 -0.093,0.0101 -0.1867,0.0183 -0.2801,0.0262 -0.1853,-0.41505 -0.6193,-0.67463 -1.0592,-0.73316 -0.018,-0.0209 0.018,-0.0546 0.01,-0.081 0.031,-0.4255 -0.2906,-0.83079 -0.6999,-0.92953 -0.1725,-0.0557 -0.3538,-0.0766 -0.534,-0.0882 -0.065,-0.37606 -0.1852,-0.77523 -0.4885,-1.02907 -0.6073,-0.52369 -1.5922,-0.53814 -2.2067,-0.0185 -0.454,0.35139 -0.7915,0.88788 -0.809,1.47216 -0.01,0.19656 0.013,0.39442 0.061,0.58484 -0.2955,0.0657 -0.583,0.16182 -0.8673,0.26469 -0.3111,-0.5411 -0.8722,-0.93991 -1.4935,-1.02627 0.08,-0.48649 0.047,-1.02073 -0.2298,-1.4433 -0.3151,-0.50543 -0.8325,-0.90588 -1.429,-1.00018 -0.3589,-0.0301 -0.7195,-0.0279 -1.0791,-0.0427 z"
         id="path71499"
         inkscape:connector-curvature="0" />
      <path
         style="fill:#cccccc;stroke-width:0.0845278"
         d="m 1752.1169,796.331 c -1.9087,0.007 -3.8704,0.95602 -4.7308,2.29691 -0.2035,0.31713 -0.3083,0.41095 -0.4096,0.36679 -0.8236,-0.35894 -1.8421,-0.16232 -2.4633,0.47556 -0.3297,0.33845 -0.4234,0.39018 -0.6473,0.35732 -0.5272,-0.0772 -1.1965,0.44447 -1.0936,0.85246 0.025,0.10022 0.1521,0.24791 0.2819,0.32819 0.2198,0.13592 0.8033,0.14454 8.5527,0.12679 9.4727,-0.022 8.6105,0.0584 8.3477,-0.77544 -0.2212,-0.70163 -0.7313,-0.94808 -1.5973,-0.77145 -0.3831,0.0781 -0.414,0.0699 -0.6763,-0.17894 -0.3579,-0.33967 -0.6925,-0.50318 -1.1789,-0.5761 -0.3764,-0.0565 -0.4054,-0.0808 -0.6221,-0.52382 -0.2943,-0.60156 -0.9102,-1.20568 -1.5308,-1.50154 -0.8645,-0.41222 -1.0964,-0.46379 -2.1415,-0.47633 -0.03,0 -0.06,0 -0.091,0 z"
         id="path71501"
         inkscape:connector-curvature="0" />
      <path
         style="fill:#cccccc;stroke-width:0.0845278"
         d="m 1754.5664,833.87536 c -0.013,0 -0.028,0 -0.041,0 -1.2623,-0.003 -2.5611,0.48832 -3.3902,1.46307 -0.5951,0.76607 -0.8078,1.78625 -0.6807,2.73804 -0.2573,0.007 -0.5249,0.10625 -0.6771,0.32303 -0.058,0.0445 -0.117,0.15351 -0.1732,0.15774 -0.5127,-0.61399 -1.3287,-1.02174 -2.1386,-0.90024 -0.4913,0.082 -0.9471,0.34687 -1.2846,0.70953 -0.5027,0.57891 -0.6553,1.36184 -0.7339,2.1023 -0.025,0.11374 0,0.24863 -0.073,0.34525 -0.1368,0.12108 -0.3709,0.0753 -0.4718,0.24869 -0.1087,0.16301 -0.1019,0.37208 -0.1028,0.55978 0.01,0.13771 0.122,0.24942 0.2596,0.25815 0.2281,0.0303 0.4595,0.007 0.6889,0.0201 3.9065,0.0347 7.8134,0.0225 11.72,0.0164 1.11,-0.008 2.2214,-0.007 3.3299,-0.0644 0.2499,-0.0347 0.5465,-0.16036 0.6014,-0.43426 0.016,-0.14015 -0.082,-0.25963 -0.1728,-0.35144 -0.011,-0.14195 0.1108,-0.25202 0.1198,-0.39362 0.2022,-0.78815 -0.4464,-1.65524 -1.2549,-1.70215 -0.3206,-0.0295 -0.6325,0.0647 -0.9418,0.13039 -0.073,-0.0114 -0.084,-0.12108 -0.1307,-0.17172 -0.1229,-0.2359 -0.3187,-0.4713 -0.6013,-0.49958 -0.1004,-0.0206 -0.2209,0 -0.3098,-0.0331 0.145,-0.37262 0.2216,-0.77917 0.2248,-1.18131 0,-0.99566 -0.5389,-1.95234 -1.3342,-2.53871 -0.7024,-0.50551 -1.5636,-0.80383 -2.4317,-0.80248 z"
         id="path71503"
         inkscape:connector-curvature="0" />
      <path
         style="fill:#cccccc;stroke-width:0.0845278"
         d="m 1988.9577,818.90754 c -2.1502,0 -3.754,1.09093 -4.284,2.91388 -0.1888,0.64963 -0.1261,1.65595 0.135,2.16768 0.1667,0.32684 0.1684,0.34769 0.024,0.2877 -1.0219,-0.42407 -2.2316,-0.0484 -2.605,0.80936 -0.089,0.20477 -0.1675,0.38196 -0.1741,0.39378 -0.01,0.013 -0.1417,-0.0435 -0.3003,-0.12319 -0.1706,-0.0856 -0.4714,-0.14229 -0.7361,-0.13885 -0.3646,0.005 -0.5048,0.0521 -0.7554,0.25487 -0.3709,0.30017 -0.3985,0.36653 -0.2419,0.58069 0.1188,0.16232 0.3115,0.16647 9.9543,0.20785 10.619,0.0458 11.2893,0.0399 11.4557,-0.0983 0.1509,-0.12518 0.1386,-0.54062 -0.024,-0.78798 -0.1696,-0.25887 -0.6139,-0.40765 -1.0007,-0.33507 -0.2676,0.0502 -0.3085,0.0331 -0.3816,-0.15907 -0.087,-0.22942 -0.3192,-0.39174 -0.5705,-0.3992 -0.088,-0.005 -0.3045,-0.21648 -0.5053,-0.49824 -0.2831,-0.39714 -0.461,-0.54742 -0.9099,-0.76838 -0.4969,-0.2446 -0.6351,-0.27439 -1.2614,-0.27151 -0.5438,0.003 -0.8189,0.05 -1.2123,0.20878 l -0.5088,0.20553 -0.1027,-0.40076 c -0.2176,-0.84879 -0.899,-1.55266 -1.7166,-1.77279 -0.2307,-0.0621 -0.3183,-0.13137 -0.3183,-0.25151 0,-0.0913 -0.08,-0.24604 -0.1783,-0.34415 -0.1425,-0.14245 -0.2423,-0.16811 -0.4965,-0.12761 -0.2983,0.0478 -0.3316,0.0301 -0.5373,-0.28061 -0.4502,-0.68017 -1.7302,-1.27313 -2.7484,-1.27313 z"
         id="path71505"
         inkscape:connector-curvature="0" />
      <path
         style="fill:#cccccc;stroke-width:0.0845278"
         d="m 1956.4895,783.8649 c -1.4487,0 -2.5956,0.22042 -3.4907,0.66321 -1.913,0.9463 -3.1666,2.88393 -3.1991,4.94445 -0.011,0.69895 -0.032,0.81642 -0.1398,0.76888 -0.07,-0.0308 -0.3741,-0.072 -0.6762,-0.0914 -0.4986,-0.032 -0.5864,-0.013 -0.9473,0.22009 -0.5291,0.33977 -0.8282,0.82131 -0.8402,1.35262 l -0.01,0.41103 -1.0247,0.17889 c -1.1032,0.19256 -3.4963,0.55047 -4.3212,0.64616 -0.5408,0.0627 -0.6591,0.10203 -0.5991,0.19897 0.021,0.0334 6.508,0.0593 14.4164,0.0575 15.6084,-0.005 14.5372,0.0292 14.5405,-0.44051 0,-0.23931 -0.4615,-0.69921 -0.7654,-0.75996 -0.2123,-0.0425 -0.2366,-0.0812 -0.2255,-0.35915 0.025,-0.63066 -0.3378,-1.07497 -1.0434,-1.27733 -0.5401,-0.1548 -1.4051,0.16087 -2.0217,0.73803 -0.1627,0.15222 -0.32,0.27721 -0.3496,0.2776 -0.03,0 -0.1122,-0.0887 -0.1838,-0.19793 -0.1754,-0.2676 -0.6974,-0.50612 -0.9828,-0.44905 -0.2,0.0401 -0.2417,0.01 -0.3329,-0.24247 -0.1945,-0.53779 -0.8607,-0.78594 -1.479,-0.55091 l -0.2116,0.0805 0.047,-0.5665 c 0.1237,-1.48605 -0.5526,-3.27966 -1.5935,-4.22618 -0.5314,-0.48324 -0.9931,-0.741 -1.8557,-1.03627 -0.689,-0.23577 -0.9471,-0.27805 -1.9759,-0.32377 -0.2535,-0.0114 -0.4986,-0.0167 -0.7357,-0.0164 z"
         id="path71507"
         inkscape:connector-curvature="0" />
      <path
         style="fill:#cccccc;stroke-width:0.0845278"
         d="m 1918.9173,813.14973 c -1.122,0.003 -2.3293,0.36941 -3.3986,1.05323 -0.3717,0.23767 -1.1075,0.95742 -1.1075,1.08331 0,0.0367 -0.3328,0.0636 -0.7397,0.0595 -0.8061,-0.008 -1.3522,0.13184 -1.8801,0.48136 -0.3119,0.20637 -0.6768,0.7429 -0.6768,0.99502 0,0.16666 0.046,0.16973 -0.487,-0.0326 -0.9322,-0.35433 -2.4263,-0.15042 -3.2304,0.44082 -0.359,0.26406 -0.4152,0.278 -1.1407,0.2834 -1.1089,0.008 -1.9887,0.38335 -1.9887,0.84791 0,0.10625 0.085,0.2531 0.1894,0.32599 0.1697,0.11898 1.2343,0.13023 10.3478,0.11033 l 10.1586,-0.0222 0.2181,-0.2049 c 0.4762,-0.44746 0.122,-1.20655 -0.6183,-1.32495 -0.2569,-0.0411 -0.347,-0.0949 -0.347,-0.20727 0,-0.37341 -0.7216,-0.92546 -1.2096,-0.92546 -0.1587,0 -0.2205,-0.0665 -0.2962,-0.31885 -0.3409,-1.13782 -1.5314,-2.24767 -2.7081,-2.52463 -0.3468,-0.0816 -0.7113,-0.12107 -1.0852,-0.12028 z"
         id="path71509"
         inkscape:connector-curvature="0" />
      <path
         style="fill:#cccccc;stroke-width:0.0845278"
         d="m 1887.2903,828.96291 c -2.0886,-0.003 -3.8142,1.6265 -3.8659,3.65405 -0.01,0.31361 -0.022,0.57023 -0.031,0.57055 -0.01,0 -0.1612,-0.0852 -0.3381,-0.18989 -0.2524,-0.14912 -0.4513,-0.19018 -0.9223,-0.19018 h -0.6005 l -0.1352,-0.38037 c -0.2594,-0.72964 -1.1012,-1.055 -2.1316,-0.82386 l -0.5553,0.12452 -0.5105,-0.5316 c -0.5087,-0.52967 -0.949,-0.79775 -1.8482,-1.12515 -0.6753,-0.24585 -1.1567,-0.29215 -1.9104,-0.18367 -2.2459,0.32311 -3.7767,2.28343 -3.6557,4.68125 l 0.031,0.6151 -0.342,-0.0782 c -0.4688,-0.10724 -1.1494,0.18023 -1.4404,0.60841 -0.4482,0.65973 -0.1864,1.65224 0.5366,2.03401 0.3096,0.16351 0.5877,0.16605 18.2343,0.16711 15.7743,0 17.9003,-0.0148 17.7558,-0.12306 -0.09,-0.0683 -0.3037,-0.1242 -0.4744,-0.1242 -0.5654,0 -3.2855,-0.61182 -4.28,-0.96271 -0.5182,-0.18285 -1.6003,-0.72136 -2.247,-1.11829 -0.6764,-0.41508 -1.2768,-0.53038 -1.8084,-0.34726 l -0.3375,0.1162 -0.175,-0.30398 c -0.2582,-0.4487 -0.8296,-0.70982 -1.4545,-0.66458 -0.483,0.035 -0.4881,0.0326 -0.6477,-0.26159 -0.1074,-0.19836 -0.3151,-0.37772 -0.6257,-0.54054 -0.3933,-0.20619 -0.5299,-0.23633 -0.8875,-0.19574 l -0.4226,0.0479 -0.011,-0.63395 c -0.015,-0.87368 -0.3489,-1.55352 -1.1656,-2.36966 -0.9871,-0.98665 -2.2081,-1.46748 -3.7344,-1.47076 z"
         id="path71511"
         inkscape:connector-curvature="0" />
      <path
         style="fill:#cccccc;stroke-width:0.0845278"
         d="m 1826.5697,805.62799 c -1.0985,0 -2.2701,0.50675 -3.3316,1.48944 -0.7182,0.66501 -0.9189,1.12035 -0.8652,1.96366 0.033,0.51985 0.055,0.56721 0.4323,0.95065 0.2186,0.2219 0.3974,0.44839 0.3974,0.50329 0,0.16002 -0.2495,0.25339 -1.405,0.52565 -0.5987,0.14097 -1.2977,0.31205 -1.5534,0.37999 -0.2557,0.068 -0.8263,0.16531 -1.268,0.2164 -1.0283,0.1188 -1.1834,0.15206 -1.1834,0.25321 0,0.054 4.947,0.083 14.1233,0.083 10.6654,0 14.1151,-0.0241 14.0905,-0.0979 -0.037,-0.11295 -0.076,-0.11914 -1.2071,-0.19333 -4.6018,-0.30183 -8.5972,-0.62052 -9.1415,-0.72922 -0.3685,-0.0735 -0.5104,-0.16369 -0.9284,-0.58975 -0.5768,-0.58812 -0.8777,-0.71252 -1.5269,-0.6314 -0.2931,0.0367 -0.4486,0.0279 -0.4171,-0.023 0.066,-0.10673 -0.2669,-0.59143 -0.55,-0.80105 -0.1225,-0.0908 -0.3982,-0.18476 -0.6127,-0.20897 -0.3268,-0.0367 -0.4175,-0.0887 -0.5608,-0.32041 -0.094,-0.15206 -0.2302,-0.29927 -0.3028,-0.32711 -0.2203,-0.0846 -0.67,-0.0567 -0.7746,0.0478 -0.075,0.0748 -0.1369,0.01 -0.2595,-0.27475 -0.2442,-0.56605 -0.9308,-1.42531 -1.3527,-1.69285 -0.5525,-0.35037 -1.1653,-0.52256 -1.8028,-0.5233 z"
         id="path71513"
         inkscape:connector-curvature="0" />
      <path
         style="fill:#cccccc;stroke-width:0.0507642"
         d="m 1946.2567,818.42255 c -0.3846,0.0693 -0.7008,0.31515 -1.0293,0.50953 -0.6415,0.43559 -1.1857,1.05093 -1.4353,1.79388 -0.1026,0.35115 -0.095,0.72332 -0.054,1.08355 -0.4469,0.0193 -0.918,0.0996 -1.2795,0.38206 -0.5644,0.39991 -0.8999,1.10913 -0.8261,1.80001 0,0.11163 0.011,0.22368 -0.01,0.33396 -0.019,-0.005 -0.039,-0.0101 -0.059,-0.0148 -0.084,-0.0401 -0.1686,-0.0859 -0.2637,-0.0697 -0.1607,-0.018 -0.3492,-0.0732 -0.4888,0.0404 -0.031,0.0323 -0.07,0.0662 -0.1176,0.0525 -0.2916,0.0196 -0.5465,0.23665 -0.6491,0.50475 -0.1791,-0.0632 -0.373,-0.17537 -0.5664,-0.10089 -0.04,0.013 -0.073,0.0355 -0.1037,0.0624 -0.091,0.008 -0.1706,0.0236 -0.22,0.0489 -0.039,0.0201 -0.076,0.0425 -0.1111,0.0665 -0.038,0 -0.074,0.0101 -0.1071,0.0336 -0.1417,0.0686 -0.2314,0.23132 -0.2273,0.38711 -0.031,0.11816 0,0.21857 0.1111,0.25987 0,0 0.011,0 0.024,0 0.09,0.0574 0.2127,0.0582 0.3056,0.005 1.2208,0.0148 5.7126,0.0259 10.9995,0.0254 10.6467,0 11.2442,-0.005 11.3736,-0.0903 0.1364,-0.0893 0.1648,-0.16084 0.081,-0.27186 0.018,-0.0869 0.01,-0.1822 -0.048,-0.25617 -0.045,-0.0746 -0.1141,-0.1351 -0.1956,-0.16645 -0.01,-0.14065 -0.093,-0.28009 -0.2255,-0.3338 -0.1118,-0.16626 -0.3349,-0.18484 -0.5173,-0.16695 -0.069,0 -0.1481,0.01 -0.2116,0 0.043,-0.15595 0.023,-0.33092 -0.072,-0.46421 -0.2847,-0.59256 -0.7799,-1.10594 -1.4114,-1.31977 -0.4993,-0.1777 -1.0404,-0.15449 -1.5583,-0.0919 -0.093,0.0101 -0.1867,0.0183 -0.2801,0.0262 -0.1853,-0.41505 -0.6193,-0.67463 -1.0592,-0.73316 -0.018,-0.0209 0.018,-0.0546 0.01,-0.081 0.031,-0.4255 -0.2906,-0.83079 -0.6999,-0.92953 -0.1725,-0.0557 -0.3538,-0.0766 -0.534,-0.0882 -0.065,-0.37606 -0.1852,-0.77523 -0.4885,-1.02907 -0.6073,-0.52369 -1.5922,-0.53814 -2.2067,-0.0185 -0.454,0.35139 -0.7915,0.88788 -0.809,1.47216 -0.01,0.19656 0.013,0.39442 0.061,0.58484 -0.2955,0.0657 -0.583,0.16182 -0.8673,0.26469 -0.3111,-0.5411 -0.8722,-0.93991 -1.4935,-1.02627 0.08,-0.48649 0.047,-1.02073 -0.2298,-1.4433 -0.3151,-0.50543 -0.8325,-0.90588 -1.429,-1.00018 -0.3589,-0.0301 -0.7195,-0.0279 -1.0791,-0.0427 z"
         id="path71515"
         inkscape:connector-curvature="0" />
      <path
         style="fill:#cccccc;stroke-width:0.0845278"
         d="m 1875.9619,794.28639 c -1.9087,0.007 -3.8704,0.95602 -4.7308,2.29691 -0.2035,0.31713 -0.3083,0.41095 -0.4096,0.36679 -0.8236,-0.35894 -1.8421,-0.16232 -2.4633,0.47556 -0.3297,0.33845 -0.4234,0.39018 -0.6473,0.35732 -0.5272,-0.0772 -1.1965,0.44447 -1.0936,0.85246 0.025,0.10022 0.1521,0.24791 0.2819,0.32819 0.2198,0.13592 0.8033,0.14454 8.5527,0.12679 9.4727,-0.022 8.6105,0.0584 8.3477,-0.77544 -0.2212,-0.70163 -0.7313,-0.94808 -1.5973,-0.77145 -0.3831,0.0781 -0.414,0.0699 -0.6763,-0.17894 -0.3579,-0.33967 -0.6925,-0.50318 -1.1789,-0.5761 -0.3764,-0.0565 -0.4054,-0.0808 -0.6221,-0.52382 -0.2943,-0.60156 -0.9102,-1.20568 -1.5308,-1.50154 -0.8645,-0.41222 -1.0964,-0.46379 -2.1415,-0.47633 -0.03,0 -0.06,0 -0.091,0 z"
         id="path71517"
         inkscape:connector-curvature="0" />
      <path
         style="fill:#cccccc;stroke-width:0.0845278"
         d="m 2162.969,796.28565 c 0.013,0 0.028,0 0.041,0 1.2623,-0.003 2.5611,0.48832 3.3902,1.46307 0.5951,0.76607 0.8078,1.78625 0.6807,2.73804 0.2573,0.007 0.5249,0.10625 0.6771,0.32303 0.058,0.0445 0.117,0.15351 0.1732,0.15774 0.5127,-0.61399 1.3287,-1.02174 2.1386,-0.90024 0.4913,0.082 0.9471,0.34687 1.2846,0.70953 0.5027,0.57891 0.6553,1.36184 0.7339,2.1023 0.025,0.11374 0,0.24863 0.073,0.34525 0.1368,0.12108 0.3709,0.0753 0.4718,0.24869 0.1087,0.16301 0.1019,0.37208 0.1028,0.55978 -0.01,0.13771 -0.122,0.24942 -0.2596,0.25815 -0.2281,0.0303 -0.4595,0.007 -0.6889,0.0201 -3.9065,0.0347 -7.8134,0.0225 -11.72,0.0164 -1.11,-0.008 -2.2214,-0.007 -3.3299,-0.0644 -0.2499,-0.0347 -0.5465,-0.16036 -0.6014,-0.43426 -0.016,-0.14015 0.082,-0.25963 0.1728,-0.35144 0.011,-0.14195 -0.1108,-0.25202 -0.1198,-0.39362 -0.2022,-0.78815 0.4464,-1.65524 1.2549,-1.70215 0.3206,-0.0295 0.6325,0.0647 0.9418,0.13039 0.073,-0.0114 0.084,-0.12108 0.1307,-0.17172 0.1229,-0.2359 0.3187,-0.4713 0.6013,-0.49958 0.1004,-0.0206 0.2209,0 0.3098,-0.0331 -0.145,-0.37262 -0.2216,-0.77917 -0.2248,-1.18131 0,-0.99566 0.5389,-1.95234 1.3342,-2.53871 0.7024,-0.50551 1.5636,-0.80383 2.4317,-0.80248 z"
         id="path71519"
         inkscape:connector-curvature="0" />
      <path
         style="fill:#cccccc;stroke-width:0.0845278"
         d="m 2116.5262,807.75455 c 2.1502,0 3.754,1.09093 4.284,2.91388 0.1888,0.64963 0.1261,1.65595 -0.135,2.16768 -0.1667,0.32684 -0.1684,0.34769 -0.024,0.2877 1.0219,-0.42407 2.2316,-0.0484 2.605,0.80936 0.089,0.20477 0.1675,0.38196 0.1741,0.39378 0.01,0.013 0.1417,-0.0435 0.3003,-0.12319 0.1706,-0.0856 0.4714,-0.14229 0.7361,-0.13885 0.3646,0.005 0.5048,0.0521 0.7554,0.25487 0.3709,0.30017 0.3985,0.36653 0.2419,0.58069 -0.1188,0.16232 -0.3115,0.16647 -9.9543,0.20785 -10.619,0.0458 -11.2893,0.0399 -11.4557,-0.0983 -0.1509,-0.12518 -0.1386,-0.54062 0.024,-0.78798 0.1696,-0.25887 0.6139,-0.40765 1.0007,-0.33507 0.2676,0.0502 0.3085,0.0331 0.3816,-0.15907 0.087,-0.22942 0.3192,-0.39174 0.5705,-0.3992 0.088,-0.005 0.3045,-0.21648 0.5053,-0.49824 0.2831,-0.39714 0.461,-0.54742 0.9099,-0.76838 0.4969,-0.2446 0.6351,-0.27439 1.2614,-0.27151 0.5438,0.003 0.8189,0.05 1.2123,0.20878 l 0.5088,0.20553 0.1027,-0.40076 c 0.2176,-0.84879 0.899,-1.55266 1.7166,-1.77279 0.2307,-0.0621 0.3183,-0.13137 0.3183,-0.25151 0,-0.0913 0.08,-0.24604 0.1783,-0.34415 0.1425,-0.14245 0.2423,-0.16811 0.4965,-0.12761 0.2983,0.0478 0.3316,0.0301 0.5373,-0.28061 0.4502,-0.68017 1.7302,-1.27313 2.7484,-1.27313 z"
         id="path71521"
         inkscape:connector-curvature="0" />
      <path
         style="fill:#cccccc;stroke-width:0.0845278"
         d="m 2146.3761,819.07095 c 1.122,0.003 2.3293,0.36941 3.3986,1.05323 0.3717,0.23767 1.1075,0.95742 1.1075,1.08331 0,0.0367 0.3328,0.0636 0.7397,0.0595 0.8061,-0.008 1.3522,0.13184 1.8801,0.48136 0.3119,0.20637 0.6768,0.7429 0.6768,0.99502 0,0.16666 -0.046,0.16973 0.487,-0.0326 0.9322,-0.35433 2.4263,-0.15042 3.2304,0.44082 0.359,0.26406 0.4152,0.278 1.1407,0.2834 1.1089,0.008 1.9887,0.38335 1.9887,0.84791 0,0.10625 -0.085,0.2531 -0.1894,0.32599 -0.1697,0.11898 -1.2343,0.13023 -10.3478,0.11033 l -10.1586,-0.0222 -0.2181,-0.2049 c -0.4762,-0.44746 -0.122,-1.20655 0.6183,-1.32495 0.2569,-0.0411 0.347,-0.0949 0.347,-0.20727 0,-0.37341 0.7216,-0.92546 1.2096,-0.92546 0.1587,0 0.2205,-0.0665 0.2962,-0.31885 0.3409,-1.13782 1.5314,-2.24767 2.7081,-2.52463 0.3468,-0.0816 0.7113,-0.12107 1.0852,-0.12028 z"
         id="path71523"
         inkscape:connector-curvature="0" />
      <path
         style="fill:#cccccc;stroke-width:0.0507642"
         d="m 2199.0934,803.89054 c 0.3846,0.0693 0.7008,0.31515 1.0293,0.50953 0.6415,0.43559 1.1857,1.05093 1.4353,1.79388 0.1026,0.35115 0.095,0.72332 0.054,1.08355 0.4469,0.0193 0.918,0.0996 1.2795,0.38206 0.5644,0.39991 0.8999,1.10913 0.8261,1.80001 0,0.11163 -0.011,0.22368 0.01,0.33396 0.019,-0.005 0.039,-0.0101 0.059,-0.0148 0.084,-0.0401 0.1686,-0.0859 0.2637,-0.0697 0.1607,-0.018 0.3492,-0.0732 0.4888,0.0404 0.031,0.0323 0.07,0.0662 0.1176,0.0525 0.2916,0.0196 0.5465,0.23665 0.6491,0.50475 0.1791,-0.0632 0.373,-0.17537 0.5664,-0.10089 0.04,0.013 0.073,0.0355 0.1037,0.0624 0.091,0.008 0.1706,0.0236 0.22,0.0489 0.039,0.0201 0.076,0.0425 0.1111,0.0665 0.038,0 0.074,0.0101 0.1071,0.0336 0.1417,0.0686 0.2314,0.23132 0.2273,0.38711 0.031,0.11816 0,0.21857 -0.1111,0.25987 0,0 -0.011,0 -0.024,0 -0.09,0.0574 -0.2127,0.0582 -0.3056,0.005 -1.2208,0.0148 -5.7126,0.0259 -10.9995,0.0254 -10.6467,0 -11.2442,-0.005 -11.3736,-0.0903 -0.1364,-0.0893 -0.1648,-0.16084 -0.081,-0.27186 -0.018,-0.0869 -0.01,-0.1822 0.048,-0.25617 0.045,-0.0746 0.1141,-0.1351 0.1956,-0.16645 0.01,-0.14065 0.093,-0.28009 0.2255,-0.3338 0.1118,-0.16626 0.3349,-0.18484 0.5173,-0.16695 0.069,0 0.1481,0.01 0.2116,0 -0.043,-0.15595 -0.023,-0.33092 0.072,-0.46421 0.2847,-0.59256 0.7799,-1.10594 1.4114,-1.31977 0.4993,-0.1777 1.0404,-0.15449 1.5583,-0.0919 0.093,0.0101 0.1867,0.0183 0.2801,0.0262 0.1853,-0.41505 0.6193,-0.67463 1.0592,-0.73316 0.018,-0.0209 -0.018,-0.0546 -0.01,-0.081 -0.031,-0.4255 0.2906,-0.83079 0.6999,-0.92953 0.1725,-0.0557 0.3538,-0.0766 0.534,-0.0882 0.065,-0.37606 0.1852,-0.77523 0.4885,-1.02907 0.6073,-0.52369 1.5922,-0.53814 2.2067,-0.0185 0.454,0.35139 0.7915,0.88788 0.809,1.47216 0.01,0.19656 -0.013,0.39442 -0.061,0.58484 0.2955,0.0657 0.583,0.16182 0.8673,0.26469 0.3111,-0.5411 0.8722,-0.93991 1.4935,-1.02627 -0.08,-0.48649 -0.047,-1.02073 0.2298,-1.4433 0.3151,-0.50543 0.8325,-0.90588 1.429,-1.00018 0.3589,-0.0301 0.7195,-0.0279 1.0791,-0.0427 z"
         id="path71525"
         inkscape:connector-curvature="0" />
      <path
         style="fill:#cccccc;stroke-width:0.0845278"
         d="m 2022.679,789.67647 c 0.013,0 0.028,0 0.041,0 1.2623,-0.003 2.5611,0.48832 3.3902,1.46307 0.5951,0.76607 0.8078,1.78625 0.6807,2.73804 0.2573,0.007 0.5249,0.10625 0.6771,0.32303 0.058,0.0445 0.117,0.15351 0.1732,0.15774 0.5127,-0.61399 1.3287,-1.02174 2.1386,-0.90024 0.4913,0.082 0.9471,0.34687 1.2846,0.70953 0.5027,0.57891 0.6553,1.36184 0.7339,2.1023 0.025,0.11374 0,0.24863 0.073,0.34525 0.1368,0.12108 0.3709,0.0753 0.4718,0.24869 0.1087,0.16301 0.1019,0.37208 0.1028,0.55978 -0.01,0.13771 -0.122,0.24942 -0.2596,0.25815 -0.2281,0.0303 -0.4595,0.007 -0.6889,0.0201 -3.9065,0.0347 -7.8134,0.0225 -11.72,0.0164 -1.11,-0.008 -2.2214,-0.007 -3.3299,-0.0644 -0.2499,-0.0347 -0.5465,-0.16036 -0.6014,-0.43426 -0.016,-0.14015 0.082,-0.25963 0.1728,-0.35144 0.011,-0.14195 -0.1108,-0.25202 -0.1198,-0.39362 -0.2022,-0.78815 0.4464,-1.65524 1.2549,-1.70215 0.3206,-0.0295 0.6325,0.0647 0.9418,0.13039 0.073,-0.0114 0.084,-0.12108 0.1307,-0.17172 0.1229,-0.2359 0.3187,-0.4713 0.6013,-0.49958 0.1004,-0.0206 0.2209,0 0.3098,-0.0331 -0.145,-0.37262 -0.2216,-0.77917 -0.2248,-1.18131 0,-0.99566 0.5389,-1.95234 1.3342,-2.53871 0.7024,-0.50551 1.5636,-0.80383 2.4317,-0.80248 z"
         id="path71527"
         inkscape:connector-curvature="0" />
      <path
         style="fill:#cccccc;stroke-width:0.0845278"
         d="m 1910.1445,792.47082 c 2.1502,0 3.754,1.09093 4.284,2.91388 0.1888,0.64963 0.1261,1.65595 -0.135,2.16768 -0.1667,0.32684 -0.1684,0.34769 -0.024,0.2877 1.0219,-0.42407 2.2316,-0.0484 2.605,0.80936 0.089,0.20477 0.1675,0.38196 0.1741,0.39378 0.01,0.013 0.1417,-0.0435 0.3003,-0.12319 0.1706,-0.0856 0.4714,-0.14229 0.7361,-0.13885 0.3646,0.005 0.5048,0.0521 0.7554,0.25487 0.3709,0.30017 0.3985,0.36653 0.2419,0.58069 -0.1188,0.16232 -0.3115,0.16647 -9.9543,0.20785 -10.619,0.0458 -11.2893,0.0399 -11.4557,-0.0983 -0.1509,-0.12518 -0.1386,-0.54062 0.024,-0.78798 0.1696,-0.25887 0.6139,-0.40765 1.0007,-0.33507 0.2676,0.0502 0.3085,0.0331 0.3816,-0.15907 0.087,-0.22942 0.3192,-0.39174 0.5705,-0.3992 0.088,-0.005 0.3045,-0.21648 0.5053,-0.49824 0.2831,-0.39714 0.461,-0.54742 0.9099,-0.76838 0.4969,-0.2446 0.6351,-0.27439 1.2614,-0.27151 0.5438,0.003 0.8189,0.05 1.2123,0.20878 l 0.5088,0.20553 0.1027,-0.40076 c 0.2176,-0.84879 0.899,-1.55266 1.7166,-1.77279 0.2307,-0.0621 0.3183,-0.13137 0.3183,-0.25151 0,-0.0913 0.08,-0.24604 0.1783,-0.34415 0.1425,-0.14245 0.2423,-0.16811 0.4965,-0.12761 0.2983,0.0478 0.3316,0.0301 0.5373,-0.28061 0.4502,-0.68017 1.7302,-1.27313 2.7484,-1.27313 z"
         id="path71529"
         inkscape:connector-curvature="0" />
      <path
         style="fill:#cccccc;stroke-width:0.0845278"
         d="m 1968.2232,802.86629 c 1.4487,0 2.5956,0.22042 3.4907,0.66321 1.913,0.9463 3.1666,2.88393 3.1991,4.94445 0.011,0.69895 0.032,0.81642 0.1398,0.76888 0.07,-0.0308 0.3741,-0.072 0.6762,-0.0914 0.4986,-0.032 0.5864,-0.013 0.9473,0.22009 0.5291,0.33977 0.8282,0.82131 0.8402,1.35262 l 0.01,0.41103 1.0247,0.17889 c 1.1032,0.19256 3.4963,0.55047 4.3212,0.64616 0.5408,0.0627 0.6591,0.10203 0.5991,0.19897 -0.021,0.0334 -6.508,0.0593 -14.4164,0.0575 -15.6084,-0.005 -14.5372,0.0292 -14.5405,-0.44051 0,-0.23931 0.4615,-0.69921 0.7654,-0.75996 0.2123,-0.0425 0.2366,-0.0812 0.2255,-0.35915 -0.025,-0.63066 0.3378,-1.07497 1.0434,-1.27733 0.5401,-0.1548 1.4051,0.16087 2.0217,0.73803 0.1627,0.15222 0.32,0.27721 0.3496,0.2776 0.03,0 0.1122,-0.0887 0.1838,-0.19793 0.1754,-0.2676 0.6974,-0.50612 0.9828,-0.44905 0.2,0.0401 0.2417,0.01 0.3329,-0.24247 0.1945,-0.53779 0.8607,-0.78594 1.479,-0.55091 l 0.2116,0.0805 -0.047,-0.5665 c -0.1237,-1.48605 0.5526,-3.27966 1.5935,-4.22618 0.5314,-0.48324 0.9931,-0.741 1.8557,-1.03627 0.689,-0.23577 0.9471,-0.27805 1.9759,-0.32377 0.2535,-0.0114 0.4986,-0.0167 0.7357,-0.0164 z"
         id="path71531"
         inkscape:connector-curvature="0" />
      <path
         style="fill:#cccccc;stroke-width:0.0845278"
         d="m 2060.5277,794.97449 c 1.122,0.003 2.3293,0.36941 3.3986,1.05323 0.3717,0.23767 1.1075,0.95742 1.1075,1.08331 0,0.0367 0.3328,0.0636 0.7397,0.0595 0.8061,-0.008 1.3522,0.13184 1.8801,0.48136 0.3119,0.20637 0.6768,0.7429 0.6768,0.99502 0,0.16666 -0.046,0.16973 0.487,-0.0326 0.9322,-0.35433 2.4263,-0.15042 3.2304,0.44082 0.359,0.26406 0.4152,0.278 1.1407,0.2834 1.1089,0.008 1.9887,0.38335 1.9887,0.84791 0,0.10625 -0.085,0.2531 -0.1894,0.32599 -0.1697,0.11898 -1.2343,0.13023 -10.3478,0.11033 l -10.1586,-0.0222 -0.2181,-0.2049 c -0.4762,-0.44746 -0.122,-1.20655 0.6183,-1.32495 0.2569,-0.0411 0.347,-0.0949 0.347,-0.20727 0,-0.37341 0.7216,-0.92546 1.2096,-0.92546 0.1587,0 0.2205,-0.0665 0.2962,-0.31885 0.3409,-1.13782 1.5314,-2.24767 2.7081,-2.52463 0.3468,-0.0816 0.7113,-0.12107 1.0852,-0.12028 z"
         id="path71533"
         inkscape:connector-curvature="0" />
      <path
         style="fill:#cccccc;stroke-width:0.0845278"
         d="m 2066.9572,821.11451 c 2.0886,-0.003 3.8142,1.6265 3.8659,3.65405 0.01,0.31361 0.022,0.57023 0.031,0.57055 0.01,0 0.1612,-0.0852 0.3381,-0.18989 0.2524,-0.14912 0.4513,-0.19018 0.9223,-0.19018 h 0.6005 l 0.1352,-0.38037 c 0.2594,-0.72964 1.1012,-1.055 2.1316,-0.82386 l 0.5553,0.12452 0.5105,-0.5316 c 0.5087,-0.52967 0.949,-0.79775 1.8482,-1.12515 0.6753,-0.24585 1.1567,-0.29215 1.9104,-0.18367 2.2459,0.32311 3.7767,2.28343 3.6557,4.68125 l -0.031,0.6151 0.342,-0.0782 c 0.4688,-0.10724 1.1494,0.18023 1.4404,0.60841 0.4482,0.65973 0.1864,1.65224 -0.5366,2.03401 -0.3096,0.16351 -0.5877,0.16605 -18.2343,0.16711 -15.7743,0 -17.9003,-0.0148 -17.7558,-0.12306 0.09,-0.0683 0.3037,-0.1242 0.4744,-0.1242 0.5654,0 3.2855,-0.61182 4.28,-0.96271 0.5182,-0.18285 1.6003,-0.72136 2.247,-1.11829 0.6764,-0.41508 1.2768,-0.53038 1.8084,-0.34726 l 0.3375,0.1162 0.175,-0.30398 c 0.2582,-0.4487 0.8296,-0.70982 1.4545,-0.66458 0.483,0.035 0.4881,0.0326 0.6477,-0.26159 0.1074,-0.19836 0.3151,-0.37772 0.6257,-0.54054 0.3933,-0.20619 0.5299,-0.23633 0.8875,-0.19574 l 0.4226,0.0479 0.011,-0.63395 c 0.015,-0.87368 0.3489,-1.55352 1.1656,-2.36966 0.9871,-0.98665 2.2081,-1.46748 3.7344,-1.47076 z"
         id="path71535"
         inkscape:connector-curvature="0" />
      <path
         style="fill:#cccccc;stroke-width:0.0845278"
         d="m 2093.5992,782.08279 c 1.0985,0 2.2701,0.50675 3.3316,1.48944 0.7182,0.66501 0.9189,1.12035 0.8652,1.96366 -0.033,0.51985 -0.055,0.56721 -0.4323,0.95065 -0.2186,0.2219 -0.3974,0.44839 -0.3974,0.50329 0,0.16002 0.2495,0.25339 1.405,0.52565 0.5987,0.14097 1.2977,0.31205 1.5534,0.37999 0.2557,0.068 0.8263,0.16531 1.268,0.2164 1.0283,0.1188 1.1834,0.15206 1.1834,0.25321 0,0.054 -4.947,0.083 -14.1233,0.083 -10.6654,0 -14.1151,-0.0241 -14.0905,-0.0979 0.037,-0.11295 0.076,-0.11914 1.2071,-0.19333 4.6018,-0.30183 8.5972,-0.62052 9.1415,-0.72922 0.3685,-0.0735 0.5104,-0.16369 0.9284,-0.58975 0.5768,-0.58812 0.8777,-0.71252 1.5269,-0.6314 0.2931,0.0367 0.4486,0.0279 0.4171,-0.023 -0.066,-0.10673 0.2669,-0.59143 0.55,-0.80105 0.1225,-0.0908 0.3982,-0.18476 0.6127,-0.20897 0.3268,-0.0367 0.4175,-0.0887 0.5608,-0.32041 0.094,-0.15206 0.2302,-0.29927 0.3028,-0.32711 0.2203,-0.0846 0.67,-0.0567 0.7746,0.0478 0.075,0.0748 0.1369,0.01 0.2595,-0.27475 0.2442,-0.56605 0.9308,-1.42531 1.3527,-1.69285 0.5525,-0.35037 1.1653,-0.52256 1.8028,-0.5233 z"
         id="path71537"
         inkscape:connector-curvature="0" />
      <path
         style="fill:#cccccc;stroke-width:0.102113"
         d="m 2035.3638,802.77073 c 0.7736,0.13939 1.4096,0.63393 2.0704,1.02492 1.2904,0.8762 2.3851,2.11397 2.8872,3.60843 0.2063,0.70634 0.1911,1.45497 0.1086,2.17958 0.8989,0.0388 1.8466,0.20034 2.5737,0.76852 1.1353,0.80442 1.8102,2.23103 1.6617,3.62075 0,0.22454 -0.022,0.44994 0.02,0.67177 0.038,-0.0101 0.078,-0.0203 0.1186,-0.0298 0.169,-0.0807 0.3392,-0.17278 0.5305,-0.1402 0.3232,-0.0362 0.7024,-0.14724 0.9832,0.0813 0.062,0.065 0.1408,0.13316 0.2366,0.1056 0.5865,0.0394 1.0992,0.47603 1.3056,1.01532 0.3603,-0.12713 0.7503,-0.35276 1.1394,-0.20295 0.08,0.0262 0.1468,0.0714 0.2085,0.12552 0.1831,0.0161 0.3432,0.0475 0.4426,0.0984 0.078,0.0404 0.1529,0.0855 0.2235,0.13376 0.076,0 0.1488,0.0203 0.2154,0.0676 0.285,0.13799 0.4655,0.4653 0.4572,0.77868 0.062,0.23768 0,0.43965 -0.2235,0.52273 0,0 -0.022,0 -0.048,0 -0.1811,0.11546 -0.4279,0.11707 -0.6148,0.0101 -2.4556,0.0298 -11.491,0.0521 -22.1257,0.0511 -21.416,0 -22.6179,-0.0101 -22.8782,-0.18164 -0.2743,-0.17963 -0.3314,-0.32353 -0.1629,-0.54685 -0.036,-0.1748 -0.02,-0.3665 0.097,-0.51529 0.091,-0.15006 0.2295,-0.27176 0.3934,-0.33482 0.02,-0.28292 0.1871,-0.5634 0.4536,-0.67144 0.2249,-0.33444 0.6737,-0.37181 1.0406,-0.33583 0.1388,0 0.2979,0.0201 0.4256,0 -0.087,-0.31369 -0.046,-0.66565 0.1448,-0.93376 0.5727,-1.19195 1.5688,-2.22462 2.8391,-2.65474 1.0044,-0.35745 2.0928,-0.31076 3.1345,-0.18486 0.1871,0.0203 0.3756,0.0368 0.5635,0.0527 0.3727,-0.83488 1.2457,-1.35703 2.1306,-1.47476 0.036,-0.042 -0.036,-0.10983 -0.02,-0.16294 -0.062,-0.8559 0.5845,-1.67115 1.4078,-1.86976 0.347,-0.11205 0.7117,-0.15409 1.0742,-0.17742 0.1307,-0.75645 0.3725,-1.55939 0.9826,-2.06999 1.2216,-1.05341 3.2027,-1.08248 4.4388,-0.0372 0.9132,0.70683 1.5921,1.78599 1.6273,2.96128 0.02,0.39538 -0.026,0.79338 -0.1227,1.17642 0.5944,0.13215 1.1727,0.3255 1.7446,0.53243 0.6258,-1.08844 1.7545,-1.89065 3.0042,-2.06436 -0.1609,-0.97859 -0.094,-2.05322 0.4623,-2.90323 0.6338,-1.01668 1.6746,-1.82219 2.8744,-2.01188 0.722,-0.0605 1.4473,-0.0561 2.1707,-0.0859 z"
         id="path71539"
         inkscape:connector-curvature="0" />
      <path
         style="fill:#cccccc;stroke-width:0.0845278"
         d="m 2126.4087,794.28639 c 1.9087,0.007 3.8704,0.95602 4.7308,2.29691 0.2035,0.31713 0.3083,0.41095 0.4096,0.36679 0.8236,-0.35894 1.8421,-0.16232 2.4633,0.47556 0.3297,0.33845 0.4234,0.39018 0.6473,0.35732 0.5272,-0.0772 1.1965,0.44447 1.0936,0.85246 -0.025,0.10022 -0.1521,0.24791 -0.2819,0.32819 -0.2198,0.13592 -0.8033,0.14454 -8.5527,0.12679 -9.4727,-0.022 -8.6105,0.0584 -8.3477,-0.77544 0.2212,-0.70163 0.7313,-0.94808 1.5973,-0.77145 0.3831,0.0781 0.414,0.0699 0.6763,-0.17894 0.3579,-0.33967 0.6925,-0.50318 1.1789,-0.5761 0.3764,-0.0565 0.4054,-0.0808 0.6221,-0.52382 0.2943,-0.60156 0.9102,-1.20568 1.5308,-1.50154 0.8645,-0.41222 1.0964,-0.46379 2.1415,-0.47633 0.03,0 0.06,0 0.091,0 z"
         id="path71541"
         inkscape:connector-curvature="0" />
    </g>
  </g>
</svg>
