<?xml version="1.0" encoding="UTF-8" standalone="no"?>
<!-- Created with Inkscape (http://www.inkscape.org/) -->

<svg
   width="23.9839mm"
   height="38.984768mm"
   viewBox="0 0 23.983902 38.984769"
   preserveAspectRatio="none"
   version="1.1"
   id="svg479"
   inkscape:export-filename="target_08.svg"
   inkscape:export-xdpi="96"
   inkscape:export-ydpi="96"
   xmlns:inkscape="http://www.inkscape.org/namespaces/inkscape"
   xmlns:sodipodi="http://sodipodi.sourceforge.net/DTD/sodipodi-0.dtd"
   xmlns="http://www.w3.org/2000/svg"
   xmlns:svg="http://www.w3.org/2000/svg">
  <sodipodi:namedview
     id="namedview481"
     pagecolor="#ffffff"
     bordercolor="#666666"
     borderopacity="1.0"
     inkscape:showpageshadow="2"
     inkscape:pageopacity="0.0"
     inkscape:pagecheckerboard="0"
     inkscape:deskcolor="#d1d1d1"
     inkscape:document-units="mm"
     showgrid="false" />
  <defs
     id="defs476" />
  <g
     inkscape:label="Layer 1"
     inkscape:groupmode="layer"
     id="layer1"
     transform="translate(73.742925,9.4685)">
    <g
       id="g110327"
       transform="matrix(0.41843537,0,0,0.41843537,-110.49317,-248.1826)">
      <path
         id="rect110323"
         style="opacity:1;stroke-width:1.15558;stroke-linecap:round;stroke-linejoin:round;stroke-dashoffset:347.717;paint-order:stroke markers fill"
         d="m 114.6046,617.34119 h 3.76437 v 38.63774 h -3.76437 z" />
      <path
         id="ellipse110325"
         style="opacity:1;fill:#ffeeaa;stroke-width:0.826373;stroke-linecap:round;stroke-linejoin:round;stroke-dashoffset:347.717;paint-order:stroke markers fill"
         d="m 137.50128,599.46497 a 21.014488,21.291557 0 0 1 -21.01449,21.29155 21.014488,21.291557 0 0 1 -21.014485,-21.29155 21.014488,21.291557 0 0 1 21.014485,-21.29156 21.014488,21.291557 0 0 1 21.01449,21.29156 z" />
    </g>
    <path
       style="fill:#ffeeaa;fill-opacity:1;stroke:none;stroke-width:0.00853662;stroke-linecap:square;stroke-linejoin:round;stroke-miterlimit:4;stroke-dasharray:none;stroke-dashoffset:347.717;stroke-opacity:1;paint-order:stroke markers fill"
       d="m -60.327864,-5.959824 c -0.117322,-0.0259 -0.45598,-0.07837 -0.635296,-0.09841 -0.629351,-0.07048 -1.334388,-0.05112 -1.968085,0.05405 l -0.128582,0.02252 -0.0023,-0.631828 -0.0023,-0.631716 0.08782,-0.122502 c 0.148849,-0.207622 0.233248,-0.290445 0.399098,-0.391667 0.26536,-0.162134 0.569993,-0.240139 0.936619,-0.240139 0.282676,0 0.495343,0.03963 0.718638,0.132861 0.226064,0.0948 0.346292,0.188481 0.542902,0.423373 l 0.15155,0.18105 v 0.661305 c 0,0.521577 -0.0023,0.66108 -0.01351,0.659999 -0.0068,-7.2e-4 -0.04594,-0.009 -0.0867,-0.01801 z"
       id="path110797" />
    <path
       sodipodi:nodetypes="cccscccscssscccccscccccsscccsscccccscc"
       inkscape:connector-curvature="0"
       id="path1004"
       d="m -62.671988,9.909437 c -0.203343,-0.0444 -0.61316,-0.19997 -0.910497,-0.34668 -0.466902,-0.23012 -0.618452,-0.34417 -1.111498,-0.83864 -0.445532,-0.44679 -0.617394,-0.66615 -0.782839,-0.99922 -0.598163,-1.20421 -0.597735,-2.73259 0.0011,-3.92356 0.219557,-0.43686 0.987758,-1.31768 1.290274,-1.47956 l 0.147722,-0.0793 v -0.0504 c 0,-9.621346 2.25e-4,-9.647017 0.117097,-9.888372 0.214603,-0.443257 0.740841,-0.814364 1.445112,-1.019082 0.474468,-0.138039 1.521023,-0.09413 1.97957,0.08242 0.472104,0.182176 0.843864,0.458547 1.039124,0.773335 l 0.170466,0.275043 0.01576,9.701866 0.01576,0.10584 0.127455,0.088 c 0.480031,0.33262 1.018407,0.99116 1.348192,1.64913 0.541146,1.07961 0.543083,2.57028 0.0023,3.65521 -0.56425,1.1373 -1.655346,2.0151 -2.856784,2.29834 -0.452535,0.10674 -1.536943,0.10404 -2.039042,-0.002 z m 1.792553,-0.9616 c 0.625928,-0.13218 1.077269,-0.38403 1.569752,-0.87651 0.815131,-0.81511 1.124357,-1.87824 0.880683,-3.02784 -0.127456,-0.60134 -0.360254,-0.97593 -1.10954,-1.78559 l -0.684657,-0.73978 -8.33e-4,-0.0705 -8.56e-4,-9.666446 -0.215954,-0.216179 c -0.560129,-0.560107 -1.990333,-0.521217 -2.485744,0.06733 l -0.143444,0.170467 v 9.679148 0.0833 l -0.644326,0.65905 c -0.354241,0.36249 -0.712761,0.77631 -0.796395,0.91969 -0.934456,1.60085 -0.290536,3.69378 1.402304,4.55735 0.59688,0.30454 1.486389,0.4027 2.229257,0.2459 z"
       style="fill:#000000;stroke-width:0.0569058" />
    <path
       inkscape:connector-curvature="0"
       id="path1006"
       d="m -62.094857,7.986607 c -0.384822,-0.0644 -0.813622,-0.30384 -1.15282,-0.64412 -0.313933,-0.31463 -0.461318,-0.54878 -0.586904,-0.93124 -0.09638,-0.29411 -0.06958,-1.15261 0.04504,-1.42858 0.228587,-0.55121 0.605144,-0.97648 1.061304,-1.19905 l 0.24971,-0.12183 0.0022,-2.432215 0.0022,-5.836993 1.666313,-1.133634 0.01126,6.966754 0.01126,2.428438 0.268175,0.14614 c 0.247682,0.13489 0.609647,0.39397 0.638314,0.45673 0.0068,0.0158 0.07386,0.10606 0.149523,0.20334 0.275359,0.35458 0.323954,0.54567 0.325057,1.27429 8.56e-4,0.60043 -0.0068,0.66749 -0.09728,0.8739 -0.247188,0.56206 -0.648763,0.97132 -1.196732,1.21986 -0.409929,0.18578 -0.897684,0.24106 -1.39458,0.15808 z"
       style="fill:#000000;fill-opacity:1;stroke-width:0.0867988;stroke-linecap:round;stroke-linejoin:round;stroke-dashoffset:347.717;paint-order:stroke markers fill"
       sodipodi:nodetypes="cssssccccccsccscscc" />
  </g>
</svg>
