<?xml version="1.0" encoding="UTF-8" standalone="no"?>
<!-- Created with Inkscape (http://www.inkscape.org/) -->

<svg
   width="90.516907mm"
   height="32.206818mm"
   viewBox="0 0 90.516907 32.206818"
   version="1.1"
   id="svg21136"
   inkscape:version="1.1.2 (b8e25be833, 2022-02-05)"
   sodipodi:docname="10-game22a_progress.svg"
   xmlns:inkscape="http://www.inkscape.org/namespaces/inkscape"
   xmlns:sodipodi="http://sodipodi.sourceforge.net/DTD/sodipodi-0.dtd"
   xmlns="http://www.w3.org/2000/svg"
   xmlns:svg="http://www.w3.org/2000/svg">
  <sodipodi:namedview
     id="namedview21138"
     pagecolor="#ffffff"
     bordercolor="#666666"
     borderopacity="1.0"
     inkscape:pageshadow="2"
     inkscape:pageopacity="0.0"
     inkscape:pagecheckerboard="0"
     inkscape:document-units="mm"
     showgrid="false"
     inkscape:zoom="0.64"
     inkscape:cx="777.34375"
     inkscape:cy="420.3125"
     inkscape:window-width="1920"
     inkscape:window-height="1017"
     inkscape:window-x="-8"
     inkscape:window-y="-8"
     inkscape:window-maximized="1"
     inkscape:current-layer="layer1"
     fit-margin-top="0"
     fit-margin-left="0"
     fit-margin-right="0"
     fit-margin-bottom="0"
     inkscape:showpageshadow="2"
     inkscape:deskcolor="#d1d1d1" />
  <defs
     id="defs21133">
    <filter
       inkscape:collect="always"
       style="color-interpolation-filters:sRGB"
       id="filter97682-9"
       x="-0.075926907"
       y="-0.29430503"
       width="1.1518538"
       height="1.5886101">
      <feGaussianBlur
         inkscape:collect="always"
         stdDeviation="15.015309"
         id="feGaussianBlur97684-1" />
    </filter>
  </defs>
  <g
     inkscape:label="Layer 1"
     inkscape:groupmode="layer"
     id="layer1"
     transform="translate(-589.85547,107.2782)">
    <g
       id="g97788-0"
       style="fill:#a02c2c"
       transform="translate(343.04373,-175.85047)">
      <g
         id="g97662-0"
         transform="matrix(0.16557036,0,0,0.16557036,-46.477598,0.89185167)"
         style="opacity:0.664179;mix-blend-mode:normal;fill:#a02c2c;fill-opacity:1;filter:url(#filter97682-9)">
        <path
           id="path97652-6"
           style="fill:#000000;fill-opacity:1;stroke-width:0.891038"
           d="m 1257.8203,7609.1973 -84.2851,73.2382 v 53.6016 l -23.7891,-30.5879 -40.0508,-20.6543 -37.9785,20.6543 -22.2656,28.8692 -25.3887,-20.4883 h -71.97656 l -9.16602,7.3691 -43.33594,-26.7988 h -57.54687 l -34.35547,21.2715 -63.82812,-39.086 -64.61329,40.1289 -63.30078,-70.2031 -65.04101,71.418 -0.40235,3.8476 -106.73047,-65.7597 -106.84765,66.9765 -0.2168,39.67 -20.38476,0.2597 -2.2168,-43.0761 -50.88086,-45.5157 -54.82617,46.2578 -0.47852,42.1778 -21.79883,0.2558 -0.89062,-48.3339 -55.15039,-67.6778 -50.804689,42.6895 -0.523437,-13.6582 H 64.710938 50.677734 l -0.376953,45.582 -77.074219,-65.6953 -106.125002,65.8496 -2.13281,-45.1855 -20.48633,-16.7422 -0.041,-13.5879 -0.041,-8.6699 h -8.01953 -8.01758 l 0.0469,8.0488 -24.79102,-17.2383 -59.35352,50.209 -0.55078,89.0527 1.11328,253.5996 471.12891,0.2969 470.02344,-0.1406 v -43.125 H 808.1875 v -0.068 h 127.97656 112.02344 127.1309 166.791 v -295.793 z m -1512.99218,412.0683 h -0.008 z M 936.16406,7722.209 h 5.52735 l -5.52735,4.4726 z"
           transform="matrix(0.29693803,0,0,0.29693803,1883.5254,-1814.652)" />
        <g
           id="g97660-9"
           transform="matrix(25.203242,0,0,25.203242,1729.654,-4617.9271)"
           style="fill:#a02c2c;fill-opacity:1">
          <rect
             transform="matrix(1,0,-0.56815438,0.82292199,0,0)"
             y="245.53255"
             x="156.94017"
             height="0.26195014"
             width="0.22324218"
             id="rect97654-4"
             style="opacity:1;fill:#a02c2c;fill-opacity:1;stroke-width:0.0473754;stroke-linecap:square;stroke-miterlimit:4;stroke-dasharray:none;stroke-dashoffset:347.717;paint-order:stroke markers fill" />
          <rect
             style="opacity:1;fill:#a02c2c;fill-opacity:1;stroke-width:0.0473754;stroke-linecap:square;stroke-miterlimit:4;stroke-dasharray:none;stroke-dashoffset:347.717;paint-order:stroke markers fill"
             id="rect97656-4"
             width="0.22324218"
             height="0.26195014"
             x="157.21715"
             y="245.53255"
             transform="matrix(1,0,-0.56815438,0.82292199,0,0)" />
          <rect
             transform="matrix(1,0,-0.56815438,0.82292199,0,0)"
             y="245.53255"
             x="157.49472"
             height="0.26195014"
             width="0.22324218"
             id="rect97658-5"
             style="opacity:1;fill:#a02c2c;fill-opacity:1;stroke-width:0.0473754;stroke-linecap:square;stroke-miterlimit:4;stroke-dasharray:none;stroke-dashoffset:347.717;paint-order:stroke markers fill" />
        </g>
      </g>
      <g
         id="g94420-8"
         transform="matrix(0.16557036,0,0,0.16557036,-46.477598,0.89185167)"
         style="fill:#a02c2c;fill-opacity:1">
        <path
           id="path94410-4"
           style="fill:#dfdfdf;fill-opacity:1;stroke-width:0.16557"
           d="m 988.38867,91.4375 -15.66211,13.60742 v 9.96094 l -4.41992,-5.68359 -7.44141,-3.83789 -7.05859,3.83789 -4.13672,5.36328 -4.625,-3.73243 0.65039,-0.9414 h -3.52148 l -0.59766,0.86719 h -0.85742 l 0.59961,-0.86719 h -3.52148 l -0.59961,0.86719 h -0.84766 l 0.59961,-0.86719 h -3.52149 l -0.59765,0.86719 h -1.25196 l -1.70312,1.36914 -8.05273,-4.97852 h -10.69336 l -6.38282,3.95117 -11.86132,-7.26172 -12.00586,7.45704 -11.76172,-13.044926 -12.08594,13.269526 -0.0762,0.71485 -19.83203,-12.21875 -19.85352,12.44531 -0.041,7.37109 -3.78711,0.0488 -0.41211,-8.0039 -9.45508,-8.45899 -10.1875,8.59571 -0.0879,7.83789 -4.05078,0.0469 -0.16602,-8.98047 -10.24805,-12.576169 -9.43945,7.933589 -0.0977,-2.53906 H 766.68937 764.08 l -0.0684,8.4707 -14.32227,-12.20703 -19.7207,12.23633 -0.39648,-8.39648 -3.80665,-3.11133 -0.008,-2.525391 -0.006,-1.611328 h -1.49023 -1.49024 l 0.008,1.496093 -4.60547,-3.203125 -11.0293,9.330081 -0.10351,16.54687 0.20703,47.12305 87.54492,0.0547 87.33789,-0.0254 v -8.01368 h 22.70898 v -0.0117 h 23.7793 20.81641 23.62304 30.99218 v -54.96485 z m -59.76953,20.99805 h 1.02734 l -1.02734,0.83203 z"
           transform="matrix(1.5980115,0,0,1.5980115,677.56354,298.69096)" />
      </g>
    </g>
  </g>
</svg>
