<?xml version="1.0" encoding="UTF-8" standalone="no"?>
<!-- Created with Inkscape (http://www.inkscape.org/) -->

<svg
   width="9.0314102mm"
   height="9.2185898mm"
   viewBox="0 0 9.0314102 9.2185898"
   version="1.1"
   id="svg21136"
   inkscape:version="1.1.2 (0a00cf5339, 2022-02-04)"
   sodipodi:docname="bydleni.svg"
   xmlns:inkscape="http://www.inkscape.org/namespaces/inkscape"
   xmlns:sodipodi="http://sodipodi.sourceforge.net/DTD/sodipodi-0.dtd"
   xmlns="http://www.w3.org/2000/svg"
   xmlns:svg="http://www.w3.org/2000/svg">
  <sodipodi:namedview
     id="namedview21138"
     pagecolor="#ffffff"
     bordercolor="#666666"
     borderopacity="1.0"
     inkscape:pageshadow="2"
     inkscape:pageopacity="0.0"
     inkscape:pagecheckerboard="0"
     inkscape:document-units="mm"
     showgrid="false"
     inkscape:zoom="57.973551"
     inkscape:cx="28.176642"
     inkscape:cy="29.099477"
     inkscape:window-width="2079"
     inkscape:window-height="1195"
     inkscape:window-x="26"
     inkscape:window-y="23"
     inkscape:window-maximized="0"
     inkscape:current-layer="text9159"
     inkscape:showpageshadow="2"
     inkscape:deskcolor="#d1d1d1" />
  <defs
     id="defs21133" />
  <g
     inkscape:label="Layer 1"
     inkscape:groupmode="layer"
     id="layer1"
     transform="translate(-101.92575,-90.195958)">
    <rect
       style="fill:#000000;stroke-width:0.0367121;stroke-linecap:round;stroke-linejoin:round;stroke-dashoffset:347.717;paint-order:stroke markers fill"
       id="rect71763"
       width="9.0333452"
       height="9.0314045"
       x="101.94765"
       y="92.495728"
       transform="matrix(0.99978527,-0.02072224,0,1,0,0)"
       inkscape:export-filename="../e3bc82ff/bydleni.svg"
       inkscape:export-xdpi="96"
       inkscape:export-ydpi="96" />
    <g
       id="g71779"
       style="fill:#f9aaff;fill-opacity:1"
       transform="matrix(0.21382157,0,0,0.21382157,-141.87225,-85.090286)">
      <g
         id="g71775"
         transform="matrix(0.83465644,0,0,0.83465644,188.72408,141.47595)"
         style="fill:#f9aaff;fill-opacity:1">
        <rect
           style="opacity:1;fill:#f9aaff;fill-opacity:1;stroke-width:0.17135;stroke-linecap:round;stroke-linejoin:round;stroke-dashoffset:347.717;paint-order:stroke markers fill"
           id="rect71771"
           width="15.180458"
           height="7.6418633"
           x="1150.307"
           y="839.26251" />
        <rect
           style="opacity:1;fill:#f9aaff;fill-opacity:1;stroke-width:0.17135;stroke-linecap:round;stroke-linejoin:round;stroke-dashoffset:347.717;paint-order:stroke markers fill"
           id="rect71773"
           width="15.180458"
           height="7.6418633"
           x="1167.6041"
           y="839.26251" />
      </g>
      <rect
         style="opacity:1;fill:#f9aaff;fill-opacity:1;stroke-width:0.143018;stroke-linecap:round;stroke-linejoin:round;stroke-dashoffset:347.717;paint-order:stroke markers fill"
         id="rect71777"
         width="12.670467"
         height="6.3783302"
         x="1156.0538"
         y="834.12817" />
    </g>
    <g
       aria-label="[D]"
       id="text9159"
       style="font-size:1.90363px;font-family:'Bebas Neue';-inkscape-font-specification:'Bebas Neue';fill:#ffa966;stroke-width:0.0727437">
      <path
         d="m 108.82057,97.076367 h 0.34646 v 0.171327 h -0.13706 v 1.18025 h 0.13706 v 0.171327 h -0.34646 z"
         style="fill:#e6e6e6"
         id="path9952" />
      <path
         d="m 110.07315,98.427944 h 0.13706 v -1.18025 h -0.13706 v -0.171327 h 0.34646 v 1.522904 h -0.34646 z"
         style="fill:#e6e6e6"
         id="path9946" />
      <g
         aria-label="e"
         id="text1635"
         style="font-size:2.1905px;fill:#e6e6e6;stroke-width:0.0060891">
        <path
           d="m 109.29275,97.069235 h 0.65715 v 0.21905 h -0.41619 v 0.405242 h 0.33076 v 0.21905 h -0.33076 v 0.470958 h 0.41619 v 0.21905 h -0.65715 z"
           id="path832" />
      </g>
    </g>
  </g>
</svg>
