<?xml version="1.0" encoding="UTF-8" standalone="no"?>
<!-- Created with Inkscape (http://www.inkscape.org/) -->

<svg
   width="5.1059198mm"
   height="5.0933828mm"
   viewBox="0 0 5.1059198 5.0933828"
   version="1.1"
   id="svg257"
   inkscape:version="1.2.1 (9c6d41e410, 2022-07-14)"
   sodipodi:docname="close.svg"
   xmlns:inkscape="http://www.inkscape.org/namespaces/inkscape"
   xmlns:sodipodi="http://sodipodi.sourceforge.net/DTD/sodipodi-0.dtd"
   xmlns="http://www.w3.org/2000/svg"
   xmlns:svg="http://www.w3.org/2000/svg">
  <sodipodi:namedview
     id="namedview259"
     pagecolor="#ffffff"
     bordercolor="#000000"
     borderopacity="0.25"
     inkscape:showpageshadow="2"
     inkscape:pageopacity="0.0"
     inkscape:pagecheckerboard="0"
     inkscape:deskcolor="#d1d1d1"
     inkscape:document-units="mm"
     showgrid="false"
     inkscape:zoom="0.50422278"
     inkscape:cx="146.76052"
     inkscape:cy="198.32503"
     inkscape:window-width="1536"
     inkscape:window-height="795"
     inkscape:window-x="0"
     inkscape:window-y="0"
     inkscape:window-maximized="1"
     inkscape:current-layer="layer1" />
  <defs
     id="defs254" />
  <g
     inkscape:label="Layer 1"
     inkscape:groupmode="layer"
     id="layer1"
     transform="translate(-66.187323,-96.103487)">
    <path
       id="path71705-9"
       style="fill:#000000;stroke-width:0.00852598;stroke-linecap:round;stroke-linejoin:round;stroke-dashoffset:347.717;paint-order:stroke markers fill"
       d="m 66.187323,96.329187 v 4.867683 l 5.10592,-0.2257 v -4.867683 z m 0.71147,0.64683 3.68298,-0.16281 v 3.511113 l -3.68298,0.1628 z" />
    <path
       style="color:#000000;fill:#000000;stroke-width:0.0345517;-inkscape-stroke:none"
       d="m 69.785243,97.282017 c -0.0628,0.0439 -0.0574,0.0478 -0.0808,0.0708 -0.0234,0.023 -0.0513,0.0514 -0.0846,0.0858 -0.0666,0.0687 -0.15402,0.16075 -0.25583,0.26899 -0.12409,0.13191 -0.2871,0.30813 -0.44,0.47272 l -0.96536,-0.8646 -0.42333,0.47265 0.95713,0.85725 c -0.42738,0.46298 -0.86825,0.94255 -0.86825,0.94255 l 0.46766,0.428873 c 0,0 0.44259,-0.481543 0.87324,-0.948023 l 0.8914,0.79834 0.42333,-0.47266 -0.8831,-0.79098 c 0.14915,-0.16052 0.30914,-0.3334 0.42947,-0.46132 0.10066,-0.10701 0.18674,-0.19769 0.24929,-0.26225 0.0313,-0.0323 0.0569,-0.0582 0.074,-0.075 0.0171,-0.0168 0.0499,-0.0384 -4e-4,-0.003 z"
       id="path208933" />
  </g>
</svg>
