<?xml version="1.0" encoding="UTF-8" standalone="no"?>
<!-- Created with Inkscape (http://www.inkscape.org/) -->

<svg
   width="23.9839mm"
   height="38.984764mm"
   viewBox="0 0 23.983901 38.984764"
   preserveAspectRatio="none"
   version="1.1"
   id="svg479"
   inkscape:export-filename="target_10.svg"
   inkscape:export-xdpi="96"
   inkscape:export-ydpi="96"
   sodipodi:docname="target_11.svg"
   inkscape:version="1.2 (1:1.2.1+202207142221+cd75a1ee6d)"
   xmlns:inkscape="http://www.inkscape.org/namespaces/inkscape"
   xmlns:sodipodi="http://sodipodi.sourceforge.net/DTD/sodipodi-0.dtd"
   xmlns="http://www.w3.org/2000/svg"
   xmlns:svg="http://www.w3.org/2000/svg">
  <sodipodi:namedview
     id="namedview481"
     pagecolor="#ffffff"
     bordercolor="#666666"
     borderopacity="1.0"
     inkscape:showpageshadow="2"
     inkscape:pageopacity="0.0"
     inkscape:pagecheckerboard="0"
     inkscape:deskcolor="#d1d1d1"
     inkscape:document-units="mm"
     showgrid="false"
     inkscape:zoom="6.7868394"
     inkscape:cx="45.455621"
     inkscape:cy="52.675477"
     inkscape:window-width="2560"
     inkscape:window-height="1376"
     inkscape:window-x="1920"
     inkscape:window-y="27"
     inkscape:window-maximized="1"
     inkscape:current-layer="layer1" />
  <defs
     id="defs476" />
  <g
     inkscape:label="Layer 1"
     inkscape:groupmode="layer"
     id="layer1"
     transform="translate(-5.00554,-25.559727)">
    <path
       id="rect72053-8"
       style="fill:#000000;stroke-width:0.483536;stroke-linecap:round;stroke-linejoin:round;stroke-dashoffset:347.717;paint-order:stroke markers fill"
       d="m 16.209878,45.162969 h 1.575146 v 16.167397 h -1.575146 z" />
    <path
       id="ellipse72045-7"
       style="fill:#ffffff;stroke-width:0.345784;stroke-linecap:round;stroke-linejoin:round;stroke-dashoffset:347.717;paint-order:stroke markers fill"
       d="m 25.790659,37.682927 a 8.7932051,8.9091405 0 0 1 -8.793206,8.909137 8.7932051,8.9091405 0 0 1 -8.7932037,-8.909137 8.7932051,8.9091405 0 0 1 8.7932037,-8.909142 8.7932051,8.9091405 0 0 1 8.793206,8.909142 z" />
    <path
       style="fill:#000000;stroke-width:0.0323733"
       d="m 13.24293,43.216443 c -0.0545,-0.0603 -0.0615,-0.1207 -0.061,-0.52605 6.1e-4,-0.39638 0.009,-0.4774 0.0687,-0.6035 0.14164,-0.30349 0.41134,-0.48366 0.72573,-0.4849 l 0.18015,-7.2e-4 0.002,0.27282 c 10e-4,0.14997 0.0113,0.30145 0.0232,0.33645 0.0317,0.0998 0.1842,0.14389 0.45139,0.13038 0.34339,-0.018 0.37122,-0.0491 0.38297,-0.43621 0.005,-0.16709 0.0203,-0.30364 0.0336,-0.30355 0.0135,9e-5 0.19906,1.3e-4 0.41276,1.3e-4 h 0.38847 v 0.26059 c 0,0.43887 0.0772,0.50723 0.53917,0.47782 0.29817,-0.018 0.33492,-0.0684 0.33492,-0.45064 v -0.28777 h 0.41772 0.41774 l 0.0113,0.30644 c 0.0158,0.40968 0.0277,0.42195 0.4361,0.42195 0.40648,0 0.43301,-0.027 0.43301,-0.44062 v -0.28777 h 0.38849 c 0.2137,0 0.39939,-1.3e-4 0.41277,-3.8e-4 0.0135,-2.2e-4 0.0315,0.13962 0.0405,0.31053 0.0203,0.40451 0.0511,0.43446 0.43704,0.43446 0.38818,0 0.41745,-0.0297 0.4322,-0.4377 l 0.0113,-0.31402 0.2038,0.0135 c 0.272,0.018 0.48007,0.14344 0.61903,0.37514 0.12205,0.20357 0.1412,0.30706 0.14165,0.772 3.6e-4,0.31536 -0.009,0.37039 -0.0669,0.44515 l -0.0671,0.0853 H 17.14856 13.3035 Z m 3.41847,-2.9326 c -1.07173,-0.11485 -1.93138,-0.55189 -2.59794,-1.32099 -0.24007,-0.27702 -0.72658,-0.97573 -0.69875,-1.00357 0.009,-0.009 0.13196,0.082 0.27277,0.2029 0.14074,0.1207 0.31663,0.26678 0.39074,0.32447 0.13647,0.10629 0.36208,0.21685 0.38845,0.19051 0.009,-0.009 -0.0522,-0.11755 -0.13376,-0.24348 -0.19839,-0.30672 -0.35397,-0.64583 -0.43977,-0.95877 -0.0592,-0.21573 -0.068,-0.31366 -0.0543,-0.59891 0.0203,-0.4295 0.073,-0.5851 0.46175,-1.37699 0.3024,-0.615909 0.44242,-0.991768 0.48241,-1.294937 0.0113,-0.08895 0.0408,-0.442897 0.0644,-0.786374 0.0236,-0.343454 0.0522,-0.63372 0.0635,-0.645001 0.0113,-0.01126 0.0723,0.0367 0.13579,0.106513 0.2849,0.314022 0.41682,0.585417 0.47829,0.983975 l 0.0374,0.241828 0.27007,-0.322783 c 0.43866,-0.524234 0.68362,-0.989717 0.80133,-1.522621 0.0736,-0.333231 0.0739,-1.065921 6.9e-4,-1.807347 -0.0297,-0.300759 -0.0482,-0.552676 -0.041,-0.559814 0.0158,-0.01576 0.75787,0.727465 1.07117,1.074275 0.98767,1.093348 1.57137,2.122879 1.78217,3.143402 0.0788,0.382096 0.12273,0.934794 0.0995,1.254084 l -0.0203,0.28606 0.0696,-0.0486 c 0.19861,-0.13917 0.45116,-0.627486 0.45116,-0.872309 0,-0.145921 0.0633,-0.09233 0.19591,0.165962 0.22519,0.437607 0.27351,0.642707 0.27261,1.154127 -7e-4,0.48719 -0.0335,0.65637 -0.28817,1.48916 -0.0599,0.19591 -0.10404,0.36115 -0.0984,0.36732 0.005,0.007 0.0788,-0.0358 0.16259,-0.0934 0.2262,-0.1556 0.51014,-0.46087 0.62413,-0.67097 0.0876,-0.16123 0.10088,-0.17384 0.10156,-0.0961 0.001,0.14434 -0.12678,0.6933 -0.23208,0.99307 -0.32339,0.92156 -0.88435,1.56046 -1.69413,1.92947 -0.51925,0.23665 -1.08046,0.34073 -1.79586,0.33314 -0.2582,-0.002 -0.5204,-0.0113 -0.58274,-0.018 z m 1.30407,-0.6178 c 0.25471,-0.11732 0.5504,-0.39588 0.66102,-0.62257 0.23149,-0.47449 0.2191,-1.00528 -0.0363,-1.54269 -0.0926,-0.19501 -0.35791,-0.62602 -0.38534,-0.62602 -0.004,0 -0.002,0.10179 0.005,0.22593 0.0113,0.18601 1.3e-4,0.25046 -0.0585,0.36422 -0.17497,0.33951 -0.5162,0.53419 -0.7587,0.43285 -0.2273,-0.095 -0.29855,-0.34566 -0.24642,-0.8671 0.045,-0.45112 0.15245,-0.81448 0.39468,-1.3365 0.42052,-0.906065 0.50566,-1.222588 0.44945,-1.670934 -0.0311,-0.247773 -0.14074,-0.611156 -0.23924,-0.793197 l -0.0511,-0.09435 -10e-4,0.198839 c -0.002,0.404503 -0.22226,0.914055 -0.82806,1.921532 -0.51457,0.85574 -0.75912,1.29008 -0.91624,1.62738 -0.44924,0.96448 -0.44974,1.7007 -10e-4,2.20363 0.1905,0.21393 0.4632,0.40851 0.76151,0.54376 0.29337,0.13309 0.40939,0.15583 0.74019,0.14547 0.24631,-0.007 0.3253,-0.0248 0.5109,-0.11034 z"
       id="path90183" />
    <path
       style="fill:#000000;fill-opacity:1;stroke:none;stroke-width:0.595805px;stroke-linecap:butt;stroke-linejoin:miter;stroke-opacity:1"
       d="m 11.41736,29.066287 -0.86327,0.863321 14.41892,14.285275 0.81657,-0.7948 z"
       id="path90325"
       sodipodi:nodetypes="ccccc" />
    <path
       style="fill:#ffffff;stroke:none;stroke-width:0.595805px;stroke-linecap:butt;stroke-linejoin:miter;stroke-opacity:1"
       d="m 10.55409,29.929608 14.41892,14.285275 -5.46749,-3.93617 -5.42634,-5.446884 z"
       id="path90393"
       sodipodi:nodetypes="ccccc" />
  </g>
</svg>
