<?xml version="1.0" encoding="UTF-8" standalone="no"?>
<!-- Created with Inkscape (http://www.inkscape.org/) -->

<svg
   width="23.983908mm"
   height="38.984756mm"
   viewBox="0 0 23.983909 38.984757"
   preserveAspectRatio="none"
   version="1.1"
   id="svg479"
   inkscape:export-filename="target_14.svg"
   inkscape:export-xdpi="96"
   inkscape:export-ydpi="96"
   xmlns:inkscape="http://www.inkscape.org/namespaces/inkscape"
   xmlns:sodipodi="http://sodipodi.sourceforge.net/DTD/sodipodi-0.dtd"
   xmlns="http://www.w3.org/2000/svg"
   xmlns:svg="http://www.w3.org/2000/svg">
  <sodipodi:namedview
     id="namedview481"
     pagecolor="#ffffff"
     bordercolor="#666666"
     borderopacity="1.0"
     inkscape:showpageshadow="2"
     inkscape:pageopacity="0.0"
     inkscape:pagecheckerboard="0"
     inkscape:deskcolor="#d1d1d1"
     inkscape:document-units="mm"
     showgrid="false" />
  <defs
     id="defs476" />
  <g
     inkscape:label="Layer 1"
     inkscape:groupmode="layer"
     id="layer1"
     transform="translate(39.695265,42.311796)">
    <g
       id="g124046"
       transform="matrix(0.41843537,0,0,0.41843537,-76.445485,-281.0259)">
      <path
         id="rect124042"
         style="opacity:1;stroke-width:1.15558;stroke-linecap:round;stroke-linejoin:round;stroke-dashoffset:347.717;paint-order:stroke markers fill"
         d="m 114.6046,617.34119 h 3.76437 v 38.63774 h -3.76437 z" />
      <path
         id="ellipse124044"
         style="opacity:1;fill:#f9aaff;stroke-width:0.826373;stroke-linecap:round;stroke-linejoin:round;stroke-dashoffset:347.717;paint-order:stroke markers fill"
         d="m 137.50128,599.46497 a 21.014488,21.291557 0 0 1 -21.01449,21.29155 21.014488,21.291557 0 0 1 -21.014485,-21.29155 21.014488,21.291557 0 0 1 21.014485,-21.29156 21.014488,21.291557 0 0 1 21.01449,21.29156 z" />
    </g>
    <path
       style="fill:#000000;stroke-width:0.103818"
       d="m -37.976371,-31.56962 v -3.01074 h 10.381776 10.381776 v 3.01074 3.01072 h -0.826547 -0.826548 l -0.117322,-0.44123 c -0.18758,-0.70506 -0.837536,-1.85668 -1.322858,-2.34419 -0.847467,-0.85125 -2.019676,-1.19416 -3.119172,-0.91252 -0.779506,0.19951 -1.319818,0.53124 -1.825745,1.12017 -0.414996,0.48309 -1.033629,1.69052 -1.147888,2.24035 l -0.07003,0.33742 h -1.113323 -1.1133 l -0.226988,-0.70461 c -0.364554,-1.13192 -1.030161,-2.07824 -1.814665,-2.58018 -0.550942,-0.35237 -1.552932,-0.59082 -2.140264,-0.50926 -0.704991,0.0977 -1.711507,0.62237 -2.12772,1.10864 -0.434295,0.50732 -1.039303,1.63827 -1.200537,2.24418 l -0.117322,0.44123 h -0.826547 -0.826525 z m 0,-3.84128 v -0.31145 h 10.381776 10.381776 v 0.31145 0.31146 h -10.381776 -10.381776 z"
       id="path124344" />
    <path
       style="fill:#000000;stroke-width:0.00913246"
       d="m -31.671215,-24.69996 0.625794,-0.53437 0.04999,0.0585 c 0.02747,0.0322 0.105387,0.11281 0.171817,0.1806 0.831344,0.82794 1.802686,1.23503 2.862099,1.19963 0.595866,-0.0203 1.159238,-0.15087 1.619317,-0.37617 0.31105,-0.15245 0.695196,-0.39523 1.141335,-0.7217 0.290536,-0.21258 0.739062,-0.56862 0.718435,-0.57026 -0.0023,-2.5e-4 -0.138489,0.0561 -0.300331,0.1252 -0.40698,0.17362 -0.74897,0.30855 -0.899508,0.35465 -0.219106,0.0671 -0.439969,0.10268 -0.689679,0.11124 -0.162134,0.005 -0.560376,-0.0257 -0.753902,-0.0592 -0.577693,-0.0995 -1.109989,-0.34226 -1.649288,-0.75167 -0.249192,-0.18916 -0.580261,-0.49676 -0.756109,-0.70236 l -0.06981,-0.0815 0.618858,-0.52845 c 0.535763,-0.45751 0.617168,-0.52934 0.606224,-0.53542 -0.01126,-0.007 -1.508007,-0.28887 -3.179521,-0.60017 -0.165062,-0.0306 -0.424725,-0.0793 -0.576906,-0.10787 -0.152226,-0.0284 -0.279344,-0.0507 -0.282496,-0.0493 -0.0023,7.2e-4 -0.0023,0.10111 7.43e-4,0.22136 0.0045,0.12025 0.01351,0.50646 0.0241,0.85827 0.009,0.35183 0.0268,0.96957 0.03806,1.37278 0.01126,0.40322 0.02612,0.93818 0.03288,1.18874 0.0068,0.25052 0.01351,0.46154 0.01801,0.46877 0.0045,0.0113 0.0921,-0.061 0.630748,-0.52085 z"
       id="path124578" />
  </g>
</svg>
