<?xml version="1.0" encoding="UTF-8" standalone="no"?>
<!-- Created with Inkscape (http://www.inkscape.org/) -->

<svg
   width="23.983906mm"
   height="38.984764mm"
   viewBox="0 0 23.983908 38.984765"
   preserveAspectRatio="none"
   version="1.1"
   id="svg479"
   inkscape:export-filename="target_08.svg"
   inkscape:export-xdpi="96"
   inkscape:export-ydpi="96"
   xmlns:inkscape="http://www.inkscape.org/namespaces/inkscape"
   xmlns:sodipodi="http://sodipodi.sourceforge.net/DTD/sodipodi-0.dtd"
   xmlns="http://www.w3.org/2000/svg"
   xmlns:svg="http://www.w3.org/2000/svg">
  <sodipodi:namedview
     id="namedview481"
     pagecolor="#ffffff"
     bordercolor="#666666"
     borderopacity="1.0"
     inkscape:showpageshadow="2"
     inkscape:pageopacity="0.0"
     inkscape:pagecheckerboard="0"
     inkscape:deskcolor="#d1d1d1"
     inkscape:document-units="mm"
     showgrid="false" />
  <defs
     id="defs476">
    <marker
       style="overflow:visible"
       id="Arrow2Send-3"
       refX="0"
       refY="0"
       orient="auto"
       inkscape:stockid="Arrow2Send"
       inkscape:isstock="true">
      <path
         transform="matrix(-0.3,0,0,-0.3,0.69,0)"
         d="M 8.7185878,4.0337352 -2.2072895,0.01601326 8.7185884,-4.0017078 c -1.7454984,2.3720609 -1.7354408,5.6174519 -6e-7,8.035443 z"
         style="fill:context-stroke;fill-rule:evenodd;stroke:context-stroke;stroke-width:0.625;stroke-linejoin:round"
         id="path58731-6" />
    </marker>
  </defs>
  <g
     inkscape:label="Layer 1"
     inkscape:groupmode="layer"
     id="layer1"
     transform="translate(34.650875,14.110882)">
    <g
       id="g72011-1"
       transform="matrix(0.41843537,0,0,0.41843537,-71.401095,-252.825)">
      <path
         id="rect72009-2"
         style="opacity:1;stroke-width:1.15558;stroke-linecap:round;stroke-linejoin:round;stroke-dashoffset:347.717;paint-order:stroke markers fill"
         d="m 114.6046,617.34119 h 3.76437 v 38.63774 h -3.76437 z" />
      <path
         id="ellipse71999-1"
         style="opacity:1;fill:#f9aaff;stroke-width:0.826373;stroke-linecap:round;stroke-linejoin:round;stroke-dashoffset:347.717;paint-order:stroke markers fill"
         d="m 137.50128,599.46497 a 21.014488,21.291557 0 0 1 -21.01449,21.29155 21.014488,21.291557 0 0 1 -21.014485,-21.29155 21.014488,21.291557 0 0 1 21.014485,-21.29156 21.014488,21.291557 0 0 1 21.01449,21.29156 z" />
    </g>
    <g
       id="g58661"
       transform="matrix(2.2518656,0,0,2.2518656,-325.20503,-748.8759)">
      <path
         style="fill:#000000;stroke-width:0.0127065"
         d="m 134.63216,331.69405 c -0.20316,-0.0137 -0.41855,-0.0478 -0.59731,-0.1527 -0.2362,-0.0971 -0.41585,-0.29459 -0.56446,-0.4909 -0.15059,-0.2165 -0.20374,-0.48584 -0.22221,-0.74759 -0.025,-0.24809 0.0507,-0.49463 0.16195,-0.71258 0.20353,-0.37245 0.57397,-0.65196 0.99444,-0.71992 0.21518,-0.0301 0.44973,-0.0296 0.65026,0.0407 0.28083,0.0758 0.54186,0.2637 0.72371,0.49569 l 2.84771,-0.36675 0.59262,0.48455 c 0,0 -0.31495,0.56367 -0.52662,0.84167 l -0.38735,-0.28526 -0.32673,0.35755 -0.3633,-0.26876 -0.28953,0.34782 -0.38755,-0.29665 -0.41052,0.52447 -0.56646,0.0735 c -0.18993,0.43394 -0.58503,0.78118 -1.06255,0.84705 -0.0876,0.012 -0.17847,0.035 -0.2661,0.0281 z m -0.48881,-0.98896 c 0.24887,-0.0703 0.36332,-0.41541 0.18069,-0.60379 -0.16279,-0.22463 -0.58079,-0.15635 -0.64145,0.11947 -0.097,0.21778 0.0929,0.49354 0.33098,0.50083 0.0442,0.009 0.0899,0.004 0.12978,-0.0165 z"
         id="path56573"
         sodipodi:nodetypes="sccccccccccccccccccssscccss" />
      <path
         style="fill:#000000;stroke:none;stroke-width:0.264583px;stroke-linecap:butt;stroke-linejoin:miter;stroke-opacity:1"
         d="m 132.90646,330.94948 c -0.11617,0.0259 -1.14886,-0.0259 -1.14886,-0.0259 l -2.50426,1.88466 1.04559,1.51029 2.53008,-2.07828 z"
         id="path56715" />
      <path
         style="fill:none;stroke:#000000;stroke-width:0.264583px;stroke-linecap:butt;stroke-linejoin:miter;stroke-opacity:1"
         d="m 132.7322,331.12376 c 0.58734,0.0968 1.09399,-0.39373 1.09399,-0.39373 0,0 0.15817,-0.37433 -0.32593,-0.25172 -0.48407,0.12264 -0.76806,0.64545 -0.76806,0.64545 z"
         id="path56783"
         sodipodi:nodetypes="ccsc" />
    </g>
    <path
       style="fill:none;stroke:#000000;stroke-width:1.04712;stroke-linecap:butt;stroke-linejoin:miter;stroke-miterlimit:4;stroke-dasharray:none;stroke-opacity:1;marker-end:url(#Arrow2Send-3)"
       d="m -26.056562,3.828603 1.797889,-1.65113 1.637512,1.76424 1.883302,-3.71639 1.880781,1.44476 1.594749,-3.0627 3.510275,-1.23355"
       id="path58696"
       sodipodi:nodetypes="ccccccc" />
    <path
       style="color:#000000;fill:#f9aaff;fill-opacity:1;stroke-width:2.25187;-inkscape-stroke:none"
       d="m -28.644902,-2.045837 c -0.52912,0.1216 -0.897188,0.60174 -1.060651,1.09637 -0.01576,0.0531 -0.0662,0.161 -0.0662,0.161 -0.696682,-0.0248 -1.627918,0.0268 -1.945814,0.37086 -0.444834,0.33706 -0.602622,0.99017 -0.349242,1.48997 0.216855,0.47524 0.807834,0.78937 1.313198,0.60213 0.451409,-0.1824 0.668444,-0.66045 0.839676,-1.08346 0.139165,-0.35656 0.247277,-0.72483 0.411528,-1.07133 0.468118,-0.0135 0.944455,-0.0203 1.392576,-0.17362 0.28324,-0.0831 0.643156,-0.20762 0.700803,-0.53995 0.04414,-0.36253 -0.26849,-0.64615 -0.576432,-0.7714 -0.205596,-0.0885 -0.438506,-0.12925 -0.659437,-0.0808 z m 0.07927,0.36505 c 0.286978,-0.0351 0.623429,0.0815 0.771196,0.34226 0.07656,0.22742 -0.267814,0.26111 -0.419477,0.32461 -0.360636,0.1279 -0.745503,0.12025 -1.121879,0.14209 0.125203,-0.3557 0.38124,-0.72154 0.77016,-0.80903 z m -1.359046,1.24909 c -0.240994,0.51862 -0.339266,1.11424 -0.705779,1.56851 -0.142994,0.18893 -0.396396,0.26374 -0.619624,0.18893 -0.502594,-0.13173 -0.731608,-0.8029 -0.43792,-1.22481 0.183077,-0.30704 0.542564,-0.44215 0.885163,-0.45728 0.264684,-0.0158 0.529842,-0.018 0.791238,-0.0691 0.02882,-0.002 0.05787,-0.004 0.08692,-0.007 z"
       id="path59794"
       sodipodi:nodetypes="cccccccccccccscccsscccccccc" />
  </g>
</svg>
