<?xml version="1.0" encoding="UTF-8" standalone="no"?>
<!-- Created with Inkscape (http://www.inkscape.org/) -->

<svg
   width="22.761789mm"
   height="18.063551mm"
   viewBox="0 0 22.761789 18.063551"
   version="1.1"
   id="svg1376"
   inkscape:version="1.2 (dc2aedaf03, 2022-05-15)"
   sodipodi:docname="check.svg"
   xmlns:inkscape="http://www.inkscape.org/namespaces/inkscape"
   xmlns:sodipodi="http://sodipodi.sourceforge.net/DTD/sodipodi-0.dtd"
   xmlns="http://www.w3.org/2000/svg"
   xmlns:svg="http://www.w3.org/2000/svg">
  <sodipodi:namedview
     id="namedview1378"
     pagecolor="#ffffff"
     bordercolor="#000000"
     borderopacity="0.25"
     inkscape:showpageshadow="2"
     inkscape:pageopacity="0.0"
     inkscape:pagecheckerboard="0"
     inkscape:deskcolor="#d1d1d1"
     inkscape:document-units="mm"
     showgrid="false"
     inkscape:zoom="0.73851712"
     inkscape:cx="152.33229"
     inkscape:cy="285.70766"
     inkscape:window-width="1920"
     inkscape:window-height="1009"
     inkscape:window-x="-8"
     inkscape:window-y="-8"
     inkscape:window-maximized="1"
     inkscape:current-layer="layer1" />
  <defs
     id="defs1373" />
  <g
     inkscape:label="Vrstva 1"
     inkscape:groupmode="layer"
     id="layer1"
     transform="translate(-64.929117,-73.01044)">
    <path
       style="fill:#000000;stroke-width:0.0448931"
       d="m 64.929117,83.96577 3.22051,-2.97967 4.1758,3.9464 11.37193,-11.92206 3.99355,1.93783 -15.24154,16.12572 z"
       id="path58314"
       sodipodi:nodetypes="ccccccc" />
  </g>
</svg>
