<?xml version="1.0" encoding="UTF-8" standalone="no"?>
<!-- Created with Inkscape (http://www.inkscape.org/) -->

<svg
   width="10.31469mm"
   height="9.4101496mm"
   viewBox="0 0 10.314689 9.4101493"
   version="1.1"
   id="svg136857"
   inkscape:version="1.1.2 (0a00cf5339, 2022-02-04)"
   sodipodi:docname="effect_06.svg"
   inkscape:export-filename="../../../../../home/zboucek/snap/inkscape/10423/bitmap.png"
   inkscape:export-xdpi="96"
   inkscape:export-ydpi="96"
   xmlns:inkscape="http://www.inkscape.org/namespaces/inkscape"
   xmlns:sodipodi="http://sodipodi.sourceforge.net/DTD/sodipodi-0.dtd"
   xmlns="http://www.w3.org/2000/svg"
   xmlns:svg="http://www.w3.org/2000/svg">
  <sodipodi:namedview
     id="namedview136859"
     pagecolor="#ffffff"
     bordercolor="#666666"
     borderopacity="1.0"
     inkscape:pageshadow="2"
     inkscape:pageopacity="0.0"
     inkscape:pagecheckerboard="0"
     inkscape:document-units="mm"
     showgrid="false"
     inkscape:zoom="7.2466938"
     inkscape:cx="66.789078"
     inkscape:cy="16.145294"
     inkscape:window-width="1280"
     inkscape:window-height="1371"
     inkscape:window-x="20"
     inkscape:window-y="20"
     inkscape:window-maximized="0"
     inkscape:current-layer="layer1"
     inkscape:showpageshadow="2"
     inkscape:deskcolor="#d1d1d1"
     fit-margin-top="0"
     fit-margin-left="0"
     fit-margin-right="0"
     fit-margin-bottom="0" />
  <defs
     id="defs136854" />
  <g
     inkscape:label="Layer 1"
     inkscape:groupmode="layer"
     id="layer1"
     transform="translate(-182.69311,-151.80772)">
    <path
       id="path226"
       style="fill:#ffaaaa;fill-opacity:1;fill-rule:nonzero;stroke:none;stroke-width:0.205784"
       d="m 193.00779,156.9204 c 0,-2.81922 -2.31362,-5.11268 -5.15732,-5.11268 -2.84395,0 -5.15736,2.29346 -5.15736,5.11268 0,1.21308 0.42844,2.32863 1.14336,3.20629 h 0.0356 c -1.44418,-1.86419 -1.32484,-4.52514 0.37204,-6.20743 1.27216,-1.26102 3.0989,-1.64337 4.72622,-1.15279 1.85042,0.49057 3.21724,2.16688 3.21724,4.15393 0,1.26453 -0.55379,2.40334 -1.43329,3.19086 l 1.93806,-0.46691 c 0,0 -0.24368,-0.06 -0.41796,-0.0987 0.4655,-0.76779 0.73342,-1.66603 0.73342,-2.62518 m -6.38155,-2.7363 h 2.22266 c -0.0421,-0.19363 -0.21666,-0.33995 -0.42411,-0.33995 h -1.37446 c -0.20737,0 -0.38189,0.14633 -0.42409,0.33995 m 3.22133,0.22429 h -4.21979 c -0.23869,0 -0.434,0.19367 -0.434,0.43031 v 4.37534 c 0,0.23666 0.19531,0.43029 0.434,0.43029 h 4.21979 c 0.23874,0 0.43402,-0.19363 0.43402,-0.43029 v -4.37534 c 0,-0.23664 -0.19528,-0.43031 -0.43402,-0.43031 m -0.89594,4.26506 c 0,-0.20536 0.16799,-0.37205 0.3751,-0.37205 0.20722,0 0.37515,0.16664 0.37515,0.37205 0,0.20536 -0.168,0.37186 -0.37515,0.37186 -0.20719,0 -0.3751,-0.16646 -0.3751,-0.37186 m -3.17836,0 c 0,-0.20536 0.16817,-0.37205 0.37535,-0.37205 0.20726,0 0.37517,0.16664 0.37517,0.37205 0,0.20536 -0.16783,0.37186 -0.37517,0.37186 -0.20723,0 -0.37535,-0.16646 -0.37535,-0.37186 m 3.96792,-2.18232 c 0,0.1579 -0.13004,0.28686 -0.28933,0.28686 h -3.42856 c -0.15908,0 -0.28935,-0.12904 -0.28935,-0.28686 v -1.25918 c 0,-0.15773 0.13022,-0.28686 0.28935,-0.28686 h 3.42856 c 0.15926,0 0.28933,0.12921 0.28933,0.28686 z m -3.69465,3.41517 -1.75407,1.18984 v 0.12166 h 6.8902 v -0.15019 l -1.71559,-1.16123 z m 3.33452,0.56159 h -3.246 v -0.31155 h 3.246 z m -3.8156,0.17147 h 4.38521 v 0.31156 h -4.38521 z"
       inkscape:connector-curvature="0"
       inkscape:export-filename="C:\Users\Filip\OneDrive\Plocha\ss\path86.png"
       inkscape:export-xdpi="1360.8566"
       inkscape:export-ydpi="1360.8566" />
  </g>
</svg>
