<?xml version="1.0" encoding="UTF-8" standalone="no"?>
<!-- Created with Inkscape (http://www.inkscape.org/) -->

<svg
   width="94.395142mm"
   height="36.706268mm"
   viewBox="0 0 94.395142 36.706268"
   version="1.1"
   id="svg21136"
   inkscape:version="1.1.2 (b8e25be833, 2022-02-05)"
   sodipodi:docname="10-game22a_progress.svg"
   xmlns:inkscape="http://www.inkscape.org/namespaces/inkscape"
   xmlns:sodipodi="http://sodipodi.sourceforge.net/DTD/sodipodi-0.dtd"
   xmlns:xlink="http://www.w3.org/1999/xlink"
   xmlns="http://www.w3.org/2000/svg"
   xmlns:svg="http://www.w3.org/2000/svg">
  <sodipodi:namedview
     id="namedview21138"
     pagecolor="#ffffff"
     bordercolor="#666666"
     borderopacity="1.0"
     inkscape:pageshadow="2"
     inkscape:pageopacity="0.0"
     inkscape:pagecheckerboard="0"
     inkscape:document-units="mm"
     showgrid="false"
     inkscape:zoom="0.64"
     inkscape:cx="777.34375"
     inkscape:cy="420.3125"
     inkscape:window-width="1920"
     inkscape:window-height="1017"
     inkscape:window-x="-8"
     inkscape:window-y="-8"
     inkscape:window-maximized="1"
     inkscape:current-layer="layer1"
     fit-margin-top="0"
     fit-margin-left="0"
     fit-margin-right="0"
     fit-margin-bottom="0"
     inkscape:showpageshadow="2"
     inkscape:deskcolor="#d1d1d1" />
  <defs
     id="defs21133">
    <linearGradient
       inkscape:collect="always"
       id="linearGradient11531">
      <stop
         style="stop-color:#000000;stop-opacity:1"
         offset="0"
         id="stop11527" />
      <stop
         style="stop-color:#000000;stop-opacity:0"
         offset="1"
         id="stop11529" />
    </linearGradient>
    <linearGradient
       inkscape:collect="always"
       xlink:href="#linearGradient11531"
       id="linearGradient94454-5"
       gradientUnits="userSpaceOnUse"
       gradientTransform="matrix(0.18581721,0,0,0.12845588,412.14396,164.75999)"
       x1="1104.0225"
       y1="857.00208"
       x2="1104.0225"
       y2="618.05658" />
  </defs>
  <g
     inkscape:label="Layer 1"
     inkscape:groupmode="layer"
     id="layer1"
     transform="translate(-585.73639,-241.41401)">
    <rect
       style="fill:url(#linearGradient94454-5);fill-opacity:1;stroke-width:0.0282463;stroke-linecap:round;stroke-linejoin:round;stroke-dashoffset:347.717;paint-order:stroke markers fill"
       id="rect94318-2"
       width="94.395142"
       height="36.706268"
       x="585.73639"
       y="241.41402" />
  </g>
</svg>
