<?xml version="1.0" encoding="UTF-8" standalone="no"?>
<!-- Created with Inkscape (http://www.inkscape.org/) -->

<svg
   width="23.9839mm"
   height="38.984772mm"
   viewBox="0 0 23.983901 38.984772"
   preserveAspectRatio="none"
   version="1.1"
   id="svg479"
   inkscape:export-filename="target_09.svg"
   inkscape:export-xdpi="96"
   inkscape:export-ydpi="96"
   sodipodi:docname="target_10.svg"
   inkscape:version="1.2 (1:1.2.1+202207142221+cd75a1ee6d)"
   xmlns:inkscape="http://www.inkscape.org/namespaces/inkscape"
   xmlns:sodipodi="http://sodipodi.sourceforge.net/DTD/sodipodi-0.dtd"
   xmlns="http://www.w3.org/2000/svg"
   xmlns:svg="http://www.w3.org/2000/svg">
  <sodipodi:namedview
     id="namedview481"
     pagecolor="#ffffff"
     bordercolor="#666666"
     borderopacity="1.0"
     inkscape:showpageshadow="2"
     inkscape:pageopacity="0.0"
     inkscape:pagecheckerboard="0"
     inkscape:deskcolor="#d1d1d1"
     inkscape:document-units="mm"
     showgrid="false"
     inkscape:zoom="6.7868381"
     inkscape:cx="45.45563"
     inkscape:cy="72.419585"
     inkscape:window-width="2560"
     inkscape:window-height="1376"
     inkscape:window-x="1920"
     inkscape:window-y="27"
     inkscape:window-maximized="1"
     inkscape:current-layer="layer1" />
  <defs
     id="defs476" />
  <g
     inkscape:label="Layer 1"
     inkscape:groupmode="layer"
     id="layer1"
     transform="translate(-1.55349,-106.23411)">
    <path
       id="rect72037-4"
       style="stroke-width:0.483536;stroke-linecap:round;stroke-linejoin:round;stroke-dashoffset:347.717;paint-order:stroke markers fill"
       d="m 12.757844,125.83733 h 1.575146 v 16.1674 h -1.575146 z" />
    <path
       id="ellipse72031-8"
       style="fill:#aafbff;stroke-width:0.345784;stroke-linecap:round;stroke-linejoin:round;stroke-dashoffset:347.717;paint-order:stroke markers fill"
       d="m 22.338625,118.35729 a 8.7932051,8.9091405 0 0 1 -8.793206,8.90913 8.7932051,8.9091405 0 0 1 -8.7932037,-8.90913 8.7932051,8.9091405 0 0 1 8.7932037,-8.90915 8.7932051,8.9091405 0 0 1 8.793206,8.90915 z" />
    <path
       style="fill:#000000;stroke-width:0.0294509"
       d="m 5.0259558,124.04655 c -0.141723,-0.0341 -0.250163,-0.10619 -0.3419224,-0.22775 -0.071915,-0.0951 -0.09628,-0.22547 -0.8025412,-4.26958 -0.6958856,-3.98449 -0.7257573,-4.17749 -0.6958293,-4.29817 0.0397,-0.15349 0.1550722,-0.29712 0.2925276,-0.36444 0.065707,-0.0317 0.4125524,-0.10111 0.9738716,-0.19339 l 0.8718643,-0.14341 0.2575706,1.43489 0.2575743,1.43491 0.086209,0.0521 0.086209,0.0521 2.201617,-0.38486 2.2015947,-0.38485 0.06341,-0.0783 0.06341,-0.0783 -0.244489,-1.4372 -0.244484,-1.43717 0.520078,-0.0977 0.520122,-0.0977 0.708231,0.49702 0.708252,0.49703 0.661215,3.78628 c 0.632035,3.61911 0.658385,3.79209 0.628049,3.91171 -0.04022,0.15178 -0.116819,0.25622 -0.249555,0.34115 -0.08833,0.0566 -0.568478,0.14545 -4.2565904,0.78903 -3.647416,0.63633 -4.1703317,0.72226 -4.2660004,0.6992 z m 7.5563482,-1.67551 0.05885,-0.0838 -0.408189,-2.3351 -0.408189,-2.3351 -0.07821,-0.063 -0.07821,-0.063 -3.2928481,0.57498 -3.2928703,0.57498 -0.052059,0.0866 -0.052059,0.0866 0.4081894,2.3351 0.4081894,2.33509 0.083787,0.0589 0.083787,0.0589 3.280877,-0.57352 3.2808766,-0.57352 z m -6.0101314,-0.59511 -0.063392,-0.36264 2.378891,-0.41585 2.3789134,-0.41585 0.06339,0.36264 0.06339,0.36264 -2.3789131,0.41585 -2.3788909,0.41585 z m -0.2834191,-1.62134 c -0.052659,-0.30124 -0.056837,-0.36371 -0.020156,-0.38532 0.065322,-0.0391 4.6306205,-0.82969 4.6777695,-0.81096 0.03075,0.0126 0.05475,0.10618 0.09359,0.36437 l 0.05173,0.34735 -2.3705061,0.42112 -2.3705062,0.42113 z m 7.1286105,1.10065 c -0.04731,-0.27064 -0.03746,-0.26571 -0.379835,-0.20586 -0.338823,0.0592 -0.334373,0.054 -0.29081,0.30316 0.02017,0.11537 0.04689,0.21682 0.05966,0.22555 0.01281,0.009 0.164173,-0.008 0.337063,-0.0387 l 0.314286,-0.0549 z m -4.9747085,-5.71104 -0.1825651,-1.04438 0.565715,-0.0989 0.5657151,-0.0989 0.1825651,1.04439 0.1825651,1.04439 -0.5657151,0.0989 -0.565715,0.0989 z"
       id="path88160" />
    <path
       id="rect88291"
       style="stroke-width:0.560688;stroke-linecap:round;stroke-linejoin:round;stroke-dashoffset:347.717;paint-order:stroke markers fill"
       d="m 3.7038331,114.83299 7.2918749,-1.27467 0.08244,0.47158 -7.2918744,1.27467 z" />
    <path
       style="fill:#000000;stroke-width:0.00763722"
       d="m 13.86102,115.8022 c -0.0642,-0.0288 -0.10877,-0.0806 -0.13129,-0.15178 l -0.0135,-0.0408 0.0847,-0.65516 0.0849,-0.65515 0.0257,-0.0236 c 0.0286,-0.0268 0.0705,-0.0662 0.48307,-0.45734 0.16123,-0.1529 0.35258,-0.33393 0.42524,-0.40252 0.0727,-0.0687 0.18556,-0.17542 0.2507,-0.2371 0.21325,-0.20199 0.42637,-0.40371 0.88093,-0.83391 0.54926,-0.51979 0.56963,-0.53909 0.66827,-0.63264 0.0437,-0.0414 0.17767,-0.16844 0.29805,-0.28195 0.12025,-0.11372 0.26678,-0.25237 0.32569,-0.30828 0.059,-0.0559 0.12701,-0.1207 0.15155,-0.14367 0.0234,-0.023 0.0448,-0.0441 0.045,-0.0466 2.9e-4,-0.002 -0.0383,0.0203 -0.0858,0.0525 -0.0475,0.0315 -0.22849,0.15132 -0.40216,0.26633 -0.17384,0.11484 -0.41407,0.27432 -0.53416,0.35399 -0.12025,0.0795 -0.2646,0.17542 -0.32112,0.21235 -0.0565,0.0372 -0.21213,0.14007 -0.34548,0.22872 -0.13331,0.0887 -0.29981,0.19884 -0.36967,0.2448 -0.07,0.0459 -0.28211,0.18668 -0.47161,0.31247 -0.1896,0.12588 -0.38873,0.25775 -0.44271,0.29313 -0.0838,0.055 -0.72506,0.4796 -1.00145,0.66328 -0.0482,0.032 -0.12543,0.0835 -0.17182,0.11395 l -0.084,0.0556 -0.0475,-0.0266 c -0.0263,-0.0158 -0.13624,-0.0779 -0.2446,-0.13939 -0.10854,-0.0615 -0.35379,-0.20132 -0.5451,-0.31047 -0.19141,-0.10921 -0.39264,-0.22383 -0.44736,-0.25518 -0.11485,-0.0653 -0.14997,-0.0995 -0.16867,-0.16371 -0.009,-0.0329 -0.0113,-0.0563 -0.004,-0.10313 0.0135,-0.10899 0.0495,-0.14435 0.21303,-0.21326 0.12701,-0.0536 0.57983,-0.2425 0.73861,-0.30837 0.0581,-0.0243 0.28527,-0.11889 0.50462,-0.21032 0.21933,-0.0914 0.44648,-0.18623 0.50467,-0.21032 0.0581,-0.0243 0.28164,-0.11733 0.49653,-0.20695 0.21483,-0.0896 0.57017,-0.23762 0.78953,-0.32895 0.56405,-0.23492 0.90797,-0.37836 0.99309,-0.41414 0.0403,-0.018 0.22159,-0.0926 0.40293,-0.16799 0.18105,-0.0754 0.43218,-0.17993 0.55754,-0.23217 0.12543,-0.0522 0.31582,-0.13173 0.42326,-0.17655 0.10741,-0.0446 0.22474,-0.0937 0.2605,-0.10876 0.10471,-0.0439 0.37806,-0.15763 0.54684,-0.22764 0.0858,-0.0354 0.16934,-0.0673 0.18533,-0.0705 0.0412,-0.009 0.12182,0.009 0.15808,0.0362 0.0689,0.0473 0.10831,0.12137 0.10516,0.19816 -0.002,0.0345 -0.17249,0.60918 -0.82517,2.76705 -0.8992,2.97395 -0.8347,2.77274 -0.90332,2.81886 -0.018,0.0113 -0.0491,0.0259 -0.073,0.0333 -0.0376,0.0113 -0.0509,0.0113 -0.10065,0.002 -0.048,-0.009 -0.0736,-0.0203 -0.15426,-0.0667 -0.0534,-0.0304 -0.18893,-0.10786 -0.30125,-0.17159 -0.1126,-0.064 -0.32713,-0.18578 -0.47704,-0.27106 -0.58026,-0.32969 -0.67468,-0.38243 -0.6833,-0.38149 -0.005,5.4e-4 -0.0946,0.0817 -0.19907,0.18038 -0.16438,0.15515 -0.34719,0.32731 -0.73965,0.69686 -0.0923,0.0872 -0.13578,0.11574 -0.186,0.12295 -0.0327,0.005 -0.10314,-0.005 -0.12993,-0.0158 z"
       id="path88411" />
    <path
       style="fill:#000000;stroke-width:0.00416566"
       d="m 19.76829,117.1673 c -0.0349,-0.0158 -0.0592,-0.0439 -0.0716,-0.0829 l -0.007,-0.0225 0.0462,-0.35735 0.0464,-0.35735 0.0135,-0.0135 c 0.0158,-0.0135 0.0385,-0.036 0.26349,-0.24946 0.088,-0.0833 0.19231,-0.18217 0.23194,-0.21956 0.0396,-0.0374 0.10111,-0.0957 0.13669,-0.12925 0.1162,-0.11012 0.23255,-0.22023 0.4805,-0.45485 0.29959,-0.28354 0.31069,-0.29405 0.36449,-0.34508 0.0239,-0.0225 0.0968,-0.0919 0.16259,-0.1538 0.0655,-0.0622 0.14547,-0.13759 0.17767,-0.16822 0.0322,-0.0304 0.0694,-0.0658 0.0826,-0.0784 0.0135,-0.0135 0.0245,-0.0241 0.0245,-0.0255 1.5e-4,-0.001 -0.0203,0.0113 -0.0468,0.0286 -0.0259,0.018 -0.12476,0.0826 -0.21933,0.14525 -0.0948,0.0626 -0.22587,0.14952 -0.29135,0.19298 -0.0655,0.0432 -0.14434,0.0957 -0.17519,0.11575 -0.0309,0.0203 -0.11575,0.0763 -0.18849,0.12475 -0.0727,0.0484 -0.16348,0.10854 -0.20154,0.13354 -0.0383,0.025 -0.1538,0.10178 -0.25723,0.17047 -0.10336,0.0687 -0.21212,0.14051 -0.24147,0.15988 -0.0457,0.03 -0.39547,0.26159 -0.54623,0.36178 -0.0263,0.018 -0.0685,0.0455 -0.0937,0.0621 l -0.0457,0.0304 -0.0259,-0.0135 c -0.0135,-0.009 -0.0743,-0.0426 -0.13331,-0.0761 -0.0592,-0.0335 -0.19298,-0.10989 -0.29731,-0.16933 -0.10449,-0.0597 -0.21415,-0.12205 -0.24401,-0.13917 -0.0626,-0.0356 -0.0817,-0.0543 -0.0919,-0.0894 -0.004,-0.018 -0.007,-0.0306 -0.002,-0.0563 0.007,-0.0594 0.027,-0.0788 0.11619,-0.11619 0.0694,-0.0293 0.31626,-0.13219 0.40286,-0.16822 0.0318,-0.0135 0.15561,-0.0649 0.27525,-0.11484 0.11957,-0.0498 0.24351,-0.10156 0.27527,-0.11462 0.0318,-0.0135 0.15357,-0.064 0.27083,-0.11282 0.1171,-0.0489 0.31098,-0.12948 0.43062,-0.17947 0.30767,-0.12813 0.49526,-0.20627 0.54169,-0.22589 0.0225,-0.009 0.12092,-0.0504 0.21978,-0.0917 0.0986,-0.0412 0.23573,-0.0982 0.30409,-0.12655 0.0685,-0.0286 0.17227,-0.0718 0.23086,-0.0964 0.0585,-0.0243 0.12251,-0.0511 0.1421,-0.0592 0.0572,-0.0239 0.20627,-0.086 0.29826,-0.12408 0.0468,-0.0203 0.0923,-0.0367 0.1011,-0.0385 0.0225,-0.005 0.0664,0.004 0.0863,0.0203 0.0376,0.0259 0.059,0.0662 0.0574,0.10809 -0.001,0.018 -0.0941,0.33226 -0.4501,1.50927 -0.49046,1.6221 -0.45526,1.51234 -0.49268,1.5375 -0.009,0.007 -0.0268,0.0135 -0.0399,0.018 -0.0203,0.007 -0.0277,0.007 -0.0549,0.001 -0.0261,-0.005 -0.0401,-0.0113 -0.0842,-0.0363 -0.029,-0.0158 -0.10313,-0.0588 -0.16438,-0.0937 -0.0615,-0.0349 -0.17835,-0.10133 -0.26021,-0.14794 -0.3165,-0.17993 -0.368,-0.20853 -0.37268,-0.20808 -0.002,3e-4 -0.0516,0.0446 -0.10854,0.0984 -0.0896,0.0847 -0.18938,0.17857 -0.40345,0.38009 -0.0504,0.0475 -0.0741,0.0631 -0.10155,0.0671 -0.018,0.002 -0.0563,-0.002 -0.0709,-0.009 z"
       id="path88724" />
    <path
       style="fill:#000000;stroke-width:0.00539696"
       d="m 16.40898,122.85414 c -0.0453,-0.0203 -0.0768,-0.057 -0.0928,-0.10742 l -0.009,-0.0293 0.0599,-0.46296 0.0601,-0.46299 0.018,-0.018 c 0.0203,-0.018 0.0498,-0.0466 0.34136,-0.32321 0.11417,-0.10786 0.24917,-0.23602 0.30051,-0.28443 0.0513,-0.0484 0.13106,-0.12408 0.177,-0.16754 0.15065,-0.14277 0.30127,-0.28534 0.62252,-0.58932 0.38814,-0.36732 0.40252,-0.38094 0.47222,-0.44706 0.0309,-0.0293 0.12543,-0.11912 0.21055,-0.19929 0.0849,-0.0806 0.18848,-0.17835 0.23021,-0.21798 0.0417,-0.0394 0.0899,-0.0851 0.10696,-0.10156 0.018,-0.018 0.0318,-0.0313 0.0318,-0.0329 2.3e-4,-0.002 -0.0263,0.0135 -0.0606,0.0372 -0.0336,0.0234 -0.16169,0.10719 -0.28417,0.18826 -0.12295,0.0811 -0.29263,0.19366 -0.37745,0.25004 -0.0849,0.0561 -0.18691,0.12408 -0.22699,0.14998 -0.0401,0.0263 -0.14998,0.0988 -0.24419,0.16168 -0.0944,0.0628 -0.2119,0.14052 -0.26113,0.17294 -0.0495,0.0324 -0.19929,0.13196 -0.33325,0.22091 -0.13399,0.0889 -0.27482,0.18195 -0.31283,0.20717 -0.0592,0.0387 -0.51237,0.33893 -0.7077,0.46873 -0.0342,0.0234 -0.0887,0.059 -0.12137,0.0806 l -0.0592,0.0394 -0.0336,-0.018 c -0.018,-0.0113 -0.0964,-0.0552 -0.17272,-0.0986 -0.0768,-0.0435 -0.25002,-0.14232 -0.38518,-0.21933 -0.13534,-0.0772 -0.27745,-0.15808 -0.31614,-0.18038 -0.0811,-0.0462 -0.10584,-0.0703 -0.11912,-0.11574 -0.007,-0.0234 -0.009,-0.0396 -0.002,-0.073 0.009,-0.077 0.0349,-0.10201 0.15042,-0.15043 0.0898,-0.0378 0.40975,-0.17137 0.52194,-0.21798 0.0412,-0.018 0.20154,-0.084 0.3566,-0.14885 0.15493,-0.0644 0.31551,-0.13151 0.35663,-0.1484 0.0412,-0.018 0.19907,-0.0829 0.35089,-0.14614 0.15177,-0.0633 0.4029,-0.16777 0.55792,-0.23253 0.3986,-0.16596 0.64162,-0.26725 0.70179,-0.29265 0.0293,-0.0113 0.15673,-0.0653 0.28475,-0.11868 0.12768,-0.0534 0.3054,-0.12723 0.39397,-0.16393 0.0887,-0.0372 0.22316,-0.093 0.29911,-0.12498 0.0759,-0.0315 0.15876,-0.0662 0.18398,-0.0768 0.0741,-0.0309 0.26723,-0.11147 0.38642,-0.16078 0.0606,-0.0264 0.11957,-0.0475 0.13106,-0.05 0.029,-0.007 0.086,0.007 0.11169,0.0263 0.0486,0.0336 0.0763,0.0858 0.0743,0.14007 -0.002,0.0234 -0.12205,0.43047 -0.58314,1.95538 -0.63543,2.10158 -0.58983,1.95938 -0.63832,1.99196 -0.0113,0.009 -0.0347,0.018 -0.0516,0.0234 -0.0264,0.009 -0.0358,0.009 -0.0712,0.002 -0.0338,-0.007 -0.052,-0.0135 -0.10922,-0.0468 -0.0376,-0.0203 -0.13353,-0.0761 -0.21302,-0.12137 -0.0797,-0.0453 -0.23107,-0.13128 -0.33711,-0.19163 -0.41006,-0.23312 -0.47679,-0.27016 -0.48284,-0.26958 -0.002,3.9e-4 -0.0669,0.0577 -0.14075,0.12746 -0.11619,0.10967 -0.24536,0.23136 -0.5227,0.49244 -0.0653,0.0615 -0.0959,0.0817 -0.13151,0.0869 -0.0234,0.002 -0.073,-0.002 -0.0919,-0.0113 z"
       id="path88806" />
  </g>
</svg>
