<?xml version="1.0" encoding="UTF-8" standalone="no"?>
<!-- Created with Inkscape (http://www.inkscape.org/) -->

<svg
   width="9.0314102mm"
   height="9.2185974mm"
   viewBox="0 0 9.0314102 9.2185974"
   version="1.1"
   id="svg21136"
   inkscape:version="1.2 (dc2aedaf03, 2022-05-15)"
   sodipodi:docname="digitalizace.svg"
   xmlns:inkscape="http://www.inkscape.org/namespaces/inkscape"
   xmlns:sodipodi="http://sodipodi.sourceforge.net/DTD/sodipodi-0.dtd"
   xmlns="http://www.w3.org/2000/svg"
   xmlns:svg="http://www.w3.org/2000/svg">
  <sodipodi:namedview
     id="namedview21138"
     pagecolor="#ffffff"
     bordercolor="#666666"
     borderopacity="1.0"
     inkscape:pageshadow="2"
     inkscape:pageopacity="0.0"
     inkscape:pagecheckerboard="0"
     inkscape:document-units="mm"
     showgrid="false"
     inkscape:zoom="56.365321"
     inkscape:cx="28.004808"
     inkscape:cy="32.582091"
     inkscape:window-width="958"
     inkscape:window-height="1000"
     inkscape:window-x="953"
     inkscape:window-y="0"
     inkscape:window-maximized="0"
     inkscape:current-layer="text9159"
     inkscape:showpageshadow="2"
     inkscape:deskcolor="#d1d1d1" />
  <defs
     id="defs21133" />
  <g
     inkscape:label="Layer 1"
     inkscape:groupmode="layer"
     id="layer1"
     transform="translate(-114.59983,-136.98478)">
    <rect
       style="fill:#000000;stroke-width:0.0367121;stroke-linecap:round;stroke-linejoin:round;stroke-dashoffset:347.717;paint-order:stroke markers fill"
       id="rect71713"
       width="9.0333452"
       height="9.0314045"
       x="114.62444"
       y="139.54726"
       transform="matrix(0.99978527,-0.02072224,0,1,0,0)" />
    <g
       id="g71749"
       transform="matrix(0.11952573,0,0,0.11952573,99.881083,82.178389)">
      <circle
         style="opacity:1;fill:#aafbff;stroke-width:0.182827;stroke-linecap:round;stroke-linejoin:round;stroke-dashoffset:347.717;paint-order:stroke markers fill;fill-opacity:1"
         id="circle71735"
         cx="163.99026"
         cy="495.27539"
         r="10.326842" />
      <circle
         style="opacity:1;fill:#aafbff;stroke-width:0.0694743;stroke-linecap:round;stroke-linejoin:round;stroke-dashoffset:347.717;paint-order:stroke markers fill;fill-opacity:1"
         id="circle71737"
         cx="135.90126"
         cy="495.27539"
         r="3.9241998" />
      <circle
         style="opacity:1;fill:#aafbff;stroke-width:0.0694743;stroke-linecap:round;stroke-linejoin:round;stroke-dashoffset:347.717;paint-order:stroke markers fill;fill-opacity:1"
         id="circle71739"
         cx="152.23677"
         cy="478.99237"
         r="3.9241998" />
      <circle
         style="opacity:1;fill:#aafbff;stroke-width:0.0694743;stroke-linecap:round;stroke-linejoin:round;stroke-dashoffset:347.717;paint-order:stroke markers fill;fill-opacity:1"
         id="circle71741"
         cx="185.98645"
         cy="488.14984"
         r="3.9241998" />
      <path
         style="color:#000000;fill:#aafbff;fill-opacity:1"
         d="m 152.27213,478.55504 -1.03516,1.03516 10.21559,15.676 -25.84709,-0.72323 -0.0273,1.46484 29.47991,0.78964 -0.6875,-0.6875 21.85603,-7.47518 -0.48047,-1.38282 -22.52595,7.70761 z"
         id="path71743"
         sodipodi:nodetypes="ccccccccccc" />
      <path
         id="path71745"
         style="opacity:1;fill:#000000;stroke-width:0.571799;stroke-linecap:round;stroke-linejoin:round;stroke-miterlimit:4;stroke-dasharray:none;stroke-dashoffset:347.717;paint-order:stroke markers fill"
         d="m 162.96094,490.93945 c -2.16285,10e-4 -4.02925,2.16039 -3.63366,4.30508 -0.0419,3.43273 -0.0148,6.86626 -0.0968,10.29844 -1.31271,-1.20739 -3.41356,-1.8847 -5.00644,-0.81031 -1.89344,1.17269 -2.38363,4.10301 -0.79419,5.73158 2.1517,2.84083 4.2459,5.74056 6.63266,8.38928 1.31005,1.01871 3.03588,0.4684 4.54883,0.60973 3.49027,-0.0244 6.98946,0.0667 10.47403,-0.062 1.35363,-0.31042 1.69823,-1.81139 2.00437,-2.96755 0.86211,-2.54498 1.49937,-5.21688 1.31268,-7.92153 0.0518,-1.85689 0.20251,-4.12062 -1.37897,-5.43403 -0.81106,-0.6997 -1.95881,-0.92171 -2.9668,-0.86523 -0.74363,-1.29666 -2.29927,-2.06483 -3.7793,-1.87305 -0.66432,-1.21463 -2.04132,-1.96225 -3.41406,-1.95117 -0.0446,-1.85026 0.14597,-3.78232 -0.46484,-5.55664 -0.64666,-1.24051 -2.07182,-1.92049 -3.4375,-1.89258 z" />
      <path
         style="opacity:1;fill:#aafbff;stroke-width:0.571799;stroke-linecap:round;stroke-linejoin:round;stroke-miterlimit:4;stroke-dasharray:none;stroke-dashoffset:347.717;paint-order:stroke markers fill;fill-opacity:1"
         d="m 161.13788,517.29826 c -0.35134,-0.26694 -6.34912,-8.01566 -6.64858,-8.58951 -0.0763,-0.14616 -0.13897,-0.48834 -0.13932,-0.76039 -10e-4,-1.05346 0.78692,-1.8756 1.79345,-1.87047 0.70208,0.004 0.9919,0.17082 2.50658,1.44632 1.1306,0.95208 1.31963,1.07368 1.66877,1.07368 0.21655,0 0.48394,-0.0659 0.59419,-0.1465 0.19419,-0.14195 0.20207,-0.36915 0.25209,-7.26226 l 0.0516,-7.11576 0.27717,-0.41872 c 0.64572,-0.9755 2.08479,-1.12618 2.95804,-0.30973 0.4775,0.44644 0.48016,0.46895 0.53409,4.51305 l 0.0516,3.87258 0.19818,-0.39926 c 0.24356,-0.49067 0.86382,-0.95549 1.39471,-1.04518 0.78677,-0.13293 1.6739,0.30755 2.03818,1.01198 0.0926,0.17899 0.197,0.74795 0.23944,1.30437 0.0414,0.54282 0.082,0.90916 0.0903,0.81412 0.0238,-0.27419 0.51972,-0.79812 0.97545,-1.03061 0.54991,-0.28053 1.35377,-0.22661 1.8673,0.12526 0.58181,0.39867 0.80592,0.90934 0.86667,1.97487 0.0517,0.90742 0.0553,0.91771 0.20712,0.60418 0.46702,-0.9643 1.81526,-1.30495 2.72862,-0.68945 0.86448,0.58259 0.95145,1.05407 0.88132,4.77771 -0.0557,2.95714 0.0275,2.53331 -1.4765,7.52594 l -0.26443,0.87778 h -6.63616 -6.63617 z"
         id="path71747" />
      <g
         aria-label="[F]"
         id="text9159"
         style="font-size:15.9265px;font-family:'Bebas Neue';-inkscape-font-specification:'Bebas Neue';fill:#ffa966;stroke-width:0.608603"
         transform="translate(0.30546479,-0.61092957)">
        <path
           d="m 180.70121,516.47608 h 2.89863 v 1.43339 h -1.14671 v 9.87443 h 1.14671 v 1.43338 h -2.89863 z"
           style="fill:#e6e6e6"
           id="path9815" />
        <path
           d="m 190.43228,527.7839 h 1.14671 v -9.87443 h -1.14671 v -1.43339 h 2.89862 v 12.7412 h -2.89862 z"
           style="fill:#e6e6e6"
           id="path9809" />
        <g
           aria-label="r"
           id="text909"
           style="font-size:18.0503px;fill:#e6e6e6;stroke-width:0.419791">
          <path
             d="m 183.93988,516.55937 h 2.9422 q 1.53427,0 2.23823,0.72201 0.70396,0.70396 0.70396,2.18409 v 0.77616 q 0,1.96748 -1.29962,2.49094 v 0.0361 q 0.72201,0.21661 1.01082,0.88447 0.30685,0.66786 0.30685,1.78698 v 2.22018 q 0,0.54151 0.0361,0.88447 0.0361,0.3249 0.1805,0.64981 h -2.02164 q -0.1083,-0.30686 -0.1444,-0.57761 -0.0361,-0.27075 -0.0361,-0.97472 v -2.31043 q 0,-0.86642 -0.2888,-1.20937 -0.27076,-0.34296 -0.95667,-0.34296 h -0.68591 v 5.41509 h -1.98553 z m 2.70754,5.41509 q 0.59566,0 0.88447,-0.30686 0.30685,-0.30685 0.30685,-1.02886 v -0.97472 q 0,-0.68591 -0.2527,-0.99277 -0.23466,-0.30685 -0.75812,-0.30685 h -0.90251 v 3.61006 z"
             id="path911" />
        </g>
      </g>
    </g>
  </g>
</svg>
