<?xml version="1.0" encoding="UTF-8" standalone="no"?>
<!-- Created with Inkscape (http://www.inkscape.org/) -->

<svg
   width="67.736267mm"
   height="66.924088mm"
   viewBox="0 0 67.736267 66.924088"
   version="1.1"
   id="svg1046"
   inkscape:version="1.2 (dc2aedaf03, 2022-05-15)"
   sodipodi:docname="vote.svg"
   xmlns:inkscape="http://www.inkscape.org/namespaces/inkscape"
   xmlns:sodipodi="http://sodipodi.sourceforge.net/DTD/sodipodi-0.dtd"
   xmlns:xlink="http://www.w3.org/1999/xlink"
   xmlns="http://www.w3.org/2000/svg"
   xmlns:svg="http://www.w3.org/2000/svg">
  <sodipodi:namedview
     id="namedview1048"
     pagecolor="#ffffff"
     bordercolor="#000000"
     borderopacity="0.25"
     inkscape:showpageshadow="2"
     inkscape:pageopacity="0.0"
     inkscape:pagecheckerboard="0"
     inkscape:deskcolor="#d1d1d1"
     inkscape:document-units="mm"
     showgrid="false"
     inkscape:zoom="2.9540685"
     inkscape:cx="104.77076"
     inkscape:cy="141.83828"
     inkscape:window-width="1920"
     inkscape:window-height="1009"
     inkscape:window-x="-8"
     inkscape:window-y="-8"
     inkscape:window-maximized="1"
     inkscape:current-layer="layer1" />
  <defs
     id="defs1043">
    <filter
       inkscape:collect="always"
       style="color-interpolation-filters:sRGB"
       id="filter22217"
       x="-0.41809702"
       y="-0.40984176"
       width="1.836194"
       height="1.8196835">
      <feGaussianBlur
         inkscape:collect="always"
         stdDeviation="27.33312"
         id="feGaussianBlur22219" />
    </filter>
    <radialGradient
       inkscape:collect="always"
       xlink:href="#linearGradient21927"
       id="radialGradient72077"
       gradientUnits="userSpaceOnUse"
       gradientTransform="matrix(0.57356687,0,0,0.57535488,-273.45762,321.4199)"
       cx="938.33997"
       cy="-264.21356"
       fx="938.33997"
       fy="-264.21356"
       r="45.376049" />
    <linearGradient
       id="linearGradient21927"
       inkscape:collect="always">
      <stop
         id="stop21921"
         offset="0"
         style="stop-color:#000000;stop-opacity:1" />
      <stop
         style="stop-color:#e6e6e6;stop-opacity:1"
         offset="0.67357278"
         id="stop21923" />
      <stop
         id="stop21925"
         offset="1"
         style="stop-color:#b2abab;stop-opacity:0;" />
    </linearGradient>
  </defs>
  <g
     inkscape:label="Vrstva 1"
     inkscape:groupmode="layer"
     id="layer1"
     transform="translate(-85.075172,-118.08319)">
    <g
       id="g29112"
       transform="matrix(0.18375486,0,0,0.18618742,147.40072,71.851166)">
      <path
         id="path622134"
         style="fill:#f2f2f2;fill-opacity:1;stroke:none;stroke-width:0.0755365px;stroke-linecap:butt;stroke-linejoin:miter;stroke-opacity:1"
         d="m 1241.1699,598.4707 v 21.69922 l -1.6562,3.25977 V 601.9668 h -14.7422 v 11.20312 h -13.1387 v 22.87696 l -0.8242,24.64843 60.3496,-3.25976 v -54.12891 h -15.4824 v -4.83594 z"
         transform="matrix(1.5179283,0,0,1.5179283,-2154.1151,-619.95186)" />
      <path
         id="path613868"
         style="fill:#c5c5c5;fill-opacity:1;stroke-width:0.0577001"
         d="m 1365.6152,589.98438 v 1.79882 1.80078 h -3.1699 -3.1719 v 21.23047 54.16211 c 1.0597,0.11291 2.0226,0.41937 2.4825,2.04688 3.7723,1.02712 0.554,-8.35948 4.7168,-6.86328 1.1778,-2.89324 5.5498,-4.78 7.5136,-4.77149 v 0 c 0.063,0 0.1236,0.003 0.1816,0.008 0.5182,0.9005 0.7649,1.91642 1.2012,2.85352 2.9373,1.27219 0.705,12.05261 6.2402,8.75195 3.3676,-2.42408 2.7258,-7.81663 7.1407,-8.02539 3.6597,-4.89515 9.2633,0.7564 11.9941,3.88672 2.6648,2.98505 5.0776,6.4778 5.2539,10.41406 0.7505,0.0303 1.349,0.16653 1.8281,0.38868 1.1377,-1.00287 2.2274,-2.18096 1.5547,-3.92188 0.1364,-1.36363 1.3187,-2.55043 1.8106,-4.24023 2.9981,3.30785 4.9558,-7.06511 8.6933,-1.95118 1.1714,1.67853 2.9997,1.2169 4.4942,1.51563 v -38.46484 -5.44336 h 0.4492 0.4511 v -0.44922 -0.45117 h -0.6757 -2.2481 -1.3496 v -0.67383 -0.67578 h -2.0234 -2.0235 v 0.67578 0.67383 h -0.6757 -3.5528 -2.9023 v -0.67383 l -0.1,-0.67578 h -4.2071 l -0.1015,0.67578 v 0.67383 h -2.4492 -2.4512 v -6.3418 -6.3418 h -10.3008 -10.3008 v -8.99609 -8.9961 h -3.1719 -3.1699 v -1.80078 -1.79882 h -3.9804 z"
         transform="matrix(1.5179283,0,0,1.5179283,-2154.1151,-619.95186)" />
      <path
         id="path613866"
         style="fill:#f2f2f2;fill-opacity:1;stroke:none;stroke-width:0.124325px;stroke-linecap:butt;stroke-linejoin:miter;stroke-opacity:1"
         d="m 1311.4492,572.00391 -6.959,19.65429 v 21.94532 h -9.0351 l -5.627,9.74609 -4.6523,-8.05664 -4.6563,8.06641 v 18.73046 l 0.025,28.97852 c 0.2284,0.37463 0.5704,0.68615 0.7696,1.07226 0.5441,-1.11413 1.115,-2.22515 1.541,-3.4375 2.344,2.07439 1.2867,-3.05628 3.3515,-1.30273 1.2803,-3.67805 6.0813,-2.47775 9.5157,-4.39453 1.52,0.52246 -0.048,3.92887 2.5664,2.84961 4.1053,-2.16313 2.3447,3.64867 6.0195,2.97461 -0.012,1.65601 2.6735,3.85761 3.5703,3.89648 1.2447,-3.69262 2.0107,-6.25271 4.2422,-9.30078 0.9502,3.28317 4.4427,-0.99196 5.8789,1.45899 -0.2077,3.0629 2.0018,2.8543 3.6055,4.57226 0.056,5.04377 4.0644,-0.15968 4.7148,-2.36914 2.3818,0.63559 4.032,-1.36587 6.2774,-2.6543 1.9964,1.26895 5.4274,-0.0209 4.6718,3.73243 0.7608,0.20324 3.3982,1.00802 2.8047,3.56445 1.6331,1.10127 1.9495,3.94591 2.6465,6.29492 1.2603,-1.0833 2.7231,-2.32889 1.9688,-4.28125 0.1362,-1.36363 1.3167,-2.55043 1.8085,-4.24023 2.9982,3.30785 4.9559,-7.06511 8.6934,-1.95118 1.8609,2.66669 5.4921,-0.32407 6.5645,3.47071 1.5482,0.42154 1.8581,-1.0047 2.0449,-2.61914 v -42.76368 l -5.7383,-9.9375 h -8.9395 l -2.3183,-2.31835 h -8.0391 l -5.1601,-8.93555 h -6.5547 l -5.0918,8.81836 h -4.0606 V 591.6582 Z"
         transform="matrix(1.5179283,0,0,1.5179283,-2154.1151,-619.95186)" />
      <path
         id="path613874"
         style="fill:#ffffff;stroke-width:0.428293"
         d="m -292.38274,332.80286 c -2.15134,-0.009 -6.9389,2.05683 -8.22906,5.2261 -4.56003,-1.6389 -1.03456,8.64374 -5.1671,7.51865 -1.1749,-4.15689 -5.15195,-0.88057 -7.19052,-3.80218 -4.09417,-5.60203 -6.2393,5.76151 -9.52357,2.13805 -0.53901,1.85104 -1.83239,3.15115 -1.98168,4.64498 1.47831,3.82614 -4.81836,5.17095 -3.70679,7.46177 -2.14564,1.66958 -1.43895,3.59837 -3.05612,6.14105 -2.06106,5.0326 1.59804,9.83791 6.47899,11.36826 0.63464,1.59755 3.46449,0.99483 5.17306,0.64707 0.27447,0.23971 0.71165,0.58498 1.20472,0.97247 -0.0994,1.21961 -0.0249,2.87789 0.13411,4.313 h 5.86521 c -0.0621,-0.93646 -0.11173,-1.92979 -0.0249,-2.76563 0.0372,-0.21113 0.0745,-0.41855 0.0994,-0.62098 0.2844,-1.20968 1.03208,-1.82893 2.80413,-0.86441 4.09911,2.08663 6.81655,-0.99358 10.60271,-0.0249 0,1.38454 0.17138,3.44324 0.24715,4.2812 h 5.69035 c 0.14151,-1.4233 0.1602,-3.37431 -0.11174,-4.46552 2.1932,-1.16249 7.28913,2.01212 9.59212,0.27076 1.95413,-1.47783 7.00026,-2.18948 9.43973,-0.51542 0.0249,0.0126 0.0249,0.0126 0.0372,0.0249 0.46699,0.8905 0.70296,3.1997 0.58869,4.68844 h 5.86918 c 0.21611,-1.94927 0.0994,-4.48004 -0.41109,-5.45002 1.28383,-1.79925 6.39505,2.64292 8.22348,-1.50205 3.82762,-1.66945 7.10928,-4.83959 7.79449,-8.6548 -2.72688,-3.65301 1.11157,-11.16582 -5.3775,-11.428 -0.19249,-4.31187 -2.8369,-8.13703 -5.75592,-11.40689 -2.99141,-3.42896 -9.12799,-9.62106 -13.1367,-4.25885 -4.83625,0.22852 -4.13478,6.13647 -7.82356,8.79193 -6.06368,3.6155 -3.61786,-8.1928 -6.83543,-9.58628 v 0 c -0.47817,-1.02712 -0.74768,-2.14118 -1.31562,-3.12754 -0.0621,-0.008 -0.13049,-0.008 -0.19997,-0.008 z m -26.08489,41.16578 c 0.18878,-5e-4 0.25461,0.0496 0.1627,0.19748 -0.0621,-0.0621 -0.18754,-0.12922 -0.34155,-0.18381 0.0621,-0.008 0.12923,-0.0126 0.17885,-0.0126 z" />
      <path
         id="path613872"
         style="fill:#c5c5c5;fill-opacity:1;stroke-width:0.192481"
         d="m 1303.8359,622.44141 -15.455,10.9082 0.1699,8.74219 -16.875,-15.73828 -12.4082,10.57812 -9.9278,-9.1875 -7.6582,6.89258 -1.8398,-1.83984 -5.2383,5.24023 -5.2402,5.37695 1.3808,6.54688 h 1.3789 v 0.0937 l -0.1445,17.50195 c 1.8624,2.65444 5.4855,-0.32465 6.5567,3.4668 3.7725,1.0271 0.5559,-8.35948 4.7187,-6.86328 1.1778,-2.89322 5.548,-4.78 7.5117,-4.77149 v 0 c 0.063,0 0.1257,0.003 0.1836,0.008 0.5183,0.90053 0.765,1.91642 1.2012,2.85352 2.9373,1.2722 0.7031,12.05261 6.2383,8.75195 3.3675,-2.42408 2.7277,-7.81663 7.1426,-8.02539 3.6598,-4.89515 9.2614,0.75641 11.9921,3.88672 1.4407,1.61383 2.8072,3.37707 3.7872,5.27734 0.5441,-1.11413 1.115,-2.22515 1.541,-3.4375 2.344,2.07439 1.2867,-3.05628 3.3515,-1.30273 1.2803,-3.67805 6.0813,-2.47775 9.5157,-4.39453 1.52,0.52246 -0.048,3.92887 2.5664,2.84961 4.1053,-2.16313 2.3447,3.64867 6.0195,2.97461 -0.012,1.65601 2.6735,3.85761 3.5703,3.89648 1.2447,-3.69262 2.0107,-6.25271 4.2422,-9.30078 0.9502,3.28317 4.4427,-0.99196 5.8789,1.45899 -0.2077,3.0629 2.0018,2.8543 3.6055,4.57226 0.056,5.04377 4.0644,-0.15968 4.7148,-2.36914 2.3818,0.63559 4.032,-1.36587 6.2774,-2.6543 1.9964,1.26895 5.4274,-0.0209 4.6718,3.73243 0.7608,0.20324 3.3982,1.00802 2.8047,3.56445 1.6331,1.10127 1.9495,3.94591 2.6465,6.29492 0.2271,-0.19523 0.4008,-0.44541 0.627,-0.6543 v -27.91406 -6.43555 l 2.7597,-0.20703 -10.4804,-10.61523 -1.8399,1.83984 -7.9101,-6.91015 -8.918,7.19531 z"
         transform="matrix(1.5179283,0,0,1.5179283,-2154.1151,-619.95186)" />
      <path
         id="path613870"
         style="fill:#ffffff;stroke-width:0.514511"
         d="m -79.286449,336.14401 c -2.584793,-0.011 -8.336238,2.4709 -9.885721,6.2783 -5.478086,-1.96889 -1.243472,10.38363 -6.207386,9.03212 -1.410992,-4.99372 -6.189104,-1.05817 -8.637914,-4.56773 -4.91845,-6.72963 -7.49541,6.92151 -11.44078,2.56865 -0.64707,2.22363 -2.20128,3.78553 -2.38062,5.57992 1.77577,4.59642 -5.78846,6.21198 -4.4531,8.96382 -2.57758,2.00578 -1.72857,4.3228 -3.67126,7.37743 -2.47599,6.04567 1.91971,11.81836 7.78319,13.65685 0.76132,1.91909 4.16196,1.19477 6.21445,0.77747 0.33037,0.28814 0.85447,0.70295 1.44716,1.1687 -0.12419,1.46528 -0.0374,3.45703 0.16145,5.18114 h 7.04594 c -0.0745,-1.12524 -0.13663,-2.31815 -0.0249,-3.32228 0.0496,-0.25337 0.087,-0.50177 0.12419,-0.74643 0.3403,-1.45347 1.24073,-2.19716 3.368599,-1.03953 4.92417,2.50668 8.188575,-1.19353 12.736796,-0.0372 0,1.66325 0.20616,4.13639 0.296823,5.14287 h 6.835576 c 0.170151,-1.70969 0.192498,-4.05354 -0.139153,-5.36444 2.634466,-1.3961 8.756391,2.41725 11.522887,0.32539 2.347209,-1.77539 8.409139,-2.63037 11.339577,-0.61974 0.0249,0.0126 0.03719,0.0126 0.04964,0.0249 0.561371,1.07059 0.844547,3.84391 0.707915,5.63235 h 7.050689 c 0.259568,-2.34162 0.124181,-5.38185 -0.493071,-6.54719 1.542533,-2.16152 7.682959,3.17487 9.879511,-1.80446 4.597909,-2.00541 8.540429,-5.81379 9.362865,-10.39704 -3.275216,-4.3885 1.335978,-13.41367 -6.459627,-13.72863 -0.232242,-5.17976 -3.408097,-9.77506 -6.914798,-13.70305 -3.59377,-4.11937 -10.965251,-11.55804 -15.781487,-5.1163 -5.809705,0.27447 -4.966892,7.37184 -9.397881,10.56172 -7.284538,4.34356 -4.34641,-9.842 -8.211914,-11.51605 v 0 c -0.573805,-1.23327 -0.899199,-2.57212 -1.580544,-3.75709 -0.07454,-0.008 -0.156488,-0.009 -0.239696,-0.009 z m -31.336311,49.45284 c 0.22728,-4.9e-4 0.30677,0.0621 0.19499,0.23722 -0.0745,-0.0745 -0.22605,-0.15523 -0.41109,-0.22107 0.0745,-0.009 0.15522,-0.0126 0.21486,-0.0126 z" />
      <g
         id="g613894"
         transform="matrix(0.77668561,0,0,0.77668561,-1742.9725,-0.88095601)"
         style="fill:#e1e1e1;fill-opacity:1">
        <path
           id="path613876"
           style="fill:#e1e1e1;fill-opacity:1;stroke-width:0.13538"
           d="m 1425.7188,635.43555 -12.8067,11.1289 v 8.14453 l -3.6152,-4.64843 -6.084,-3.13867 -5.7715,3.13867 -3.3828,4.38672 -3.7813,-3.05274 0.5313,-0.76953 h -2.8789 l -0.4902,0.70898 h -0.6993 l 0.4903,-0.70898 h -2.8789 l -0.4903,0.70898 h -0.6933 l 0.4902,-0.70898 h -2.8789 l -0.4902,0.70898 h -1.0235 l -1.3926,1.11914 -6.5839,-4.07226 h -8.7442 l -5.2187,3.23242 -9.6973,-5.9375 -9.8184,6.09766 -9.6171,-10.66797 -9.8829,10.85156 -0.061,0.58399 -16.2168,-9.99024 -16.2324,10.17578 -0.033,6.02735 -3.0977,0.0391 -0.3359,-6.54492 -7.7324,-6.91602 -8.3301,7.0293 -0.072,6.4082 -3.3105,0.0391 -0.1367,-7.34375 -8.379,-10.2832 -7.7187,6.48633 -0.08,-2.07617 h -2.1328 -2.1309 l -0.059,6.92578 -11.709,-9.98047 -16.125,10.00391 -0.3242,-6.86524 -3.1133,-2.54297 -0.01,-2.06445 -0.01,-1.31836 h -1.2187 -1.2168 l 0.01,1.22266 -3.7657,-2.61719 -9.0195,7.62695 -0.082,13.53125 0.02,4.65821 c 1.6955,0.60844 3.8364,0.99568 4.9941,2.96289 0.8397,2.89994 3.5724,0.33481 3.627,3.28711 1.8599,4.57806 3.887,-5.00605 6.0508,-3.25782 2.6895,-0.96133 6.2454,-4.85473 8.4199,-0.27148 0.6234,2.95415 3.2645,0.1542 3.5117,3.08398 0.1666,0.28961 0.3079,0.58528 0.4297,0.88282 0.2154,-0.42078 0.4145,-0.8671 0.5566,-1.35547 2.9982,3.30785 4.9578,-7.06513 8.6954,-1.95118 1.8609,2.66669 5.4904,-0.32407 6.5625,3.47071 3.7725,1.0271 0.5559,-8.35948 4.7187,-6.86328 1.1778,-2.89322 5.548,-4.78 7.5117,-4.77149 v 0 c 0.063,0 0.1257,0.003 0.1836,0.008 0.5183,0.90053 0.765,1.91642 1.2012,2.85352 2.9373,1.2722 0.7031,12.05261 6.2383,8.75195 3.3675,-2.42408 2.7277,-7.81663 7.1426,-8.02539 3.6598,-4.89515 9.2614,0.75641 11.9921,3.88672 1.4407,1.61383 2.8072,3.37707 3.7872,5.27734 0.5441,-1.11413 1.115,-2.22515 1.541,-3.4375 2.344,2.07439 1.2867,-3.05628 3.3515,-1.30273 1.2803,-3.67805 6.0813,-2.47775 9.5157,-4.39453 1.52,0.52246 -0.048,3.92887 2.5664,2.84961 4.1053,-2.16313 2.3447,3.64867 6.0195,2.97461 -0.012,1.65601 2.6735,3.85761 3.5703,3.89648 1.2447,-3.69262 2.0107,-6.25271 4.2422,-9.30078 0.9502,3.28317 4.4427,-0.99196 5.8789,1.45899 -0.2077,3.0629 2.0018,2.8543 3.6055,4.57226 0.056,5.04377 4.0644,-0.15968 4.7148,-2.36914 2.3818,0.63559 4.032,-1.36587 6.2774,-2.6543 1.9964,1.26895 5.4274,-0.0209 4.6718,3.73243 0.7608,0.20324 3.3982,1.00802 2.8047,3.56445 1.6331,1.10127 1.9495,3.94591 2.6465,6.29492 1.2603,-1.0833 2.7231,-2.32889 1.9688,-4.28125 0.1362,-1.36363 1.3167,-2.55043 1.8085,-4.24023 2.9982,3.30785 4.9559,-7.06511 8.6934,-1.95118 1.8609,2.66669 5.4921,-0.32407 6.5645,3.47071 3.7723,1.02712 0.554,-8.35948 4.7168,-6.86328 1.1778,-2.89324 5.5498,-4.78 7.5136,-4.77149 v 0 c 0.063,0 0.1236,0.003 0.1816,0.008 0.5182,0.9005 0.7649,1.91642 1.2012,2.85352 2.9373,1.27219 0.705,12.05261 6.2402,8.75195 3.3676,-2.42408 2.7258,-7.81663 7.1407,-8.02539 3.6597,-4.89515 9.2633,0.7564 11.9941,3.88672 2.6648,2.98505 5.0776,6.4778 5.2539,10.41406 0.7505,0.0303 1.349,0.16653 1.8281,0.38868 1.1377,-1.00287 2.2274,-2.18096 1.5547,-3.92188 0.1364,-1.36363 1.3187,-2.55043 1.8106,-4.24023 2.9981,3.30785 4.9558,-7.06511 8.6933,-1.95118 1.8609,2.66669 5.4923,-0.32407 6.5645,3.47071 3.7723,1.02712 0.554,-8.35948 4.7168,-6.86328 1.1545,-2.83609 5.3354,-4.65603 7.3515,-4.72071 v -12.875 z m -48.8711,17.17187 h 0.8398 l -0.8398,0.67969 z"
           transform="matrix(1.9543665,0,0,1.9543665,-529.35526,-797.06756)" />
        <g
           id="g613892"
           transform="matrix(25.203242,0,0,25.203242,1729.654,-4617.9271)"
           style="fill:#e1e1e1;fill-opacity:1" />
      </g>
      <g
         id="g613906"
         transform="matrix(2.5884373,0,0,2.5884373,-5756.2558,-1047.135)"
         style="fill:#ececec" />
    </g>
    <g
       id="g7389"
       transform="matrix(1.2347205,0,0,1.2347205,-208.21436,-56.527633)">
      <path
         id="rect71479"
         style="opacity:0.48;stroke-width:0.183063;stroke-linecap:round;stroke-linejoin:round;stroke-dashoffset:347.717;paint-order:stroke markers fill;filter:url(#filter22217)"
         transform="matrix(0.16761476,-0.01205323,0,0.16804758,199.07557,67.090869)"
         d="M 313.32669,556.94061 H 470.22685 V 717.00114 H 313.32669 Z" />
      <path
         inkscape:connector-curvature="0"
         id="path71699"
         d="m 242.27454,143.29618 c -0.0358,0 -1.54263,1.56114 -3.55771,3.66558 v 0.20003 c 3.29547,-3.47612 3.63971,-3.86569 3.55771,-3.86569 z m 24.86199,0 c -0.0521,-0.0521 -16.311,16.98259 -28.4197,29.72558 v 0.23328 c 2.41256,-2.52604 5.03147,-5.27074 7.79026,-8.1652 11.38613,-11.94665 20.66943,-21.75379 20.62944,-21.79366 z m 9.45372,0 c -0.0764,0 -11.36228,11.74719 -25.08007,26.10503 -4.78374,5.00694 -8.99946,9.42959 -12.79335,13.41412 v 0.24157 c 3.87113,-4.03744 8.18705,-8.54427 13.07053,-13.65569 13.71788,-14.35784 24.87909,-26.10503 24.80289,-26.10503 z m 1.52413,0 c -0.0764,0 -11.36225,11.74719 -25.08007,26.10503 -5.44536,5.6994 -10.22081,10.71034 -14.31748,15.01559 v 0.22939 c 4.16864,-4.3452 9.0545,-9.44631 14.5947,-15.24498 13.71784,-14.35784 24.87909,-26.10503 24.80285,-26.10503 z m 4.71139,0 c -0.0763,0 -11.36228,11.74719 -25.08003,26.10503 -7.79756,8.16131 -14.47771,15.17558 -19.02891,19.97191 v 0.17818 c 4.61016,-4.79154 11.3994,-11.87465 19.30581,-20.15009 13.71785,-14.35784 24.87941,-26.10503 24.80313,-26.10503 z m 1.52407,0 c -0.0763,0 -11.36222,11.74719 -25.07997,26.10503 -8.78117,9.19087 -16.14397,16.92559 -20.55304,21.58053 v 0.15174 c 4.46246,-4.62979 11.95628,-12.4442 20.83026,-21.73227 13.71785,-14.35784 24.87899,-26.10503 24.80275,-26.10503 z m 4.71123,0 c -0.0764,0 -11.36227,11.74719 -25.08009,26.10503 -13.71788,14.35785 -24.87903,26.10535 -24.80284,26.10535 0.0764,0 11.36224,-11.7475 25.08012,-26.10535 13.71776,-14.35784 24.87894,-26.10503 24.80281,-26.10503 z m 1.52433,0 c -0.0764,0 -11.36222,11.74719 -25.08001,26.10503 -13.71775,14.35785 -24.87931,26.10535 -24.80318,26.10535 0.0764,0 11.36237,-11.7475 25.08016,-26.10535 13.71776,-14.35784 24.87928,-26.10503 24.80303,-26.10503 z m -17.20877,0 c -0.0527,-0.0515 -20.58712,21.46016 -34.6598,36.26053 v 0.20635 c 3.3152,-3.4677 6.91753,-7.23812 10.91184,-11.42465 13.1023,-13.73284 23.78888,-25.00189 23.74796,-25.0422 z m -12.46628,0.006 c -0.0426,-0.0467 -12.19248,12.68843 -22.19352,23.21713 v 0.21908 c 1.51391,-1.58734 3.00175,-3.14703 4.64915,-4.87723 9.68353,-10.17017 17.57855,-18.52167 17.54437,-18.559 z m 18.71219,0.006 c -0.0539,-0.0564 -23.70495,24.68139 -40.90571,42.77092 v 0.20005 c 14.30753,-14.94884 40.95782,-42.91662 40.90571,-42.97097 z m 6.23818,0.006 c -0.0751,-0.0786 -37.02378,38.56998 -47.14389,49.27539 v 0.19805 c 2.93875,-3.06286 8.93887,-9.3451 22.38296,-23.41373 13.65756,-14.29198 24.79997,-26.01889 24.76093,-26.05973 z m -31.17939,0.006 c -0.0394,-0.0424 -8.28631,8.5959 -15.9645,16.67838 v 0.2303 c 0.53095,-0.55794 0.99557,-1.04452 1.54195,-1.61923 7.96323,-8.37538 14.45344,-15.25565 14.42255,-15.28945 z m 14.13705,0 c -0.0576,-0.0606 -17.44838,18.09893 -30.10155,31.37561 v 0.26259 c 2.65414,-2.77009 5.55294,-5.79933 8.62967,-9.01971 11.84735,-12.4004 21.50981,-22.5788 21.47188,-22.61851 z m -18.70573,0 c -0.0435,-0.0455 -5.6102,5.73514 -11.39582,11.78629 v 0.28393 c 6.34919,-6.6498 11.43248,-12.03187 11.39582,-12.07024 z m 1.52407,0 c -0.0449,-0.0479 -6.48337,6.64378 -12.91989,13.38005 v 0.28714 c 0.0156,-0.0145 0.0238,-0.0267 0.0394,-0.0406 7.12264,-7.45451 12.91892,-13.58649 12.88079,-13.62637 z m 1.52413,0 c -0.0472,-0.0491 -7.37728,7.57679 -14.44402,14.97642 v 0.2843 c 0.27939,-0.29242 0.51748,-0.53987 0.80117,-0.83675 7.54178,-7.89328 13.68092,-14.38409 13.64285,-14.42397 z m 3.18704,0 c -0.0497,-0.0521 -9.30784,9.59242 -17.63106,18.3145 v 0.27883 c 0.81143,-0.8479 1.54663,-1.61406 2.39464,-2.50154 8.41823,-8.81064 15.2745,-16.05191 15.23642,-16.09179 z m 1.52439,0 c -0.0509,-0.0539 -10.25772,10.58431 -19.15545,19.91087 v 0.27653 c 1.05507,-1.10221 2.0389,-2.12805 3.15668,-3.29801 8.83743,-9.24935 16.0369,-16.84953 15.99877,-16.88941 z m 1.52413,0 c -0.0521,-0.0551 -11.22254,11.59198 -20.67958,21.507 v 0.27471 c 1.29221,-1.34964 2.53103,-2.64196 3.91887,-4.0944 9.25639,-9.68807 16.79878,-17.64745 16.76071,-17.68733 z m 4.71121,0 c -0.0552,-0.0582 -14.28827,14.79449 -25.39079,26.44025 v 0.26975 c 1.9891,-2.07655 4.05245,-4.23169 6.27434,-6.55727 10.55217,-11.04412 19.15448,-20.11287 19.11645,-20.15275 z m 1.52413,0 c -0.0564,-0.0588 -15.30326,15.85524 -26.91492,28.03638 v 0.26822 c 2.20424,-2.30084 4.54461,-4.74621 7.03645,-7.35425 10.97117,-11.48285 19.91654,-20.91049 19.87847,-20.95037 z m 4.71111,0 c -0.0588,-0.0612 -18.48894,19.18648 -31.62603,32.97168 v 0.25939 c 2.88015,-3.00562 6.0087,-6.27423 9.39193,-9.81528 12.26685,-12.83882 22.27218,-23.37593 22.2341,-23.41581 z m 1.52435,0 c -0.0588,-0.0619 -19.5396,20.2857 -33.15038,34.56902 v 0.25545 c 3.10088,-3.23555 6.46438,-6.74937 10.15406,-10.61108 12.686,-13.27751 23.03444,-24.17351 22.99632,-24.21339 z m -32.70093,0 c -0.008,-0.0102 -0.18771,0.1598 -0.44945,0.41822 v 0.10459 c 0.28924,-0.31877 0.4583,-0.51356 0.44945,-0.52281 z m 1.52411,0 c -0.0202,-0.0206 -0.83337,0.79911 -1.97356,1.96896 v 0.19386 c 1.21419,-1.29662 1.99157,-2.14405 1.97356,-2.16282 z m 3.18701,0 c -0.0316,-0.0334 -2.29296,2.29185 -5.16057,5.27292 v 0.25785 c 3.04774,-3.21292 5.18802,-5.50201 5.16057,-5.53077 z m 1.52407,0 c -0.0357,-0.037 -3.04617,3.06953 -6.68464,6.86136 v 0.27023 c 3.87814,-4.078 6.71512,-7.09978 6.68464,-7.13159 z m 1.52413,0 c -0.0394,-0.04 -3.85388,3.90878 -8.20877,8.45414 v 0.2757 c 4.67865,-4.91156 8.24157,-8.69561 8.20877,-8.72986 z m 1.53177,0.008 c -0.0275,-0.0267 -4.31497,4.44198 -9.74054,10.14215 v 0.2348 c 5.09167,-5.36869 9.77577,-10.34012 9.74054,-10.37695 z m 38.949,0.0121 c -0.0316,-0.0315 -11.21498,11.64727 -24.85581,25.95209 -13.05315,13.68846 -22.87432,23.98721 -23.83373,24.99228 v 0.19266 c 6.83482,-7.03605 48.76725,-51.05573 48.68954,-51.13701 z m -6.21828,0.0182 c -0.0238,-0.0255 -28.66911,29.91256 -42.47126,44.36997 v 0.25786 c 13.77311,-14.37807 42.53091,-44.56547 42.47126,-44.6279 z m -18.66269,0.0224 c 0,-0.0797 -8.2618,8.50216 -18.35972,19.07085 -1.92945,2.01952 -3.69827,3.87468 -5.44885,5.71133 v 0.27236 c 1.75058,-1.82776 3.5194,-3.6743 5.44885,-5.69382 10.09792,-10.56876 18.35972,-19.28102 18.35972,-19.36072 z m 12.45296,0.006 c -0.0552,-0.0576 -21.71678,22.57953 -36.26153,37.84185 v 0.22586 c 3.53045,-3.68472 7.38347,-7.70999 11.69435,-12.22198 13.54658,-14.17895 24.60191,-25.80942 24.56718,-25.84573 z m 15.79095,1.27893 c -7.61821,7.83303 -48.47357,50.60941 -48.47357,50.78172 -3e-5,0.0797 11.22108,-11.59975 24.93599,-25.95415 11.01144,-11.52501 20.28574,-21.27428 23.53754,-24.73563 z m 0,1.54663 c -2.51344,2.6093 -6.38405,6.65833 -10.94105,11.45528 -7.53996,7.93666 -18.74166,19.70034 -24.89284,26.14139 -6.15135,6.44115 -11.12214,11.71292 -11.04615,11.71461 0.15306,0.006 36.58937,-38.24077 46.88004,-49.16632 z m 0,1.75818 c -4.50501,4.67567 -11.85488,12.34046 -20.55275,21.44424 -13.7178,14.35783 -24.87908,26.10535 -24.80284,26.10535 0.0764,0 11.36222,-11.74752 25.08006,-26.10535 8.60212,-9.00353 15.82444,-16.59021 20.27553,-21.28769 z m 0,1.5822 c -4.61505,4.79795 -11.29826,11.77089 -19.02864,19.86204 -13.71784,14.35783 -24.87908,26.10533 -24.80288,26.10533 0.0763,0 11.36232,-11.7475 25.0801,-26.10533 7.61863,-7.97412 14.19693,-14.88069 18.75142,-19.67914 z m 0,1.58309 c -4.53465,4.72035 -10.71051,11.16821 -17.50428,18.27895 -13.71785,14.35783 -24.87937,26.10535 -24.80313,26.10535 0.0763,0 11.36228,-11.74752 25.08007,-26.10535 6.70834,-7.02137 12.75693,-13.36782 17.22734,-18.07204 z m 0,1.58219 c -2.26036,2.36551 -4.71218,4.93525 -7.41649,7.77751 -9.03136,9.49214 -20.23351,21.25582 -24.89347,26.14147 -4.66,4.88568 -8.41057,8.88305 -8.33455,8.88313 0.1302,5e-5 26.36841,-27.51896 40.64451,-42.57416 z m 0,1.74104 c -4.1147,4.28933 -8.89373,9.2788 -14.32324,14.96166 -13.71463,14.35457 -24.87335,26.09941 -24.79712,26.09941 0.12747,0 24.55047,-25.52495 39.12036,-40.82895 z m 0,1.58959 c -3.80981,3.97394 -8.02916,8.3798 -12.79311,13.36613 -13.71788,14.35783 -24.87905,26.10535 -24.80281,26.10535 0.0764,0 11.36228,-11.74752 25.07994,-26.10535 4.66344,-4.88088 8.78451,-9.20383 12.51598,-13.12243 z m 0,1.59165 c -3.532,3.68515 -7.38488,7.70902 -11.69036,12.21555 -13.48606,14.11523 -24.45767,25.66428 -24.38149,25.66428 0.12036,0 21.60206,-22.44347 36.07185,-37.62996 z m 0,1.64055 c -6.44897,6.75544 -15.161,15.89266 -28.57043,29.96687 -3.28692,3.44988 -5.9203,6.27241 -5.85181,6.27241 0.10185,0 20.44486,-21.31733 34.42224,-36.02201 z m 0,1.71528 c -13.3471,13.91533 -32.32497,33.74953 -32.94283,34.45788 -0.0316,0.0364 0,0.0661 0.0708,0.0661 0.11253,0 19.36956,-20.12312 32.87206,-34.2963 z m 0,1.56976 c -2.86488,2.98961 -5.97516,6.23891 -9.33479,9.7554 -12.19047,12.75923 -22.10213,23.19884 -22.02592,23.19884 0.11651,0 18.33106,-19.02189 31.36071,-32.69436 z m 0,1.5934 c -2.63864,2.75379 -5.51879,5.7637 -8.57253,8.9599 -11.77121,12.32052 -21.33994,22.40094 -21.26379,22.40094 0.11491,0 17.29239,-17.93568 29.83632,-31.09731 z m 0,1.6471 c -11.90119,12.43604 -27.78992,29.08842 -28.08708,29.46974 -0.10469,0.13423 -0.15777,0.24394 -0.11801,0.24394 0.0791,0 16.18268,-16.86722 28.20509,-29.50385 z m 0,1.68626 c -2.1883,2.28423 -4.50932,4.70942 -6.97896,7.29438 -10.89491,11.4032 -19.74619,20.7331 -19.66973,20.7331 0.11135,0 15.1487,-15.69557 26.64869,-27.75985 z m 0,1.59463 c -1.97279,2.05944 -4.01698,4.19471 -6.21693,6.49735 -10.47566,10.9645 -18.98446,19.9355 -18.90822,19.9355 0.11019,0 14.1359,-14.63627 25.12515,-26.16318 z m 0,1.59429 c -1.7525,1.8297 -3.52462,3.68031 -5.4548,5.70061 -10.05655,10.52591 -18.2222,19.13795 -18.14596,19.13795 0.10857,0 13.13334,-13.58897 23.60076,-24.5671 z m 0,1.63051 c -1.48037,1.54795 -2.93004,3.06329 -4.5379,4.74804 -9.60835,10.06761 -17.46998,18.33963 -17.46998,18.38232 0,0.043 0.0202,0.0777 0.0408,0.0777 0.0638,0 12.0571,-12.56275 21.96699,-22.97716 z m 0,1.70303 c -1.27447,1.33123 -2.49512,2.60495 -3.86136,4.03491 -9.18007,9.60859 -16.62836,17.47011 -16.55184,17.47011 0.10395,0 11.07648,-11.44127 20.4132,-21.23049 z m 0,1.59468 c -1.03666,1.08306 -2.0028,2.09017 -3.09932,3.23791 -8.76087,9.16976 -15.86651,16.67243 -15.79027,16.67243 0.10194,0 10.11452,-10.43568 18.88959,-19.63351 z m 0,1.59376 c -0.79249,0.82822 -1.51038,1.57619 -2.33719,2.44175 -8.34176,8.73105 -15.10428,15.87483 -15.02801,15.87483 0.0992,0 9.16754,-9.4471 17.3652,-18.03737 z m 0,1.59401 c -0.49357,0.51598 -0.92409,0.96423 -1.43079,1.49444 -7.88778,8.25548 -14.34153,15.07538 -14.34153,15.15516 0,0.0797 6.45375,-6.60949 14.34153,-14.86499 0.5067,-0.53021 0.93722,-0.98336 1.43079,-1.50036 z m 0,1.74516 c -6.77809,7.06717 -13.76287,14.3724 -14.2365,14.91159 -0.0316,0.0364 0,0.0658 0.0759,0.0658 0.0865,0 7.2313,-7.44529 14.16064,-14.71055 z m 0,1.58759 c -7.03699,7.36564 -12.73021,13.38982 -12.65412,13.38982 0.0893,0 6.3535,-6.50961 12.65412,-13.10322 z m 0,1.59728 c -6.24134,6.53779 -11.20275,11.79254 -11.12967,11.79254 0.0853,0 5.48309,-5.60407 11.12967,-11.50921 z m 0,1.59728 c -5.44082,5.70496 -9.67506,10.19526 -9.60556,10.19526 0.0811,0 4.63467,-4.72143 9.60556,-9.91545 z m 0,1.73541 c -4.00072,4.17356 -7.63872,7.98005 -8.00103,8.39373 -0.0316,0.0364 0,0.0661 0.0755,0.0661 0.0701,0 3.72153,-3.7869 7.92568,-8.18209 z m 0,1.60589 c -3.76092,3.95647 -6.47852,6.85396 -6.41822,6.85396 0.0692,0 2.92718,-2.94749 6.41822,-6.58453 z m 0,1.6023 c -2.91523,3.07529 -4.94835,5.25166 -4.89411,5.25166 0.0614,0 2.1888,-2.18637 4.89411,-4.9973 z m 0,1.60891 c -2.0268,2.14794 -3.41571,3.64275 -3.36976,3.64275 0.0515,0 1.46383,-1.4413 3.36976,-3.41306 z m 0,1.70935 c -0.89733,0.94306 -1.60708,1.6917 -1.76579,1.86879 -0.0316,0.0357 0,0.0661 0.0693,0.0684 0.0275,0 0.73738,-0.72415 1.69632,-1.71588 z m 0,1.70722 c -0.11729,0.13388 -0.19444,0.22612 -0.18262,0.22612 0.0125,0 0.0756,-0.0558 0.18262,-0.15733 z"
         style="fill:url(#radialGradient72077);fill-opacity:1;stroke-width:0.141761"
         inkscape:export-filename="C:\Users\Filip\OneDrive\Plocha\g1517.png"
         inkscape:export-xdpi="196.17999"
         inkscape:export-ydpi="196.17999" />
      <path
         id="rect71701"
         style="fill:#ffffff;stroke-width:0.0391784;stroke-linecap:round;stroke-linejoin:round;stroke-dashoffset:347.717;paint-order:stroke markers fill"
         transform="matrix(0.99920675,-0.03982305,0,1,0,0)"
         d="M 248.17874,162.81831 H 281.7279 V 197.1044 H 248.17874 Z" />
      <path
         id="rect71703"
         style="opacity:1;stroke-width:0.0378586;stroke-linecap:round;stroke-linejoin:round;stroke-dashoffset:347.717;paint-order:stroke markers fill"
         d="m 249.77164,150.8737 h 16.391 v 3.68949 h -16.391 z" />
      <path
         id="path71705"
         style="opacity:1;fill:#000000;stroke-width:0.0339724;stroke-linecap:round;stroke-linejoin:round;stroke-dashoffset:347.717;paint-order:stroke markers fill"
         d="m 254.76714,157.72439 v 19.86462 l 19.86451,-0.92107 v -19.86461 z m 2.76797,2.63965 14.32857,-0.66439 v 14.32855 l -14.32857,0.66439 z" />
      <g
         aria-label="poslední krok..."
         id="text2544"
         style="font-size:2.68168px;line-height:1;font-family:'AlterEgo BB';-inkscape-font-specification:'AlterEgo BB';text-align:center;letter-spacing:0px;word-spacing:0px;text-anchor:middle;fill:#ffffff;stroke-width:0.0670421">
        <path
           d="m 250.89336,151.75797 h 0.43443 q 0.2199,0 0.32985,0.118 0.10995,0.11799 0.10995,0.34593 v 0.18504 q 0,0.22794 -0.10995,0.34593 -0.10995,0.118 -0.32985,0.118 h -0.13945 v 0.76428 h -0.29498 z m 0.43443,0.84473 q 0.0724,0 0.10727,-0.0402 0.0375,-0.0402 0.0375,-0.13677 v -0.22258 q 0,-0.0965 -0.0375,-0.13677 -0.0349,-0.0402 -0.10727,-0.0402 h -0.13945 v 0.57656 z"
           style="font-family:'Bebas Neue';-inkscape-font-specification:'Bebas Neue'"
           id="path1179" />
        <path
           d="m 252.35487,153.66196 q -0.21721,0 -0.33252,-0.12335 -0.11532,-0.12336 -0.11532,-0.34862 v -0.98686 q 0,-0.22526 0.11532,-0.34862 0.11531,-0.12336 0.33252,-0.12336 0.21722,0 0.33253,0.12336 0.11531,0.12336 0.11531,0.34862 v 0.98686 q 0,0.22526 -0.11531,0.34862 -0.11531,0.12335 -0.33253,0.12335 z m 0,-0.26816 q 0.15286,0 0.15286,-0.18504 v -1.0244 q 0,-0.18504 -0.15286,-0.18504 -0.15285,0 -0.15285,0.18504 v 1.0244 q 0,0.18504 0.15285,0.18504 z"
           style="font-family:'Bebas Neue';-inkscape-font-specification:'Bebas Neue'"
           id="path1181" />
        <path
           d="m 253.38464,153.66196 q -0.21454,0 -0.32449,-0.12067 -0.10994,-0.12336 -0.10994,-0.3513 v -0.10727 h 0.27889 v 0.12872 q 0,0.18236 0.15286,0.18236 0.0751,0 0.11263,-0.0429 0.0402,-0.0456 0.0402,-0.14481 0,-0.118 -0.0536,-0.20649 -0.0536,-0.0912 -0.19845,-0.21722 -0.18235,-0.1609 -0.25476,-0.28962 -0.0724,-0.1314 -0.0724,-0.29498 0,-0.22258 0.11263,-0.34326 0.11263,-0.12336 0.32716,-0.12336 0.21186,0 0.31912,0.12336 0.10995,0.12068 0.10995,0.34862 v 0.0778 h -0.27889 v -0.0965 q 0,-0.0965 -0.0375,-0.13945 -0.0376,-0.0456 -0.10995,-0.0456 -0.1475,0 -0.1475,0.17967 0,0.10191 0.0536,0.1904 0.0563,0.0885 0.20112,0.21454 0.18504,0.1609 0.25476,0.2923 0.0697,0.1314 0.0697,0.30839 0,0.23063 -0.11532,0.35399 -0.11263,0.12335 -0.32984,0.12335 z"
           style="font-family:'Bebas Neue';-inkscape-font-specification:'Bebas Neue'"
           id="path1183" />
        <path
           d="m 253.99874,151.75797 h 0.29499 v 1.60901 h 0.48538 v 0.26817 h -0.78037 z"
           style="font-family:'Bebas Neue';-inkscape-font-specification:'Bebas Neue'"
           id="path1185" />
        <path
           d="m 254.92124,151.75797 h 0.8045 v 0.26817 h -0.50952 v 0.49611 h 0.40494 v 0.26817 h -0.40494 v 0.57656 h 0.50952 v 0.26817 h -0.8045 z"
           style="font-family:'Bebas Neue';-inkscape-font-specification:'Bebas Neue'"
           id="path1187" />
        <path
           d="m 255.89469,151.75797 h 0.45052 q 0.2199,0 0.32985,0.118 0.10995,0.11799 0.10995,0.34593 v 0.94932 q 0,0.22794 -0.10995,0.34593 -0.10995,0.118 -0.32985,0.118 h -0.45052 z m 0.44516,1.60901 q 0.0724,0 0.10995,-0.0429 0.0402,-0.0429 0.0402,-0.13945 v -0.97613 q 0,-0.0965 -0.0402,-0.13944 -0.0375,-0.0429 -0.10995,-0.0429 h -0.15017 v 1.34084 z"
           style="font-family:'Bebas Neue';-inkscape-font-specification:'Bebas Neue'"
           id="path1189" />
        <path
           d="m 256.98345,151.75797 h 0.37008 l 0.28694,1.12363 h 0.005 v -1.12363 h 0.2628 v 1.87718 h -0.30303 l -0.35398,-1.37034 h -0.005 v 1.37034 h -0.26281 z"
           style="font-family:'Bebas Neue';-inkscape-font-specification:'Bebas Neue'"
           id="path1191" />
        <path
           d="m 258.12853,151.75797 h 0.29499 v 1.87718 h -0.29499 z m 0.17431,-0.43443 h 0.3218 l -0.28694,0.30839 h -0.22258 z"
           style="font-family:'Bebas Neue';-inkscape-font-specification:'Bebas Neue'"
           id="path1193" />
        <path
           d="m 259.07248,151.75797 h 0.29499 v 0.7911 l 0.37543,-0.7911 h 0.29499 l -0.3513,0.68919 0.35666,1.18799 h -0.30839 l -0.2494,-0.83669 -0.11799,0.23867 v 0.59802 h -0.29499 z"
           style="font-family:'Bebas Neue';-inkscape-font-specification:'Bebas Neue'"
           id="path1195" />
        <path
           d="m 260.1827,151.75797 h 0.43711 q 0.22794,0 0.33253,0.10727 0.10458,0.10458 0.10458,0.32448 v 0.11531 q 0,0.29231 -0.19308,0.37008 v 0.005 q 0.10727,0.0322 0.15018,0.1314 0.0456,0.0992 0.0456,0.26549 v 0.32984 q 0,0.0805 0.005,0.13141 0.005,0.0483 0.0268,0.0965 h -0.30034 q -0.0161,-0.0456 -0.0215,-0.0858 -0.005,-0.0402 -0.005,-0.14481 v -0.34325 q 0,-0.12872 -0.0429,-0.17967 -0.0402,-0.051 -0.14213,-0.051 h -0.1019 v 0.80451 h -0.29498 z m 0.40225,0.80451 q 0.0885,0 0.1314,-0.0456 0.0456,-0.0456 0.0456,-0.15286 v -0.14481 q 0,-0.1019 -0.0375,-0.14749 -0.0349,-0.0456 -0.11263,-0.0456 h -0.13408 v 0.53634 z"
           style="font-family:'Bebas Neue';-inkscape-font-specification:'Bebas Neue'"
           id="path1197" />
        <path
           d="m 261.6898,153.66196 q -0.21722,0 -0.33253,-0.12335 -0.11531,-0.12336 -0.11531,-0.34862 v -0.98686 q 0,-0.22526 0.11531,-0.34862 0.11531,-0.12336 0.33253,-0.12336 0.21721,0 0.33253,0.12336 0.11531,0.12336 0.11531,0.34862 v 0.98686 q 0,0.22526 -0.11531,0.34862 -0.11532,0.12335 -0.33253,0.12335 z m 0,-0.26816 q 0.15285,0 0.15285,-0.18504 v -1.0244 q 0,-0.18504 -0.15285,-0.18504 -0.15286,0 -0.15286,0.18504 v 1.0244 q 0,0.18504 0.15286,0.18504 z"
           style="font-family:'Bebas Neue';-inkscape-font-specification:'Bebas Neue'"
           id="path1199" />
        <path
           d="m 262.33608,151.75797 h 0.29499 v 0.7911 l 0.37543,-0.7911 h 0.29499 l -0.3513,0.68919 0.35666,1.18799 h -0.30839 l -0.2494,-0.83669 -0.11799,0.23867 v 0.59802 h -0.29499 z"
           style="font-family:'Bebas Neue';-inkscape-font-specification:'Bebas Neue'"
           id="path1201" />
        <path
           d="m 263.4597,153.35089 h 0.28426 v 0.28426 h -0.28426 z"
           style="font-family:'Bebas Neue';-inkscape-font-specification:'Bebas Neue'"
           id="path1203" />
        <path
           d="m 263.96386,153.35089 h 0.28426 v 0.28426 h -0.28426 z"
           style="font-family:'Bebas Neue';-inkscape-font-specification:'Bebas Neue'"
           id="path1205" />
        <path
           d="m 264.46801,153.35089 h 0.28426 v 0.28426 h -0.28426 z"
           style="font-family:'Bebas Neue';-inkscape-font-specification:'Bebas Neue'"
           id="path1207" />
      </g>
    </g>
    <path
       id="path71733-0"
       style="fill:#ececec;fill-opacity:1;fill-rule:nonzero;stroke:none;stroke-width:0.397698"
       d="m 115.58969,143.45398 v -1.38287 h -0.86501 v 1.59768 c -0.58421,0.17968 -0.92506,0.36617 -0.86819,0.4815 0.19259,-0.0541 0.50192,-0.0775 0.86819,-0.0554 v 8.31706 c -0.88088,1.72363 0.38811,4.36154 0.38811,4.36154 0,0 -0.95484,-2.83189 1.16847,-4.17072 1.95073,-1.22802 8.67982,-0.65173 8.65471,-4.4482 -0.0294,-5.37965 -6.23673,-5.34777 -9.34628,-4.70079 m 2.77664,5.21538 c -0.30142,1.43338 -1.8643,2.17873 -2.77664,2.79868 v -7.24052 c 1.55499,0.37261 3.3828,1.56733 2.77664,4.44184"
       inkscape:connector-curvature="0" />
    <path
       id="path37900"
       style="color:#000000;fill:#000000;stroke-width:1;-inkscape-stroke:none"
       d="m 141.29662,138.20388 -6.18927,4.77129 0.50385,-1.91978 -1.12708,-0.29714 -1.1994,4.58628 4.74802,0.23048 0.18966,-1.14877 -2.3213,-0.3824 6.02237,-4.85966 z"
       sodipodi:nodetypes="cccccccccc" />
    <g
       aria-label="Klikni
a křížkuj
Piráty!"
       id="text40477"
       style="font-size:1.8679px;line-height:1;font-family:'Roboto Condensed';-inkscape-font-specification:'Roboto Condensed, ';text-align:center;letter-spacing:0px;word-spacing:0px;text-anchor:middle;stroke-width:0.0466975">
      <path
         d="m 133.85363,147.41622 -0.13043,0.15779 v 0.4542 h -0.1669 v -1.32796 h 0.1669 v 0.64118 l 0.10945,-0.14502 0.35753,-0.49616 h 0.20065 l -0.4314,0.58463 0.46515,0.74333 h -0.19974 z"
         id="path1133" />
      <path
         d="m 134.72556,148.02821 h -0.16144 v -1.40092 h 0.16144 z"
         id="path1135" />
      <path
         d="m 135.15331,148.02821 h -0.16143 v -0.98685 h 0.16143 z m 0.0128,-1.24861 q 0,0.0411 -0.0228,0.0684 -0.0228,0.0274 -0.0693,0.0274 -0.0456,0 -0.0684,-0.0274 -0.0228,-0.0274 -0.0228,-0.0684 0,-0.041 0.0228,-0.0693 0.0228,-0.0283 0.0684,-0.0283 0.0456,0 0.0684,0.0292 0.0237,0.0283 0.0237,0.0684 z"
         id="path1137" />
      <path
         d="m 135.65495,147.57674 -0.0857,0.0985 v 0.35296 h -0.16143 v -1.40092 h 0.16143 v 0.83818 l 0.30737,-0.42411 h 0.19335 l -0.31374,0.41226 0.35479,0.57459 h -0.18789 z"
         id="path1139" />
      <path
         d="m 136.40101,147.04136 0.005,0.10672 q 0.0939,-0.12496 0.23987,-0.12496 0.26177,0 0.26541,0.34932 v 0.65577 h -0.16052 v -0.64847 q 0,-0.11583 -0.0392,-0.16417 -0.0383,-0.0493 -0.11583,-0.0493 -0.0602,0 -0.10853,0.0401 -0.0474,0.0401 -0.0766,0.10488 v 0.71688 h -0.16143 v -0.98685 z"
         id="path1141" />
      <path
         d="m 137.32675,148.02821 h -0.16143 v -0.98685 h 0.16143 z m 0.0128,-1.24861 q 0,0.0411 -0.0228,0.0684 -0.0228,0.0274 -0.0693,0.0274 -0.0456,0 -0.0684,-0.0274 -0.0228,-0.0274 -0.0228,-0.0684 0,-0.041 0.0228,-0.0693 0.0228,-0.0283 0.0684,-0.0283 0.0456,0 0.0684,0.0292 0.0237,0.0283 0.0237,0.0684 z"
         id="path1143" />
      <path
         d="m 132.98808,149.89611 q -0.0146,-0.0319 -0.021,-0.10762 -0.0857,0.12586 -0.21889,0.12586 -0.13407,0 -0.20977,-0.0748 -0.0748,-0.0757 -0.0748,-0.21251 0,-0.15049 0.10215,-0.23896 0.10215,-0.0885 0.28,-0.0903 h 0.11857 v -0.10489 q 0,-0.0885 -0.0392,-0.12586 -0.0392,-0.0374 -0.11948,-0.0374 -0.073,0 -0.11857,0.0438 -0.0456,0.0429 -0.0456,0.10945 h -0.16144 q 0,-0.0757 0.0447,-0.1441 0.0447,-0.0693 0.1204,-0.10854 0.0757,-0.0392 0.16873,-0.0392 0.1514,0 0.22984,0.0757 0.0794,0.0748 0.0812,0.2189 v 0.49798 q 9.1e-4,0.11401 0.031,0.19792 v 0.0146 z m -0.21524,-0.1286 q 0.0593,0 0.11309,-0.0328 0.0538,-0.0328 0.0784,-0.0821 v -0.23531 h -0.0912 q -0.11492,0.002 -0.1815,0.052 -0.0666,0.0493 -0.0666,0.13863 0,0.0839 0.0337,0.12222 0.0337,0.0374 0.11401,0.0374 z"
         id="path1145" />
      <path
         d="m 134.05063,149.44464 -0.0857,0.0985 v 0.35296 h -0.16144 v -1.40092 h 0.16144 v 0.83818 l 0.30736,-0.42411 h 0.19336 l -0.31375,0.41226 0.35479,0.57459 h -0.18788 z"
         id="path1147" />
      <path
         d="m 135.05207,149.06067 q -0.0337,-0.006 -0.073,-0.006 -0.12404,0 -0.17329,0.1359 v 0.70593 h -0.16144 v -0.98685 h 0.15688 l 0.003,0.10033 q 0.0648,-0.11857 0.18333,-0.11857 0.0383,0 0.0638,0.0128 z m -0.19791,-0.41043 0.10853,-0.15505 h 0.13772 v 0.009 l -0.19974,0.2499 h -0.0948 l -0.19609,-0.2499 v -0.009 h 0.13498 z"
         id="path1149" />
      <path
         d="m 135.3868,149.89611 h -0.16143 v -0.98685 h 0.16143 z m 0.006,-1.40001 h 0.2043 l -0.24444,0.26815 h -0.13589 z"
         id="path1151" />
      <path
         d="m 135.80088,149.75839 h 0.47609 v 0.13772 h -0.66033 v -0.12404 l 0.45238,-0.72326 h -0.44873 v -0.13955 h 0.63844 v 0.11948 z m 0.14228,-1.10815 0.10853,-0.15505 h 0.13772 v 0.009 l -0.19974,0.2499 h -0.0948 l -0.19609,-0.2499 v -0.009 h 0.13498 z"
         id="path1153" />
      <path
         d="m 136.71932,149.44464 -0.0857,0.0985 v 0.35296 h -0.16144 v -1.40092 h 0.16144 v 0.83818 l 0.30736,-0.42411 h 0.19336 l -0.31375,0.41226 0.35479,0.57459 h -0.18788 z"
         id="path1155" />
      <path
         d="m 137.81653,149.80947 q -0.0803,0.10488 -0.2344,0.10488 -0.13407,0 -0.20248,-0.0921 -0.0684,-0.093 -0.0693,-0.26997 v -0.64301 h 0.16052 v 0.63115 q 0,0.23075 0.13863,0.23075 0.14684,0 0.20248,-0.13134 v -0.73056 h 0.16143 v 0.98685 h -0.15322 z"
         id="path1157" />
      <path
         d="m 138.3811,148.90926 v 1.11089 q -0.003,0.27453 -0.21707,0.27453 -0.0493,0 -0.0885,-0.0164 l -9.2e-4,-0.13499 q 0.0246,0.007 0.0629,0.007 0.041,0 0.0611,-0.031 0.021,-0.0301 0.021,-0.1058 v -1.10451 z m 0.007,-0.26176 q 0,0.041 -0.0228,0.0684 -0.0228,0.0274 -0.0693,0.0274 -0.0456,0 -0.0684,-0.0274 -0.0219,-0.0274 -0.0219,-0.0684 0,-0.041 0.0219,-0.0693 0.0228,-0.0283 0.0684,-0.0283 0.0456,0 0.0684,0.0292 0.0237,0.0283 0.0237,0.0684 z"
         id="path1159" />
      <path
         d="m 133.40763,151.24414 v 0.51987 h -0.16691 v -1.32796 h 0.4232 q 0.18515,0 0.29095,0.11127 0.10579,0.11036 0.10579,0.2946 0,0.19153 -0.10123,0.29551 -0.10033,0.10306 -0.28365,0.10671 z m 0,-0.14319 h 0.25629 q 0.11127,0 0.17055,-0.0666 0.0593,-0.0666 0.0593,-0.19063 0,-0.11948 -0.0611,-0.19153 -0.0611,-0.072 -0.16782,-0.072 h -0.2572 z"
         id="path1161" />
      <path
         d="m 134.42731,151.76401 h -0.16143 v -0.98685 h 0.16143 z m 0.0128,-1.24861 q 0,0.0411 -0.0228,0.0684 -0.0228,0.0274 -0.0693,0.0274 -0.0456,0 -0.0684,-0.0274 -0.0228,-0.0274 -0.0228,-0.0684 0,-0.041 0.0228,-0.0693 0.0228,-0.0283 0.0684,-0.0283 0.0456,0 0.0684,0.0292 0.0237,0.0283 0.0237,0.0684 z"
         id="path1163" />
      <path
         d="m 135.08856,150.92857 q -0.0337,-0.006 -0.073,-0.006 -0.12404,0 -0.17329,0.1359 v 0.70593 h -0.16143 v -0.98685 h 0.15687 l 0.003,0.10033 q 0.0647,-0.11857 0.18332,-0.11857 0.0383,0 0.0638,0.0128 z"
         id="path1165" />
      <path
         d="m 135.72061,151.76401 q -0.0146,-0.0319 -0.021,-0.10762 -0.0857,0.12586 -0.2189,0.12586 -0.13407,0 -0.20977,-0.0748 -0.0748,-0.0757 -0.0748,-0.21251 0,-0.15049 0.10215,-0.23896 0.10215,-0.0885 0.28,-0.0903 h 0.11857 v -0.10489 q 0,-0.0885 -0.0392,-0.12586 -0.0392,-0.0374 -0.11948,-0.0374 -0.073,0 -0.11857,0.0438 -0.0456,0.0429 -0.0456,0.10945 h -0.16143 q 0,-0.0757 0.0447,-0.1441 0.0447,-0.0693 0.12039,-0.10854 0.0757,-0.0392 0.16873,-0.0392 0.1514,0 0.22984,0.0757 0.0794,0.0748 0.0812,0.2189 v 0.49798 q 9.2e-4,0.11401 0.031,0.19792 v 0.0146 z m -0.21524,-0.1286 q 0.0593,0 0.11309,-0.0328 0.0538,-0.0328 0.0784,-0.0821 v -0.23531 h -0.0912 q -0.11492,0.002 -0.1815,0.052 -0.0666,0.0493 -0.0666,0.13863 0,0.0839 0.0337,0.12222 0.0337,0.0374 0.11401,0.0374 z m 0.13407,-1.27232 h 0.2043 l -0.24443,0.26814 h -0.1359 z"
         id="path1167" />
      <path
         d="m 136.31893,150.5382 v 0.23896 h 0.14866 v 0.13043 h -0.14866 v 0.61199 q 0,0.0584 0.0191,0.0885 0.0191,0.0301 0.0657,0.0301 0.0319,0 0.0648,-0.011 l -0.002,0.13681 q -0.0547,0.0182 -0.11218,0.0182 -0.0958,0 -0.14593,-0.0684 -0.0502,-0.0684 -0.0502,-0.19336 v -0.6129 h -0.15049 v -0.13043 h 0.15049 v -0.23896 z"
         id="path1169" />
      <path
         d="m 136.9291,151.49587 0.17967,-0.71871 h 0.17147 l -0.32287,1.1264 q -0.0365,0.12678 -0.10306,0.19244 -0.0666,0.0666 -0.15141,0.0666 -0.0328,0 -0.0839,-0.0146 v -0.13681 l 0.0356,0.004 q 0.0702,0 0.10945,-0.0337 0.0401,-0.0328 0.0648,-0.11492 l 0.0319,-0.11036 -0.29003,-0.97864 h 0.17602 z"
         id="path1171" />
      <path
         d="m 137.61953,151.38916 h -0.14502 l -0.0119,-0.95311 h 0.16964 z m -0.0684,0.19335 q 0.0456,0 0.0684,0.0283 0.0237,0.0274 0.0237,0.0684 0,0.041 -0.0237,0.0684 -0.0228,0.0264 -0.0684,0.0264 -0.0465,0 -0.0693,-0.0264 -0.0228,-0.0274 -0.0228,-0.0684 0,-0.041 0.0228,-0.0684 0.0228,-0.0283 0.0693,-0.0283 z"
         id="path1173" />
    </g>
  </g>
</svg>
