<?xml version="1.0" encoding="UTF-8" standalone="no"?>
<svg
   xmlns:dc="http://purl.org/dc/elements/1.1/"
   xmlns:cc="http://creativecommons.org/ns#"
   xmlns:rdf="http://www.w3.org/1999/02/22-rdf-syntax-ns#"
   xmlns:svg="http://www.w3.org/2000/svg"
   xmlns="http://www.w3.org/2000/svg"
   viewBox="0 0 512.02374 447.95703"
   version="1.1"
   id="svg4"
   width="512.02374"
   height="447.95703">
  <metadata
     id="metadata10">
    <rdf:RDF>
      <cc:Work
         rdf:about="">
        <dc:format>image/svg+xml</dc:format>
        <dc:type
           rdf:resource="http://purl.org/dc/dcmitype/StillImage" />
        <dc:title></dc:title>
      </cc:Work>
    </rdf:RDF>
  </metadata>
  <defs
     id="defs8" />
  <!--! Font Awesome Pro 6.1.2 by @fontawesome - https://fontawesome.com License - https://fontawesome.com/license (Commercial License) Copyright 2022 Fonticons, Inc. -->
  <path
     d="m 503.7,194.18996 -176,151.1 c -15.38,13.3 -39.69,2.545 -39.69,-18.16 v -87.04 c -155.11,2.2 -221.95,40.7 -176.61,185.7 5.031,16.09 -14.41,28.56 -28.06,18.62 -43.75,-31.82 -83.34,-92.62 -83.34,-154.12 0,-152.2 127.4,-184.4 288,-186.3 V 24.009961 C 288,3.3399605 312.28,-7.4500395 327.69,5.8499605 l 176,151.0999995 c 11.11,10.44 11.11,27.64 0.01,37.24 z"
     id="path2"
     style="fill:#ffffff" />
</svg>
