{
	"POINTS": {
		"neg-full": 0,
		"neg-half": 0.1,
		"neut": 0.3,
		"pos-half": 0.75,
		"pos-full": 1
	},
	"REGIONS": {
		"ustecky": {
			"name": "Ústecký Kraj",
			"districts": [
				"teplice"
			]
		}
	},
	"DISTRICTS": {
		"teplice": {
			"name": "Teplice",
			"people": [
				"tomasvalenta",
				"jonasvalenta"
			]
		}
	},
	"PEOPLE": {
		"tomasvalenta": {
			"name": "Tomáš Valenta",
			"description": "To jsem já.",
			"district": "teplice"
		},
		"jonasvalenta": {
			"name": "Jonáš Valenta",
			"description": "To nejsem já.",
			"district": "teplice"
		}
	},
	"QUESTIONS": {
		"sehnat-bydleni-neznamena-zadluzit": {
			"content": "Sehnat si bydlení ve městě nesmí znamenat zadlužit se na celý život.",
			"responses": {
				"tomasvalenta": 0.75,
				"jonasvalenta": 0.5
			},
			"weight": 1
		},
		"bydleni-je-zakladni-potreba-ale-nedostupne": {
			"content": "Bydlení je základní lidská potřeba. Už dnes je ale pro mnohé nedostupné.",
			"responses": {
				"tomasvalenta": 0.75,
				"jonasvalenta": 0.5
			},
			"weight": 1
		},
		"okradat-obec-je-okradani-nas": {
			"content": "Okrádat obec znamená okrádat každého z nás.",
			"responses": {
				"tomasvalenta": 1,
				"jonasvalenta": 0.75
			},
			"weight": 1
		}
	}
}
