{
	"API_URL": "http://heiwa_heiwa_1:5001",
	"PUBLIC_API_URL": "http://localhost.localdomain:5001",
	"BASE_VIEW": "forum.list_",
	"SECRET_KEY": "shhhhhhhhhhhhhhhhhhhhhhhhhhhhhhh",
	"CACHE_EXPIRES_AFTER": 60
}
