{
	"id": "https://schema.org/identifier",
	"creation_timestamp": "https://schema.org/DateTime",
	"edit_timestamp": "https://schema.org/DateTime",
	"edit_count": "https://schema.org/Number",
	"sender_id": "https://schema.org/identifier",
	"receiver_id": "https://schema.org/identifier",
	"sender_directory_id": "https://schema.org/identifier",
	"receiver_directory_id": "https://schema.org/identifier",
	"is_read": "https://schema.org/Boolean",
	"encrypted_session_key": "https://schema.org/Text",
	"tag": "https://schema.org/Text",
	"encrypted_content": "https://schema.org/Text"
}
