{
	"id": "https://schema.org/identifier",
	"creation_timestamp": "https://schema.org/DateTime",
	"user_id": "https://schema.org/identifier",
	"is_read": "https://schema.org/Boolean",
	"type": "https://schema.org/Text",
	"identifier": "https://schema.org/identifier"
}
