{
    "creation_timestamp": "https://schema.org/DateTime",
    "edit_timestamp": "https://schema.org/DateTime",
    "edit_count": "https://schema.org/Number",
    "local_account_id": "https://schema.org/identifier",
    "secret": "https://schema.org/Text"
}
