{
	"creation_timestamp": "https://schema.org/DateTime",
	"edit_timestamp": "https://schema.org/DateTime",
	"edit_count": "https://schema.org/Number",
	"thread_id": "https://schema.org/identifier",
	"user_id": "https://schema.org/identifier",
	"is_upvote": "https://schema.org/Boolean"
}
