{
	"id": "https://schema.org/identifier",
	"creation_timestamp": "https://schema.org/DateTime",
	"edit_timestamp": "https://schema.org/DateTime",
	"edit_count": "https://schema.org/Number",
	"thread_id": "https://schema.org/identifier",
	"user_id": "https://schema.org/identifier",
	"subject": "https://schema.org/Text",
	"content": "https://schema.org/Text",
	"vote_value": "https://schema.org/Number"
}
