<?xml version="1.0" encoding="UTF-8" standalone="no"?>
<svg:svg
   xmlns:dc="http://purl.org/dc/elements/1.1/"
   xmlns:cc="http://creativecommons.org/ns#"
   xmlns:rdf="http://www.w3.org/1999/02/22-rdf-syntax-ns#"
   xmlns:svg="http://www.w3.org/2000/svg"
   id="svg3551"
   viewBox="0 0 576.44202 577.4491"
   version="1.0"
   width="576.44202"
   height="577.4491">
  <svg:defs
     id="defs1403" />
  <script />
  <svg:g
     id="g3561"
     transform="translate(-17.861,-17.860889)">
    <svg:path
       id="path3563"
       style="fill:#0d7377;fill-opacity:1;stroke:none;stroke-width:3.408;stroke-miterlimit:4;stroke-dasharray:none"
       d="m 82.432,17.924 c -41.335,0 -64.571,21.371 -64.571,65.036 v 450.12 c 0,40.84 20.891,62.23 62.192,62.23 h 452.03 c 41.3,0 62.22,-20.32 62.22,-62.23 V 82.96 c 0,-42.6 -20.92,-65.036 -63.52,-65.036 0,0 -448.49,-0.142 -448.35,0 z" />
    <svg:path
       id="path3565"
       style="fill:#ffffff"
       d="M 260.4,475.13 80.2,294.93 260.4,114.74 H 379.25 L 242.18,251.8 h 269.34 v 87.23 H 243.14 l 136.32,136.32 z" />
  </svg:g>
  <svg:metadata
     id="metadata1400">
    <rdf:RDF>
      <cc:Work>
        <dc:format>image/svg+xml</dc:format>
        <dc:type
           rdf:resource="http://purl.org/dc/dcmitype/StillImage" />
        <cc:license
           rdf:resource="http://creativecommons.org/licenses/publicdomain/" />
        <dc:publisher>
          <cc:Agent
             rdf:about="http://openclipart.org/">
            <dc:title>Openclipart</dc:title>
          </cc:Agent>
        </dc:publisher>
        <dc:title></dc:title>
        <dc:date>2009-06-20T15:01:54</dc:date>
        <dc:description>Set of international airport symbols. Source: http://www.aiga.org/content.cfm/symbol-signs Converted to SVG by Jean-Victor Balin.</dc:description>
        <dc:source>https://openclipart.org/detail/26744/aiga-left-arrow-bg-by-anonymous</dc:source>
        <dc:creator>
          <cc:Agent>
            <dc:title>Anonymous</dc:title>
          </cc:Agent>
        </dc:creator>
        <dc:subject>
          <rdf:Bag>
            <rdf:li>aiga</rdf:li>
            <rdf:li>aiga bg</rdf:li>
            <rdf:li>arrow</rdf:li>
            <rdf:li>externalsource</rdf:li>
            <rdf:li>left</rdf:li>
            <rdf:li>map symbol</rdf:li>
            <rdf:li>sign</rdf:li>
            <rdf:li>silhouette</rdf:li>
            <rdf:li>symbol</rdf:li>
          </rdf:Bag>
        </dc:subject>
      </cc:Work>
      <cc:License
         rdf:about="http://creativecommons.org/licenses/publicdomain/">
        <cc:permits
           rdf:resource="http://creativecommons.org/ns#Reproduction" />
        <cc:permits
           rdf:resource="http://creativecommons.org/ns#Distribution" />
        <cc:permits
           rdf:resource="http://creativecommons.org/ns#DerivativeWorks" />
      </cc:License>
    </rdf:RDF>
  </svg:metadata>
</svg:svg>
