{
  "transactions": [
    {
      "hash": null,
      "transactionType": "CALL",
      "contractName": null,
      "contractAddress": "0x9839F4ebd2CDC5064D5f4a15231947feaC68D747",
      "function": null,
      "arguments": null,
      "transaction": {
        "type": "0x02",
        "from": "0x85752248d8cca2d9321f0278fc785738e1236ce4",
        "to": "0x9839f4ebd2cdc5064d5f4a15231947feac68d747",
        "gas": "0xf81b",
        "value": "0x0",
        "data": "0xd710442a000000000000000000000000000000000000000000000000000000000000000500000000000000000000000000000000000000000000000000000000000000000000000000000000000000000000000000000000000000000000000000000012",
        "nonce": "0x329",
        "accessList": []
      },
      "additionalContracts": [],
      "isFixedGasLimit": false
    },
    {
      "hash": null,
      "transactionType": "CALL",
      "contractName": null,
      "contractAddress": "0x7De0194878dcb44A7713F3598624A817aCB0bD74",
      "function": null,
      "arguments": null,
      "transaction": {
        "type": "0x02",
        "from": "0x85752248d8cca2d9321f0278fc785738e1236ce4",
        "to": "0x7de0194878dcb44a7713f3598624a817acb0bd74",
        "gas": "0x23487",
        "value": "0x0",
        "data": "0xee39043c0000000000000000000000000000000000000000000000000000000000000005000000000000000000000000000000000000000000000000000000000000000000000000000000000000000000000000000000000000006663f303de1e8d0000",
        "nonce": "0x32a",
        "accessList": []
      },
      "additionalContracts": [],
      "isFixedGasLimit": false
    },
    {
      "hash": null,
      "transactionType": "CALL",
      "contractName": null,
      "contractAddress": "0x9839F4ebd2CDC5064D5f4a15231947feaC68D747",
      "function": null,
      "arguments": null,
      "transaction": {
        "type": "0x02",
        "from": "0x85752248d8cca2d9321f0278fc785738e1236ce4",
        "to": "0x9839f4ebd2cdc5064d5f4a15231947feac68d747",
        "gas": "0xf934",
        "value": "0x0",
        "data": "0xd710442a00000000000000000000000000000000000000000000000000000000000000050000000000000000000000000000b6165af19f2c87c56183115d9a52aa22dbc70000000000000000000000000000000000000000000000000000000000000006",
        "nonce": "0x32b",
        "accessList": []
      },
      "additionalContracts": [],
      "isFixedGasLimit": false
    },
    {
      "hash": null,
      "transactionType": "CALL",
      "contractName": null,
      "contractAddress": "0x7De0194878dcb44A7713F3598624A817aCB0bD74",
      "function": null,
      "arguments": null,
      "transaction": {
        "type": "0x02",
        "from": "0x85752248d8cca2d9321f0278fc785738e1236ce4",
        "to": "0x7de0194878dcb44a7713f3598624a817acb0bd74",
        "gas": "0x21643",
        "value": "0x0",
        "data": "0xee39043c00000000000000000000000000000000000000000000000000000000000000050000000000000000000000000000b6165af19f2c87c56183115d9a52aa22dbc70000000000000000000000000000000000000000000000000de0b6b3a7640000",
        "nonce": "0x32c",
        "accessList": []
      },
      "additionalContracts": [],
      "isFixedGasLimit": false
    }
  ],
  "receipts": [],
  "libraries": [],
  "pending": [],
  "returns": {},
  "timestamp": 1693099528,
  "chain": 421613,
  "multi": false,
  "commit": "47a96f1"
}