{
  "transactions": [
    {
      "hash": null,
      "transactionType": "CALL",
      "contractName": null,
      "contractAddress": "0x980c2940f45F225ab937712A70efeCfFB16feAFe",
      "function": null,
      "arguments": null,
      "transaction": {
        "type": "0x02",
        "from": "0x85752248d8cca2d9321f0278fc785738e1236ce4",
        "to": "0x980c2940f45f225ab937712a70efecffb16feafe",
        "gas": "0xf81b",
        "value": "0x0",
        "data": "0xd710442a000000000000000000000000000000000000000000000000000000000000000500000000000000000000000000000000000000000000000000000000000000000000000000000000000000000000000000000000000000000000000000000012",
        "nonce": "0x2f6",
        "accessList": []
      },
      "additionalContracts": [],
      "isFixedGasLimit": false
    },
    {
      "hash": null,
      "transactionType": "CALL",
      "contractName": null,
      "contractAddress": "0xAb90C922ff0D4c69f7CBDe50277dca02A2b63d0e",
      "function": null,
      "arguments": null,
      "transaction": {
        "type": "0x02",
        "from": "0x85752248d8cca2d9321f0278fc785738e1236ce4",
        "to": "0xab90c922ff0d4c69f7cbde50277dca02a2b63d0e",
        "gas": "0x23487",
        "value": "0x0",
        "data": "0xee39043c0000000000000000000000000000000000000000000000000000000000000005000000000000000000000000000000000000000000000000000000000000000000000000000000000000000000000000000000000000006663f303de1e8d0000",
        "nonce": "0x2f7",
        "accessList": []
      },
      "additionalContracts": [],
      "isFixedGasLimit": false
    },
    {
      "hash": null,
      "transactionType": "CALL",
      "contractName": null,
      "contractAddress": "0x980c2940f45F225ab937712A70efeCfFB16feAFe",
      "function": null,
      "arguments": null,
      "transaction": {
        "type": "0x02",
        "from": "0x85752248d8cca2d9321f0278fc785738e1236ce4",
        "to": "0x980c2940f45f225ab937712a70efecffb16feafe",
        "gas": "0xf934",
        "value": "0x0",
        "data": "0xd710442a00000000000000000000000000000000000000000000000000000000000000050000000000000000000000000000b6165af19f2c87c56183115d9a52aa22dbc70000000000000000000000000000000000000000000000000000000000000006",
        "nonce": "0x2f8",
        "accessList": []
      },
      "additionalContracts": [],
      "isFixedGasLimit": false
    },
    {
      "hash": null,
      "transactionType": "CALL",
      "contractName": null,
      "contractAddress": "0xAb90C922ff0D4c69f7CBDe50277dca02A2b63d0e",
      "function": null,
      "arguments": null,
      "transaction": {
        "type": "0x02",
        "from": "0x85752248d8cca2d9321f0278fc785738e1236ce4",
        "to": "0xab90c922ff0d4c69f7cbde50277dca02a2b63d0e",
        "gas": "0x21643",
        "value": "0x0",
        "data": "0xee39043c00000000000000000000000000000000000000000000000000000000000000050000000000000000000000000000b6165af19f2c87c56183115d9a52aa22dbc70000000000000000000000000000000000000000000000000de0b6b3a7640000",
        "nonce": "0x2f9",
        "accessList": []
      },
      "additionalContracts": [],
      "isFixedGasLimit": false
    }
  ],
  "receipts": [],
  "libraries": [],
  "pending": [],
  "returns": {},
  "timestamp": 1693013132,
  "chain": 421613,
  "multi": false,
  "commit": "47a96f1"
}