{
  "transactions": [
    {
      "hash": null,
      "transactionType": "CALL",
      "contractName": null,
      "contractAddress": "0xB8025BD053811a1CA774CB134ff42aB5a787f394",
      "function": null,
      "arguments": null,
      "transaction": {
        "type": "0x00",
        "from": "0x85752248d8cca2d9321f0278fc785738e1236ce4",
        "to": "0xb8025bd053811a1ca774cb134ff42ab5a787f394",
        "gas": "0x1085b",
        "value": "0x0",
        "data": "0x331f570300000000000000000000000000000000000000000000000000000000000000000000000000000000000000000000000000000000000000000000000000000000",
        "nonce": "0x410"
      },
      "additionalContracts": [],
      "isFixedGasLimit": false
    },
    {
      "hash": null,
      "transactionType": "CALL",
      "contractName": null,
      "contractAddress": "0x57546f95163291b04588a2aBDC1FeB0FA215561A",
      "function": null,
      "arguments": null,
      "transaction": {
        "type": "0x00",
        "from": "0x85752248d8cca2d9321f0278fc785738e1236ce4",
        "to": "0x57546f95163291b04588a2abdc1feb0fa215561a",
        "gas": "0xf922",
        "value": "0x0",
        "data": "0x095ea7b3000000000000000000000000b8025bd053811a1ca774cb134ff42ab5a787f3940000000000000000000000000000000000000000000000000000000000000001",
        "nonce": "0x411"
      },
      "additionalContracts": [],
      "isFixedGasLimit": false
    },
    {
      "hash": null,
      "transactionType": "CALL",
      "contractName": null,
      "contractAddress": "0x57546f95163291b04588a2aBDC1FeB0FA215561A",
      "function": null,
      "arguments": null,
      "transaction": {
        "type": "0x00",
        "from": "0x85752248d8cca2d9321f0278fc785738e1236ce4",
        "to": "0x57546f95163291b04588a2abdc1feb0fa215561a",
        "gas": "0x961a",
        "value": "0x0",
        "data": "0x095ea7b3000000000000000000000000b8025bd053811a1ca774cb134ff42ab5a787f3940000000000000000000000000000000000000000000000000000000000000001",
        "nonce": "0x412"
      },
      "additionalContracts": [],
      "isFixedGasLimit": false
    },
    {
      "hash": null,
      "transactionType": "CALL",
      "contractName": null,
      "contractAddress": "0xB8025BD053811a1CA774CB134ff42aB5a787f394",
      "function": null,
      "arguments": null,
      "transaction": {
        "type": "0x00",
        "from": "0x85752248d8cca2d9321f0278fc785738e1236ce4",
        "to": "0xb8025bd053811a1ca774cb134ff42ab5a787f394",
        "gas": "0x19ddb",
        "value": "0x0",
        "data": "0x331f570300000000000000000000000057546f95163291b04588a2abdc1feb0fa215561a00000000000000000000000085752248d8cca2d9321f0278fc785738e1236ce4",
        "nonce": "0x413"
      },
      "additionalContracts": [],
      "isFixedGasLimit": false
    }
  ],
  "receipts": [],
  "libraries": [],
  "pending": [],
  "returns": {},
  "timestamp": 1693101068,
  "chain": 97,
  "multi": false,
  "commit": "47a96f1"
}