{
  "transactions": [
    {
      "hash": null,
      "transactionType": "CALL",
      "contractName": null,
      "contractAddress": "0xbf08C6E3f15165B45a569C526724F209c25df8D2",
      "function": null,
      "arguments": null,
      "transaction": {
        "type": "0x02",
        "from": "0x85752248d8cca2d9321f0278fc785738e1236ce4",
        "to": "0xbf08c6e3f15165b45a569c526724f209c25df8d2",
        "gas": "0x3ae9b",
        "value": "0x6f05b59d3b20000",
        "data": "0x1587e558",
        "nonce": "0x1f8",
        "accessList": []
      },
      "additionalContracts": [],
      "isFixedGasLimit": false
    }
  ],
  "receipts": [],
  "libraries": [],
  "pending": [],
  "returns": {},
  "timestamp": 1693519866,
  "chain": 80001,
  "multi": false,
  "commit": "ee0df5e"
}