{
  "transactions": [
    {
      "hash": null,
      "transactionType": "CALL",
      "contractName": null,
      "contractAddress": "0xd1F8690152d81AbfC5CcC6211Ec46FCc7329e5Bf",
      "function": null,
      "arguments": null,
      "transaction": {
        "type": "0x02",
        "from": "0x85752248d8cca2d9321f0278fc785738e1236ce4",
        "to": "0xd1f8690152d81abfc5ccc6211ec46fcc7329e5bf",
        "gas": "0x10845",
        "value": "0x0",
        "data": "0x095ea7b3000000000000000000000000edb6dbdc78fcc0b8853ad4e8a04262fd47c622ab000000000000000000000000000000000000000000000a968163f0a57b400000",
        "nonce": "0xa30",
        "accessList": []
      },
      "additionalContracts": [],
      "isFixedGasLimit": false
    },
    {
      "hash": null,
      "transactionType": "CALL",
      "contractName": null,
      "contractAddress": "0x03e0Eeb605bd59F041d90cA06268a7A52e856D51",
      "function": null,
      "arguments": null,
      "transaction": {
        "type": "0x02",
        "from": "0x85752248d8cca2d9321f0278fc785738e1236ce4",
        "to": "0x03e0eeb605bd59f041d90ca06268a7a52e856d51",
        "gas": "0x10845",
        "value": "0x0",
        "data": "0x095ea7b3000000000000000000000000edb6dbdc78fcc0b8853ad4e8a04262fd47c622ab00000000000000000000000000000000000000000000152d02c7e14af6800000",
        "nonce": "0xa31",
        "accessList": []
      },
      "additionalContracts": [],
      "isFixedGasLimit": false
    },
    {
      "hash": null,
      "transactionType": "CALL",
      "contractName": null,
      "contractAddress": "0xEdb6Dbdc78fCC0B8853ad4e8A04262fD47C622aB",
      "function": null,
      "arguments": null,
      "transaction": {
        "type": "0x02",
        "from": "0x85752248d8cca2d9321f0278fc785738e1236ce4",
        "to": "0xedb6dbdc78fcc0b8853ad4e8a04262fd47c622ab",
        "gas": "0x565f8",
        "value": "0x0",
        "data": "0x0c51b88f00000000000000000000000003e0eeb605bd59f041d90ca06268a7a52e856d510000000000000000000000000000000000000000000000056bc75e2d631000000000000000000000000000000000000000000000000000000000000000918390",
        "nonce": "0xa32",
        "accessList": []
      },
      "additionalContracts": [],
      "isFixedGasLimit": false
    },
    {
      "hash": null,
      "transactionType": "CALL",
      "contractName": null,
      "contractAddress": "0xEdb6Dbdc78fCC0B8853ad4e8A04262fD47C622aB",
      "function": null,
      "arguments": null,
      "transaction": {
        "type": "0x02",
        "from": "0x85752248d8cca2d9321f0278fc785738e1236ce4",
        "to": "0xedb6dbdc78fcc0b8853ad4e8a04262fd47c622ab",
        "gas": "0x53dc5",
        "value": "0x0",
        "data": "0x0c51b88f000000000000000000000000d1f8690152d81abfc5ccc6211ec46fcc7329e5bf000000000000000000000000000000000000000000000a968163f0a57b4000000000000000000000000000000000000000000000000000000000000000918390",
        "nonce": "0xa33",
        "accessList": []
      },
      "additionalContracts": [],
      "isFixedGasLimit": false
    }
  ],
  "receipts": [],
  "libraries": [],
  "pending": [],
  "returns": {},
  "timestamp": 1692651765,
  "chain": 5,
  "multi": false,
  "commit": "c856ad3"
}