{
  "transactions": [
    {
      "hash": "0xe102d7c59311f0439a1db76889981d0c1037a2dc1b59272fe7ea8def603b3af7",
      "transactionType": "CALL",
      "contractName": null,
      "contractAddress": "0xF3f607cea8B2096882c09f3ceBDff1317c95Ad73",
      "function": null,
      "arguments": null,
      "transaction": {
        "type": "0x02",
        "from": "0x85752248d8cca2d9321f0278fc785738e1236ce4",
        "to": "0xf3f607cea8b2096882c09f3cebdff1317c95ad73",
        "gas": "0x36062",
        "value": "0x16345785d8a0000",
        "data": "0x1587e558",
        "nonce": "0xa61",
        "accessList": []
      },
      "additionalContracts": [],
      "isFixedGasLimit": false
    },
    {
      "hash": "0x51e4820d0d71605a3e615096413ff5283695ea68f7f426e18438dd7428fb10c0",
      "transactionType": "CALL",
      "contractName": null,
      "contractAddress": "0xF3f607cea8B2096882c09f3ceBDff1317c95Ad73",
      "function": null,
      "arguments": null,
      "transaction": {
        "type": "0x02",
        "from": "0x85752248d8cca2d9321f0278fc785738e1236ce4",
        "to": "0xf3f607cea8b2096882c09f3cebdff1317c95ad73",
        "gas": "0x36062",
        "value": "0x16345785d8a0000",
        "data": "0x1587e558",
        "nonce": "0xa62",
        "accessList": []
      },
      "additionalContracts": [],
      "isFixedGasLimit": false
    },
    {
      "hash": "0x95b081c965fd6e1d0c60c6a5a5052f238cb1d0aef2a8318b7702042b2be305f0",
      "transactionType": "CALL",
      "contractName": null,
      "contractAddress": "0xF3f607cea8B2096882c09f3ceBDff1317c95Ad73",
      "function": null,
      "arguments": null,
      "transaction": {
        "type": "0x02",
        "from": "0x85752248d8cca2d9321f0278fc785738e1236ce4",
        "to": "0xf3f607cea8b2096882c09f3cebdff1317c95ad73",
        "gas": "0x36062",
        "value": "0x16345785d8a0000",
        "data": "0x1587e558",
        "nonce": "0xa63",
        "accessList": []
      },
      "additionalContracts": [],
      "isFixedGasLimit": false
    },
    {
      "hash": "0x90fd16c22828430bb943248dca8d2193ed2e8786ab1f6e54d6f6db882df53dd7",
      "transactionType": "CALL",
      "contractName": null,
      "contractAddress": "0xF3f607cea8B2096882c09f3ceBDff1317c95Ad73",
      "function": null,
      "arguments": null,
      "transaction": {
        "type": "0x02",
        "from": "0x85752248d8cca2d9321f0278fc785738e1236ce4",
        "to": "0xf3f607cea8b2096882c09f3cebdff1317c95ad73",
        "gas": "0x36062",
        "value": "0x16345785d8a0000",
        "data": "0x1587e558",
        "nonce": "0xa64",
        "accessList": []
      },
      "additionalContracts": [],
      "isFixedGasLimit": false
    },
    {
      "hash": "0xb15040de7aacccccf4cf2577d9f31afb1e1ec7a2c9578c876384c50ca177458a",
      "transactionType": "CALL",
      "contractName": null,
      "contractAddress": "0xF3f607cea8B2096882c09f3ceBDff1317c95Ad73",
      "function": null,
      "arguments": null,
      "transaction": {
        "type": "0x02",
        "from": "0x85752248d8cca2d9321f0278fc785738e1236ce4",
        "to": "0xf3f607cea8b2096882c09f3cebdff1317c95ad73",
        "gas": "0x36062",
        "value": "0x16345785d8a0000",
        "data": "0x1587e558",
        "nonce": "0xa65",
        "accessList": []
      },
      "additionalContracts": [],
      "isFixedGasLimit": false
    },
    {
      "hash": "0x26057fe11d6d3216eb4ad108070bc0ae1ada896aca5adec22a387a7b10efc664",
      "transactionType": "CALL",
      "contractName": null,
      "contractAddress": "0xF3f607cea8B2096882c09f3ceBDff1317c95Ad73",
      "function": null,
      "arguments": null,
      "transaction": {
        "type": "0x02",
        "from": "0x85752248d8cca2d9321f0278fc785738e1236ce4",
        "to": "0xf3f607cea8b2096882c09f3cebdff1317c95ad73",
        "gas": "0x36062",
        "value": "0x16345785d8a0000",
        "data": "0x1587e558",
        "nonce": "0xa66",
        "accessList": []
      },
      "additionalContracts": [],
      "isFixedGasLimit": false
    },
    {
      "hash": "0xead2d013969465d834d0d1cd1b225e051dff8190f6d53e10f59acdc47a7dc724",
      "transactionType": "CALL",
      "contractName": null,
      "contractAddress": "0xF3f607cea8B2096882c09f3ceBDff1317c95Ad73",
      "function": null,
      "arguments": null,
      "transaction": {
        "type": "0x02",
        "from": "0x85752248d8cca2d9321f0278fc785738e1236ce4",
        "to": "0xf3f607cea8b2096882c09f3cebdff1317c95ad73",
        "gas": "0x36062",
        "value": "0x16345785d8a0000",
        "data": "0x1587e558",
        "nonce": "0xa67",
        "accessList": []
      },
      "additionalContracts": [],
      "isFixedGasLimit": false
    },
    {
      "hash": "0x7a9669215436bad9f4628ea3cbb963fba8ab61d8d50dc992c2aac606e87a4191",
      "transactionType": "CALL",
      "contractName": null,
      "contractAddress": "0xF3f607cea8B2096882c09f3ceBDff1317c95Ad73",
      "function": null,
      "arguments": null,
      "transaction": {
        "type": "0x02",
        "from": "0x85752248d8cca2d9321f0278fc785738e1236ce4",
        "to": "0xf3f607cea8b2096882c09f3cebdff1317c95ad73",
        "gas": "0x36062",
        "value": "0x16345785d8a0000",
        "data": "0x1587e558",
        "nonce": "0xa68",
        "accessList": []
      },
      "additionalContracts": [],
      "isFixedGasLimit": false
    },
    {
      "hash": "0x2ad58c63025278bff4810b4d17f6d3d941b57f1b5a295a55c333f3ad18d93b99",
      "transactionType": "CALL",
      "contractName": null,
      "contractAddress": "0xF3f607cea8B2096882c09f3ceBDff1317c95Ad73",
      "function": null,
      "arguments": null,
      "transaction": {
        "type": "0x02",
        "from": "0x85752248d8cca2d9321f0278fc785738e1236ce4",
        "to": "0xf3f607cea8b2096882c09f3cebdff1317c95ad73",
        "gas": "0x36062",
        "value": "0x16345785d8a0000",
        "data": "0x1587e558",
        "nonce": "0xa69",
        "accessList": []
      },
      "additionalContracts": [],
      "isFixedGasLimit": false
    },
    {
      "hash": "0x4d7105f87622e8c5a819d4c81dde02a7825ff6e9a16313d0335376589792bb27",
      "transactionType": "CALL",
      "contractName": null,
      "contractAddress": "0xF3f607cea8B2096882c09f3ceBDff1317c95Ad73",
      "function": null,
      "arguments": null,
      "transaction": {
        "type": "0x02",
        "from": "0x85752248d8cca2d9321f0278fc785738e1236ce4",
        "to": "0xf3f607cea8b2096882c09f3cebdff1317c95ad73",
        "gas": "0x36062",
        "value": "0x16345785d8a0000",
        "data": "0x1587e558",
        "nonce": "0xa6a",
        "accessList": []
      },
      "additionalContracts": [],
      "isFixedGasLimit": false
    },
    {
      "hash": "0x7474fab48ad5c179786281fa44e9c5a1fc1d068aea7777673ade7664a2fe1a3e",
      "transactionType": "CALL",
      "contractName": null,
      "contractAddress": "0xF3f607cea8B2096882c09f3ceBDff1317c95Ad73",
      "function": null,
      "arguments": null,
      "transaction": {
        "type": "0x02",
        "from": "0x85752248d8cca2d9321f0278fc785738e1236ce4",
        "to": "0xf3f607cea8b2096882c09f3cebdff1317c95ad73",
        "gas": "0x2a197",
        "value": "0x0",
        "data": "0x58bd094f0000000000000000000000000000000000000000000000000000000000000000",
        "nonce": "0xa6b",
        "accessList": []
      },
      "additionalContracts": [],
      "isFixedGasLimit": false
    }
  ],
  "receipts": [
    {
      "transactionHash": "0x51e4820d0d71605a3e615096413ff5283695ea68f7f426e18438dd7428fb10c0",
      "transactionIndex": "0x0",
      "blockHash": "0xd8e84f8d508c453ee4e4c008393d722caed9c58e41750340a619246a1361ea95",
      "blockNumber": "0x918333",
      "from": "0x85752248d8ccA2d9321f0278FC785738E1236CE4",
      "to": "0xF3f607cea8B2096882c09f3ceBDff1317c95Ad73",
      "cumulativeGasUsed": "0x271cd",
      "gasUsed": "0x271cd",
      "contractAddress": null,
      "logs": [
        {
          "address": "0xF3f607cea8B2096882c09f3ceBDff1317c95Ad73",
          "topics": [
            "0xc88756dd73e6bb8b762d9037ebc78074164c9f9ae658c709b6137d2fea83f7f8"
          ],
          "data": "0x00000000000000000000000085752248d8cca2d9321f0278fc785738e1236ce4000000000000000000000000000000000000000000000000016345785d8a0000000000000000000000000000000000000000000000000000000000000000000000000000000000000000000085752248d8cca2d9321f0278fc785738e1236ce40000000000000000000000000000000000000000000000000000000000000079e510033b52dbe7ead798632d60261fde43363176c86fa079f03a91d2903b4e1f",
          "blockHash": "0xd8e84f8d508c453ee4e4c008393d722caed9c58e41750340a619246a1361ea95",
          "blockNumber": "0x918333",
          "transactionHash": "0x51e4820d0d71605a3e615096413ff5283695ea68f7f426e18438dd7428fb10c0",
          "transactionIndex": "0x0",
          "logIndex": "0x0",
          "removed": false
        }
      ],
      "status": "0x1",
      "logsBloom": "0x00000000000000000000000000000000000010000000000000000000000000000000000000000000000000010000000000000000000000800000000000000000000000000000000000000000000000000000000000000000000000000000000000000000000000000000000000000000000000000000000000200000000000000000000000000000000000000000000000000000000000000000000000000000000000000000000000000000000000000000000000000000000000000000000000000000000000000000000000000000000000000000000000000000000000000000000000000000004000000000000000000000000000000000000000100000",
      "type": "0x2",
      "effectiveGasPrice": "0xb2d05e02"
    },
    {
      "transactionHash": "0x26057fe11d6d3216eb4ad108070bc0ae1ada896aca5adec22a387a7b10efc664",
      "transactionIndex": "0x0",
      "blockHash": "0xfe81c742ced2143c7b07f333ce451ef624a8ad1fd53645717f9560fe1a7f3767",
      "blockNumber": "0x918334",
      "from": "0x85752248d8ccA2d9321f0278FC785738E1236CE4",
      "to": "0xF3f607cea8B2096882c09f3ceBDff1317c95Ad73",
      "cumulativeGasUsed": "0x271cd",
      "gasUsed": "0x271cd",
      "contractAddress": null,
      "logs": [
        {
          "address": "0xF3f607cea8B2096882c09f3ceBDff1317c95Ad73",
          "topics": [
            "0xc88756dd73e6bb8b762d9037ebc78074164c9f9ae658c709b6137d2fea83f7f8"
          ],
          "data": "0x00000000000000000000000085752248d8cca2d9321f0278fc785738e1236ce4000000000000000000000000000000000000000000000000016345785d8a0000000000000000000000000000000000000000000000000000000000000000000000000000000000000000000085752248d8cca2d9321f0278fc785738e1236ce4000000000000000000000000000000000000000000000000000000000000007af5761f0966418a6a828efca38165b2a758d9ce0cd15c92611ef52b86ab46562d",
          "blockHash": "0xfe81c742ced2143c7b07f333ce451ef624a8ad1fd53645717f9560fe1a7f3767",
          "blockNumber": "0x918334",
          "transactionHash": "0x26057fe11d6d3216eb4ad108070bc0ae1ada896aca5adec22a387a7b10efc664",
          "transactionIndex": "0x0",
          "logIndex": "0x0",
          "removed": false
        }
      ],
      "status": "0x1",
      "logsBloom": "0x00000000000000000000000000000000000010000000000000000000000000000000000000000000000000010000000000000000000000800000000000000000000000000000000000000000000000000000000000000000000000000000000000000000000000000000000000000000000000000000000000200000000000000000000000000000000000000000000000000000000000000000000000000000000000000000000000000000000000000000000000000000000000000000000000000000000000000000000000000000000000000000000000000000000000000000000000000000004000000000000000000000000000000000000000100000",
      "type": "0x2",
      "effectiveGasPrice": "0xb2d05e02"
    },
    {
      "transactionHash": "0x95b081c965fd6e1d0c60c6a5a5052f238cb1d0aef2a8318b7702042b2be305f0",
      "transactionIndex": "0x0",
      "blockHash": "0xef9d189430e6134330f49e95234cf68504d659aa92ea8401ccb3e03846a093c7",
      "blockNumber": "0x918335",
      "from": "0x85752248d8ccA2d9321f0278FC785738E1236CE4",
      "to": "0xF3f607cea8B2096882c09f3ceBDff1317c95Ad73",
      "cumulativeGasUsed": "0x271cd",
      "gasUsed": "0x271cd",
      "contractAddress": null,
      "logs": [
        {
          "address": "0xF3f607cea8B2096882c09f3ceBDff1317c95Ad73",
          "topics": [
            "0xc88756dd73e6bb8b762d9037ebc78074164c9f9ae658c709b6137d2fea83f7f8"
          ],
          "data": "0x00000000000000000000000085752248d8cca2d9321f0278fc785738e1236ce4000000000000000000000000000000000000000000000000016345785d8a0000000000000000000000000000000000000000000000000000000000000000000000000000000000000000000085752248d8cca2d9321f0278fc785738e1236ce4000000000000000000000000000000000000000000000000000000000000007b0a1152be75721faf98b5f7917039d3a8eaeb5b4b36f3774da30578ac98ad8e94",
          "blockHash": "0xef9d189430e6134330f49e95234cf68504d659aa92ea8401ccb3e03846a093c7",
          "blockNumber": "0x918335",
          "transactionHash": "0x95b081c965fd6e1d0c60c6a5a5052f238cb1d0aef2a8318b7702042b2be305f0",
          "transactionIndex": "0x0",
          "logIndex": "0x0",
          "removed": false
        }
      ],
      "status": "0x1",
      "logsBloom": "0x00000000000000000000000000000000000010000000000000000000000000000000000000000000000000010000000000000000000000800000000000000000000000000000000000000000000000000000000000000000000000000000000000000000000000000000000000000000000000000000000000200000000000000000000000000000000000000000000000000000000000000000000000000000000000000000000000000000000000000000000000000000000000000000000000000000000000000000000000000000000000000000000000000000000000000000000000000000004000000000000000000000000000000000000000100000",
      "type": "0x2",
      "effectiveGasPrice": "0xb2d05e02"
    },
    {
      "transactionHash": "0xb15040de7aacccccf4cf2577d9f31afb1e1ec7a2c9578c876384c50ca177458a",
      "transactionIndex": "0x0",
      "blockHash": "0x2402fa61ee090cbb6bd7a6d0612e2c523426fafe4322778e31858b5479bdd670",
      "blockNumber": "0x918336",
      "from": "0x85752248d8ccA2d9321f0278FC785738E1236CE4",
      "to": "0xF3f607cea8B2096882c09f3ceBDff1317c95Ad73",
      "cumulativeGasUsed": "0x271cd",
      "gasUsed": "0x271cd",
      "contractAddress": null,
      "logs": [
        {
          "address": "0xF3f607cea8B2096882c09f3ceBDff1317c95Ad73",
          "topics": [
            "0xc88756dd73e6bb8b762d9037ebc78074164c9f9ae658c709b6137d2fea83f7f8"
          ],
          "data": "0x00000000000000000000000085752248d8cca2d9321f0278fc785738e1236ce4000000000000000000000000000000000000000000000000016345785d8a0000000000000000000000000000000000000000000000000000000000000000000000000000000000000000000085752248d8cca2d9321f0278fc785738e1236ce4000000000000000000000000000000000000000000000000000000000000007ce0fc2a1795e5b64ef49c137a4411eeaff93086afecf1996ba7ef4b852f33188c",
          "blockHash": "0x2402fa61ee090cbb6bd7a6d0612e2c523426fafe4322778e31858b5479bdd670",
          "blockNumber": "0x918336",
          "transactionHash": "0xb15040de7aacccccf4cf2577d9f31afb1e1ec7a2c9578c876384c50ca177458a",
          "transactionIndex": "0x0",
          "logIndex": "0x0",
          "removed": false
        }
      ],
      "status": "0x1",
      "logsBloom": "0x00000000000000000000000000000000000010000000000000000000000000000000000000000000000000010000000000000000000000800000000000000000000000000000000000000000000000000000000000000000000000000000000000000000000000000000000000000000000000000000000000200000000000000000000000000000000000000000000000000000000000000000000000000000000000000000000000000000000000000000000000000000000000000000000000000000000000000000000000000000000000000000000000000000000000000000000000000000004000000000000000000000000000000000000000100000",
      "type": "0x2",
      "effectiveGasPrice": "0xb2d05e02"
    },
    {
      "transactionHash": "0x90fd16c22828430bb943248dca8d2193ed2e8786ab1f6e54d6f6db882df53dd7",
      "transactionIndex": "0x0",
      "blockHash": "0x7e12d7b3b3a185950648f76fee5a9efc25cc376ccb79e71981ba4c2ea5ea81c5",
      "blockNumber": "0x918337",
      "from": "0x85752248d8ccA2d9321f0278FC785738E1236CE4",
      "to": "0xF3f607cea8B2096882c09f3ceBDff1317c95Ad73",
      "cumulativeGasUsed": "0x271cd",
      "gasUsed": "0x271cd",
      "contractAddress": null,
      "logs": [
        {
          "address": "0xF3f607cea8B2096882c09f3ceBDff1317c95Ad73",
          "topics": [
            "0xc88756dd73e6bb8b762d9037ebc78074164c9f9ae658c709b6137d2fea83f7f8"
          ],
          "data": "0x00000000000000000000000085752248d8cca2d9321f0278fc785738e1236ce4000000000000000000000000000000000000000000000000016345785d8a0000000000000000000000000000000000000000000000000000000000000000000000000000000000000000000085752248d8cca2d9321f0278fc785738e1236ce4000000000000000000000000000000000000000000000000000000000000007dcf9ab9b4f03ee3e7a2842c66dd2d2869bafba2c9535588e0cfb98ec39ce155cf",
          "blockHash": "0x7e12d7b3b3a185950648f76fee5a9efc25cc376ccb79e71981ba4c2ea5ea81c5",
          "blockNumber": "0x918337",
          "transactionHash": "0x90fd16c22828430bb943248dca8d2193ed2e8786ab1f6e54d6f6db882df53dd7",
          "transactionIndex": "0x0",
          "logIndex": "0x0",
          "removed": false
        }
      ],
      "status": "0x1",
      "logsBloom": "0x00000000000000000000000000000000000010000000000000000000000000000000000000000000000000010000000000000000000000800000000000000000000000000000000000000000000000000000000000000000000000000000000000000000000000000000000000000000000000000000000000200000000000000000000000000000000000000000000000000000000000000000000000000000000000000000000000000000000000000000000000000000000000000000000000000000000000000000000000000000000000000000000000000000000000000000000000000000004000000000000000000000000000000000000000100000",
      "type": "0x2",
      "effectiveGasPrice": "0xb2d05e02"
    },
    {
      "transactionHash": "0xe102d7c59311f0439a1db76889981d0c1037a2dc1b59272fe7ea8def603b3af7",
      "transactionIndex": "0x0",
      "blockHash": "0x066119b5d84d41bc79b942ba390bfd03777b0a1d23739cf46b6079c0a9043ade",
      "blockNumber": "0x918338",
      "from": "0x85752248d8ccA2d9321f0278FC785738E1236CE4",
      "to": "0xF3f607cea8B2096882c09f3ceBDff1317c95Ad73",
      "cumulativeGasUsed": "0x271cd",
      "gasUsed": "0x271cd",
      "contractAddress": null,
      "logs": [
        {
          "address": "0xF3f607cea8B2096882c09f3ceBDff1317c95Ad73",
          "topics": [
            "0xc88756dd73e6bb8b762d9037ebc78074164c9f9ae658c709b6137d2fea83f7f8"
          ],
          "data": "0x00000000000000000000000085752248d8cca2d9321f0278fc785738e1236ce4000000000000000000000000000000000000000000000000016345785d8a0000000000000000000000000000000000000000000000000000000000000000000000000000000000000000000085752248d8cca2d9321f0278fc785738e1236ce4000000000000000000000000000000000000000000000000000000000000007e7948ff8c7bbcbf2ab4ac84276f23b2b20d2372ef453d76341d2529b9a6cd7a51",
          "blockHash": "0x066119b5d84d41bc79b942ba390bfd03777b0a1d23739cf46b6079c0a9043ade",
          "blockNumber": "0x918338",
          "transactionHash": "0xe102d7c59311f0439a1db76889981d0c1037a2dc1b59272fe7ea8def603b3af7",
          "transactionIndex": "0x0",
          "logIndex": "0x0",
          "removed": false
        }
      ],
      "status": "0x1",
      "logsBloom": "0x00000000000000000000000000000000000010000000000000000000000000000000000000000000000000010000000000000000000000800000000000000000000000000000000000000000000000000000000000000000000000000000000000000000000000000000000000000000000000000000000000200000000000000000000000000000000000000000000000000000000000000000000000000000000000000000000000000000000000000000000000000000000000000000000000000000000000000000000000000000000000000000000000000000000000000000000000000000004000000000000000000000000000000000000000100000",
      "type": "0x2",
      "effectiveGasPrice": "0xb2d05e02"
    },
    {
      "transactionHash": "0xead2d013969465d834d0d1cd1b225e051dff8190f6d53e10f59acdc47a7dc724",
      "transactionIndex": "0x0",
      "blockHash": "0x27ae876dd37733d7aa270ae1d725ff0f460439123a834ebb135c2785cd4ee189",
      "blockNumber": "0x918339",
      "from": "0x85752248d8ccA2d9321f0278FC785738E1236CE4",
      "to": "0xF3f607cea8B2096882c09f3ceBDff1317c95Ad73",
      "cumulativeGasUsed": "0x271cd",
      "gasUsed": "0x271cd",
      "contractAddress": null,
      "logs": [
        {
          "address": "0xF3f607cea8B2096882c09f3ceBDff1317c95Ad73",
          "topics": [
            "0xc88756dd73e6bb8b762d9037ebc78074164c9f9ae658c709b6137d2fea83f7f8"
          ],
          "data": "0x00000000000000000000000085752248d8cca2d9321f0278fc785738e1236ce4000000000000000000000000000000000000000000000000016345785d8a0000000000000000000000000000000000000000000000000000000000000000000000000000000000000000000085752248d8cca2d9321f0278fc785738e1236ce4000000000000000000000000000000000000000000000000000000000000007f88409c689cad7c3390d287b5db6276810ab589b9176f2b25c80e06ba30a16836",
          "blockHash": "0x27ae876dd37733d7aa270ae1d725ff0f460439123a834ebb135c2785cd4ee189",
          "blockNumber": "0x918339",
          "transactionHash": "0xead2d013969465d834d0d1cd1b225e051dff8190f6d53e10f59acdc47a7dc724",
          "transactionIndex": "0x0",
          "logIndex": "0x0",
          "removed": false
        }
      ],
      "status": "0x1",
      "logsBloom": "0x00000000000000000000000000000000000010000000000000000000000000000000000000000000000000010000000000000000000000800000000000000000000000000000000000000000000000000000000000000000000000000000000000000000000000000000000000000000000000000000000000200000000000000000000000000000000000000000000000000000000000000000000000000000000000000000000000000000000000000000000000000000000000000000000000000000000000000000000000000000000000000000000000000000000000000000000000000000004000000000000000000000000000000000000000100000",
      "type": "0x2",
      "effectiveGasPrice": "0xb2d05e02"
    },
    {
      "transactionHash": "0x4d7105f87622e8c5a819d4c81dde02a7825ff6e9a16313d0335376589792bb27",
      "transactionIndex": "0x0",
      "blockHash": "0x89c59120bfdc8fada2ac3d9bf4cdb4d3af1dc502ef561bc4e277e205a7d2b169",
      "blockNumber": "0x91833a",
      "from": "0x85752248d8ccA2d9321f0278FC785738E1236CE4",
      "to": "0xF3f607cea8B2096882c09f3ceBDff1317c95Ad73",
      "cumulativeGasUsed": "0x271cd",
      "gasUsed": "0x271cd",
      "contractAddress": null,
      "logs": [
        {
          "address": "0xF3f607cea8B2096882c09f3ceBDff1317c95Ad73",
          "topics": [
            "0xc88756dd73e6bb8b762d9037ebc78074164c9f9ae658c709b6137d2fea83f7f8"
          ],
          "data": "0x00000000000000000000000085752248d8cca2d9321f0278fc785738e1236ce4000000000000000000000000000000000000000000000000016345785d8a0000000000000000000000000000000000000000000000000000000000000000000000000000000000000000000085752248d8cca2d9321f0278fc785738e1236ce4000000000000000000000000000000000000000000000000000000000000008074226e5381776e575f54c3de2e8c9e16960027db4b2ae3032b021fabcd43a8bd",
          "blockHash": "0x89c59120bfdc8fada2ac3d9bf4cdb4d3af1dc502ef561bc4e277e205a7d2b169",
          "blockNumber": "0x91833a",
          "transactionHash": "0x4d7105f87622e8c5a819d4c81dde02a7825ff6e9a16313d0335376589792bb27",
          "transactionIndex": "0x0",
          "logIndex": "0x0",
          "removed": false
        }
      ],
      "status": "0x1",
      "logsBloom": "0x00000000000000000000000000000000000010000000000000000000000000000000000000000000000000010000000000000000000000800000000000000000000000000000000000000000000000000000000000000000000000000000000000000000000000000000000000000000000000000000000000200000000000000000000000000000000000000000000000000000000000000000000000000000000000000000000000000000000000000000000000000000000000000000000000000000000000000000000000000000000000000000000000000000000000000000000000000000004000000000000000000000000000000000000000100000",
      "type": "0x2",
      "effectiveGasPrice": "0xb2d05e02"
    },
    {
      "transactionHash": "0x7a9669215436bad9f4628ea3cbb963fba8ab61d8d50dc992c2aac606e87a4191",
      "transactionIndex": "0x0",
      "blockHash": "0xd56146ab39cb76922a0fbe7adb55b96578ba59dad78356302dabc0140a362351",
      "blockNumber": "0x91833b",
      "from": "0x85752248d8ccA2d9321f0278FC785738E1236CE4",
      "to": "0xF3f607cea8B2096882c09f3ceBDff1317c95Ad73",
      "cumulativeGasUsed": "0x271cd",
      "gasUsed": "0x271cd",
      "contractAddress": null,
      "logs": [
        {
          "address": "0xF3f607cea8B2096882c09f3ceBDff1317c95Ad73",
          "topics": [
            "0xc88756dd73e6bb8b762d9037ebc78074164c9f9ae658c709b6137d2fea83f7f8"
          ],
          "data": "0x00000000000000000000000085752248d8cca2d9321f0278fc785738e1236ce4000000000000000000000000000000000000000000000000016345785d8a0000000000000000000000000000000000000000000000000000000000000000000000000000000000000000000085752248d8cca2d9321f0278fc785738e1236ce40000000000000000000000000000000000000000000000000000000000000081c7b48ac833d3c3b327ecae1feb103fb3b02ffcc4f17f8f22cf2551462d3a4c8b",
          "blockHash": "0xd56146ab39cb76922a0fbe7adb55b96578ba59dad78356302dabc0140a362351",
          "blockNumber": "0x91833b",
          "transactionHash": "0x7a9669215436bad9f4628ea3cbb963fba8ab61d8d50dc992c2aac606e87a4191",
          "transactionIndex": "0x0",
          "logIndex": "0x0",
          "removed": false
        }
      ],
      "status": "0x1",
      "logsBloom": "0x00000000000000000000000000000000000010000000000000000000000000000000000000000000000000010000000000000000000000800000000000000000000000000000000000000000000000000000000000000000000000000000000000000000000000000000000000000000000000000000000000200000000000000000000000000000000000000000000000000000000000000000000000000000000000000000000000000000000000000000000000000000000000000000000000000000000000000000000000000000000000000000000000000000000000000000000000000000004000000000000000000000000000000000000000100000",
      "type": "0x2",
      "effectiveGasPrice": "0xb2d05e02"
    },
    {
      "transactionHash": "0x2ad58c63025278bff4810b4d17f6d3d941b57f1b5a295a55c333f3ad18d93b99",
      "transactionIndex": "0x0",
      "blockHash": "0x8ccb6b44427978f7aa8983d38c827ea830858c39420a1694ebf2393e410c1fc7",
      "blockNumber": "0x91833c",
      "from": "0x85752248d8ccA2d9321f0278FC785738E1236CE4",
      "to": "0xF3f607cea8B2096882c09f3ceBDff1317c95Ad73",
      "cumulativeGasUsed": "0x271cd",
      "gasUsed": "0x271cd",
      "contractAddress": null,
      "logs": [
        {
          "address": "0xF3f607cea8B2096882c09f3ceBDff1317c95Ad73",
          "topics": [
            "0xc88756dd73e6bb8b762d9037ebc78074164c9f9ae658c709b6137d2fea83f7f8"
          ],
          "data": "0x00000000000000000000000085752248d8cca2d9321f0278fc785738e1236ce4000000000000000000000000000000000000000000000000016345785d8a0000000000000000000000000000000000000000000000000000000000000000000000000000000000000000000085752248d8cca2d9321f0278fc785738e1236ce40000000000000000000000000000000000000000000000000000000000000082de589e36917c5060e95967671b11cd0e9c8b0af56aa218802d011926afaa92cc",
          "blockHash": "0x8ccb6b44427978f7aa8983d38c827ea830858c39420a1694ebf2393e410c1fc7",
          "blockNumber": "0x91833c",
          "transactionHash": "0x2ad58c63025278bff4810b4d17f6d3d941b57f1b5a295a55c333f3ad18d93b99",
          "transactionIndex": "0x0",
          "logIndex": "0x0",
          "removed": false
        }
      ],
      "status": "0x1",
      "logsBloom": "0x00000000000000000000000000000000000010000000000000000000000000000000000000000000000000010000000000000000000000800000000000000000000000000000000000000000000000000000000000000000000000000000000000000000000000000000000000000000000000000000000000200000000000000000000000000000000000000000000000000000000000000000000000000000000000000000000000000000000000000000000000000000000000000000000000000000000000000000000000000000000000000000000000000000000000000000000000000000004000000000000000000000000000000000000000100000",
      "type": "0x2",
      "effectiveGasPrice": "0xb2d05e02"
    },
    {
      "transactionHash": "0x7474fab48ad5c179786281fa44e9c5a1fc1d068aea7777673ade7664a2fe1a3e",
      "transactionIndex": "0x0",
      "blockHash": "0xbab0fd308cdeceaf2dcf0a68bc52f06a0747094245ca89f44df4af7b2b5ba727",
      "blockNumber": "0x91833d",
      "from": "0x85752248d8ccA2d9321f0278FC785738E1236CE4",
      "to": "0xF3f607cea8B2096882c09f3ceBDff1317c95Ad73",
      "cumulativeGasUsed": "0x1e7ac",
      "gasUsed": "0x1e7ac",
      "contractAddress": null,
      "logs": [
        {
          "address": "0xF3f607cea8B2096882c09f3ceBDff1317c95Ad73",
          "topics": [
            "0x6667b10209a19e78c037ae773e4b5fc3128718495569a6b1fd04f3b3fe6de897"
          ],
          "data": "0x00000000000000000000000085752248d8cca2d9321f0278fc785738e1236ce400000000000000000000000000000000000000000000000000000000000000000000000000000000000000000000000000000000000000000000000000000083",
          "blockHash": "0xbab0fd308cdeceaf2dcf0a68bc52f06a0747094245ca89f44df4af7b2b5ba727",
          "blockNumber": "0x91833d",
          "transactionHash": "0x7474fab48ad5c179786281fa44e9c5a1fc1d068aea7777673ade7664a2fe1a3e",
          "transactionIndex": "0x0",
          "logIndex": "0x0",
          "removed": false
        }
      ],
      "status": "0x1",
      "logsBloom": "0x00000000000000000000000000000000000010000000000000000000000000000000000000000000200000010000000000000000000000000000000000000000000000000000000000000000000000000000000000000000000000000000000004000000000000000000000000000000000000000000000000000000000000000000000000000000000000000000000000000000000000000000000000000000000000000080000000000000000000000000000000000000000000000000000000000000000000000000000000000000000000000000000000000000000000000000000000000000000000000000000000000000000000000000000000100000",
      "type": "0x2",
      "effectiveGasPrice": "0xb2d05e02"
    }
  ],
  "libraries": [],
  "pending": [],
  "returns": {},
  "timestamp": 1692653273,
  "chain": 5,
  "multi": false,
  "commit": "c856ad3"
}