{
  "transactions": [
    {
      "hash": null,
      "transactionType": "CALL",
      "contractName": null,
      "contractAddress": "0x6a3b8E6cD17DE36DE5Ef97b14DA7219708fB2030",
      "function": null,
      "arguments": null,
      "transaction": {
        "type": "0x02",
        "from": "0x85752248d8cca2d9321f0278fc785738e1236ce4",
        "to": "0x6a3b8e6cd17de36de5ef97b14da7219708fb2030",
        "gas": "0x3e4ed",
        "value": "0x6f05b59d3b20000",
        "data": "0x1587e558",
        "nonce": "0x1ae",
        "accessList": []
      },
      "additionalContracts": [],
      "isFixedGasLimit": false
    }
  ],
  "receipts": [],
  "libraries": [],
  "pending": [],
  "returns": {},
  "timestamp": 1693101224,
  "chain": 80001,
  "multi": false,
  "commit": "47a96f1"
}