{
  "transactions": [
    {
      "hash": null,
      "transactionType": "CALL",
      "contractName": null,
      "contractAddress": "0x6E60550B34a8F0Ea62713a94ce15dd5575994952",
      "function": null,
      "arguments": null,
      "transaction": {
        "type": "0x02",
        "from": "0xc789bbc077ddaa59b9dac1fae6fddda20cc664d7",
        "to": "0x6e60550b34a8f0ea62713a94ce15dd5575994952",
        "gas": "0x10872",
        "value": "0x0",
        "data": "0x75829def000000000000000000000000a1a389eec7fea1d94b8b58b102c6bdf7d2056676",
        "nonce": "0xb",
        "accessList": []
      },
      "additionalContracts": [],
      "isFixedGasLimit": false
    }
  ],
  "receipts": [],
  "libraries": [],
  "pending": [],
  "returns": {},
  "timestamp": 1693880271,
  "chain": 137,
  "multi": false,
  "commit": "bc787bd"
}