{
  "transactions": [
    {
      "hash": "0x6957fe8139e85930d2e817d93817b0d9dd83c6f3d588c131c1c3c531eddae902",
      "transactionType": "CALL",
      "contractName": null,
      "contractAddress": "0xF3f607cea8B2096882c09f3ceBDff1317c95Ad73",
      "function": null,
      "arguments": null,
      "transaction": {
        "type": "0x02",
        "from": "0x85752248d8cca2d9321f0278fc785738e1236ce4",
        "to": "0xf3f607cea8b2096882c09f3cebdff1317c95ad73",
        "gas": "0x36062",
        "value": "0x16345785d8a0000",
        "data": "0x1587e558",
        "nonce": "0xa6d",
        "accessList": []
      },
      "additionalContracts": [],
      "isFixedGasLimit": false
    },
    {
      "hash": "0x03166dbb0f7878264d2f859dbfd0d7e8ad68a107d536de2585f67a9b442cfcea",
      "transactionType": "CALL",
      "contractName": null,
      "contractAddress": "0xF3f607cea8B2096882c09f3ceBDff1317c95Ad73",
      "function": null,
      "arguments": null,
      "transaction": {
        "type": "0x02",
        "from": "0x85752248d8cca2d9321f0278fc785738e1236ce4",
        "to": "0xf3f607cea8b2096882c09f3cebdff1317c95ad73",
        "gas": "0x36062",
        "value": "0x16345785d8a0000",
        "data": "0x1587e558",
        "nonce": "0xa6e",
        "accessList": []
      },
      "additionalContracts": [],
      "isFixedGasLimit": false
    },
    {
      "hash": "0x1b407454a454e4791c2bd4ba9acf65c6ccd70633e652252c706070e663acf440",
      "transactionType": "CALL",
      "contractName": null,
      "contractAddress": "0xF3f607cea8B2096882c09f3ceBDff1317c95Ad73",
      "function": null,
      "arguments": null,
      "transaction": {
        "type": "0x02",
        "from": "0x85752248d8cca2d9321f0278fc785738e1236ce4",
        "to": "0xf3f607cea8b2096882c09f3cebdff1317c95ad73",
        "gas": "0x36062",
        "value": "0x16345785d8a0000",
        "data": "0x1587e558",
        "nonce": "0xa6f",
        "accessList": []
      },
      "additionalContracts": [],
      "isFixedGasLimit": false
    },
    {
      "hash": "0x6f232ec10909f09b7e1786a3eefcf19e17e4880fe44a8fc5d07ec0db8f238a5e",
      "transactionType": "CALL",
      "contractName": null,
      "contractAddress": "0xF3f607cea8B2096882c09f3ceBDff1317c95Ad73",
      "function": null,
      "arguments": null,
      "transaction": {
        "type": "0x02",
        "from": "0x85752248d8cca2d9321f0278fc785738e1236ce4",
        "to": "0xf3f607cea8b2096882c09f3cebdff1317c95ad73",
        "gas": "0x36062",
        "value": "0x16345785d8a0000",
        "data": "0x1587e558",
        "nonce": "0xa70",
        "accessList": []
      },
      "additionalContracts": [],
      "isFixedGasLimit": false
    },
    {
      "hash": "0x763e1bb71dccf58ee11eb378d735a04e4069fed494999e7602ce5d569862b79d",
      "transactionType": "CALL",
      "contractName": null,
      "contractAddress": "0xF3f607cea8B2096882c09f3ceBDff1317c95Ad73",
      "function": null,
      "arguments": null,
      "transaction": {
        "type": "0x02",
        "from": "0x85752248d8cca2d9321f0278fc785738e1236ce4",
        "to": "0xf3f607cea8b2096882c09f3cebdff1317c95ad73",
        "gas": "0x36062",
        "value": "0x16345785d8a0000",
        "data": "0x1587e558",
        "nonce": "0xa71",
        "accessList": []
      },
      "additionalContracts": [],
      "isFixedGasLimit": false
    },
    {
      "hash": "0x20757f8a5cbc2a9476304b00c82bf6a4111a8cf0d4f20333a25ef1c093ce3b21",
      "transactionType": "CALL",
      "contractName": null,
      "contractAddress": "0xF3f607cea8B2096882c09f3ceBDff1317c95Ad73",
      "function": null,
      "arguments": null,
      "transaction": {
        "type": "0x02",
        "from": "0x85752248d8cca2d9321f0278fc785738e1236ce4",
        "to": "0xf3f607cea8b2096882c09f3cebdff1317c95ad73",
        "gas": "0x36062",
        "value": "0x16345785d8a0000",
        "data": "0x1587e558",
        "nonce": "0xa72",
        "accessList": []
      },
      "additionalContracts": [],
      "isFixedGasLimit": false
    },
    {
      "hash": "0xa2295f4c6ad010a9a181fc85e354b1dcd0d7a8f4d68b68eb0aab9016dd263387",
      "transactionType": "CALL",
      "contractName": null,
      "contractAddress": "0xF3f607cea8B2096882c09f3ceBDff1317c95Ad73",
      "function": null,
      "arguments": null,
      "transaction": {
        "type": "0x02",
        "from": "0x85752248d8cca2d9321f0278fc785738e1236ce4",
        "to": "0xf3f607cea8b2096882c09f3cebdff1317c95ad73",
        "gas": "0x36062",
        "value": "0x16345785d8a0000",
        "data": "0x1587e558",
        "nonce": "0xa73",
        "accessList": []
      },
      "additionalContracts": [],
      "isFixedGasLimit": false
    },
    {
      "hash": "0x803a0d17581a2378147ebabf8d075139ed891c2e17ae4411f2634c4dc5449555",
      "transactionType": "CALL",
      "contractName": null,
      "contractAddress": "0xF3f607cea8B2096882c09f3ceBDff1317c95Ad73",
      "function": null,
      "arguments": null,
      "transaction": {
        "type": "0x02",
        "from": "0x85752248d8cca2d9321f0278fc785738e1236ce4",
        "to": "0xf3f607cea8b2096882c09f3cebdff1317c95ad73",
        "gas": "0x36062",
        "value": "0x16345785d8a0000",
        "data": "0x1587e558",
        "nonce": "0xa74",
        "accessList": []
      },
      "additionalContracts": [],
      "isFixedGasLimit": false
    },
    {
      "hash": "0x0912ae73bf102898f90381cc364a8156612fe48770d4ccd1a58ef074d14ba3cb",
      "transactionType": "CALL",
      "contractName": null,
      "contractAddress": "0xF3f607cea8B2096882c09f3ceBDff1317c95Ad73",
      "function": null,
      "arguments": null,
      "transaction": {
        "type": "0x02",
        "from": "0x85752248d8cca2d9321f0278fc785738e1236ce4",
        "to": "0xf3f607cea8b2096882c09f3cebdff1317c95ad73",
        "gas": "0x36062",
        "value": "0x16345785d8a0000",
        "data": "0x1587e558",
        "nonce": "0xa75",
        "accessList": []
      },
      "additionalContracts": [],
      "isFixedGasLimit": false
    },
    {
      "hash": "0x2629f0046d3663b81523ee37f76021165be32959351d0699f686d70b483acdb4",
      "transactionType": "CALL",
      "contractName": null,
      "contractAddress": "0xF3f607cea8B2096882c09f3ceBDff1317c95Ad73",
      "function": null,
      "arguments": null,
      "transaction": {
        "type": "0x02",
        "from": "0x85752248d8cca2d9321f0278fc785738e1236ce4",
        "to": "0xf3f607cea8b2096882c09f3cebdff1317c95ad73",
        "gas": "0x36062",
        "value": "0x16345785d8a0000",
        "data": "0x1587e558",
        "nonce": "0xa76",
        "accessList": []
      },
      "additionalContracts": [],
      "isFixedGasLimit": false
    },
    {
      "hash": "0x7f3e2b3c28c67f63515edc74aed86fae53364e89486b63006960a4ae28940c0c",
      "transactionType": "CALL",
      "contractName": null,
      "contractAddress": "0xF3f607cea8B2096882c09f3ceBDff1317c95Ad73",
      "function": null,
      "arguments": null,
      "transaction": {
        "type": "0x02",
        "from": "0x85752248d8cca2d9321f0278fc785738e1236ce4",
        "to": "0xf3f607cea8b2096882c09f3cebdff1317c95ad73",
        "gas": "0x2a197",
        "value": "0x0",
        "data": "0x58bd094f0000000000000000000000000000000000000000000000000000000000000000",
        "nonce": "0xa77",
        "accessList": []
      },
      "additionalContracts": [],
      "isFixedGasLimit": false
    }
  ],
  "receipts": [
    {
      "transactionHash": "0x6957fe8139e85930d2e817d93817b0d9dd83c6f3d588c131c1c3c531eddae902",
      "transactionIndex": "0x0",
      "blockHash": "0xc7120f5f8f2450f57776fb2c38a7db15f76fffa7713049e60ef33d33befce16b",
      "blockNumber": "0x91833f",
      "from": "0x85752248d8ccA2d9321f0278FC785738E1236CE4",
      "to": "0xF3f607cea8B2096882c09f3ceBDff1317c95Ad73",
      "cumulativeGasUsed": "0x271cd",
      "gasUsed": "0x271cd",
      "contractAddress": null,
      "logs": [
        {
          "address": "0xF3f607cea8B2096882c09f3ceBDff1317c95Ad73",
          "topics": [
            "0xc88756dd73e6bb8b762d9037ebc78074164c9f9ae658c709b6137d2fea83f7f8"
          ],
          "data": "0x00000000000000000000000085752248d8cca2d9321f0278fc785738e1236ce4000000000000000000000000000000000000000000000000016345785d8a0000000000000000000000000000000000000000000000000000000000000000000000000000000000000000000085752248d8cca2d9321f0278fc785738e1236ce40000000000000000000000000000000000000000000000000000000000000084f4dc7db97f3d440c6f18ea38315fddbd1957f1c3d3b43b207cc5a11f9235d116",
          "blockHash": "0xc7120f5f8f2450f57776fb2c38a7db15f76fffa7713049e60ef33d33befce16b",
          "blockNumber": "0x91833f",
          "transactionHash": "0x6957fe8139e85930d2e817d93817b0d9dd83c6f3d588c131c1c3c531eddae902",
          "transactionIndex": "0x0",
          "logIndex": "0x0",
          "removed": false
        }
      ],
      "status": "0x1",
      "logsBloom": "0x00000000000000000000000000000000000010000000000000000000000000000000000000000000000000010000000000000000000000800000000000000000000000000000000000000000000000000000000000000000000000000000000000000000000000000000000000000000000000000000000000200000000000000000000000000000000000000000000000000000000000000000000000000000000000000000000000000000000000000000000000000000000000000000000000000000000000000000000000000000000000000000000000000000000000000000000000000000004000000000000000000000000000000000000000100000",
      "type": "0x2",
      "effectiveGasPrice": "0xb2d05e02"
    },
    {
      "transactionHash": "0xa2295f4c6ad010a9a181fc85e354b1dcd0d7a8f4d68b68eb0aab9016dd263387",
      "transactionIndex": "0x0",
      "blockHash": "0xa6ee0255ef96769704aa1dbae31d64e5d5277d82766552b59027c70a6cafe060",
      "blockNumber": "0x918340",
      "from": "0x85752248d8ccA2d9321f0278FC785738E1236CE4",
      "to": "0xF3f607cea8B2096882c09f3ceBDff1317c95Ad73",
      "cumulativeGasUsed": "0x271cd",
      "gasUsed": "0x271cd",
      "contractAddress": null,
      "logs": [
        {
          "address": "0xF3f607cea8B2096882c09f3ceBDff1317c95Ad73",
          "topics": [
            "0xc88756dd73e6bb8b762d9037ebc78074164c9f9ae658c709b6137d2fea83f7f8"
          ],
          "data": "0x00000000000000000000000085752248d8cca2d9321f0278fc785738e1236ce4000000000000000000000000000000000000000000000000016345785d8a0000000000000000000000000000000000000000000000000000000000000000000000000000000000000000000085752248d8cca2d9321f0278fc785738e1236ce40000000000000000000000000000000000000000000000000000000000000085cb18fa33db42cc18643b10251a9e5655bae1330a57962facbf31b616be289d11",
          "blockHash": "0xa6ee0255ef96769704aa1dbae31d64e5d5277d82766552b59027c70a6cafe060",
          "blockNumber": "0x918340",
          "transactionHash": "0xa2295f4c6ad010a9a181fc85e354b1dcd0d7a8f4d68b68eb0aab9016dd263387",
          "transactionIndex": "0x0",
          "logIndex": "0x0",
          "removed": false
        }
      ],
      "status": "0x1",
      "logsBloom": "0x00000000000000000000000000000000000010000000000000000000000000000000000000000000000000010000000000000000000000800000000000000000000000000000000000000000000000000000000000000000000000000000000000000000000000000000000000000000000000000000000000200000000000000000000000000000000000000000000000000000000000000000000000000000000000000000000000000000000000000000000000000000000000000000000000000000000000000000000000000000000000000000000000000000000000000000000000000000004000000000000000000000000000000000000000100000",
      "type": "0x2",
      "effectiveGasPrice": "0xb2d05e02"
    },
    {
      "transactionHash": "0x803a0d17581a2378147ebabf8d075139ed891c2e17ae4411f2634c4dc5449555",
      "transactionIndex": "0x0",
      "blockHash": "0xdd67dd6ed07aae0093d3c3f4643f354a7de988517cdc6406f4934b44a77a9cbf",
      "blockNumber": "0x918341",
      "from": "0x85752248d8ccA2d9321f0278FC785738E1236CE4",
      "to": "0xF3f607cea8B2096882c09f3ceBDff1317c95Ad73",
      "cumulativeGasUsed": "0x271cd",
      "gasUsed": "0x271cd",
      "contractAddress": null,
      "logs": [
        {
          "address": "0xF3f607cea8B2096882c09f3ceBDff1317c95Ad73",
          "topics": [
            "0xc88756dd73e6bb8b762d9037ebc78074164c9f9ae658c709b6137d2fea83f7f8"
          ],
          "data": "0x00000000000000000000000085752248d8cca2d9321f0278fc785738e1236ce4000000000000000000000000000000000000000000000000016345785d8a0000000000000000000000000000000000000000000000000000000000000000000000000000000000000000000085752248d8cca2d9321f0278fc785738e1236ce40000000000000000000000000000000000000000000000000000000000000086e9ee5e1a7c9075fa2477cfdf46d5a0d5b613ce603ff6c798db326364a443e235",
          "blockHash": "0xdd67dd6ed07aae0093d3c3f4643f354a7de988517cdc6406f4934b44a77a9cbf",
          "blockNumber": "0x918341",
          "transactionHash": "0x803a0d17581a2378147ebabf8d075139ed891c2e17ae4411f2634c4dc5449555",
          "transactionIndex": "0x0",
          "logIndex": "0x0",
          "removed": false
        }
      ],
      "status": "0x1",
      "logsBloom": "0x00000000000000000000000000000000000010000000000000000000000000000000000000000000000000010000000000000000000000800000000000000000000000000000000000000000000000000000000000000000000000000000000000000000000000000000000000000000000000000000000000200000000000000000000000000000000000000000000000000000000000000000000000000000000000000000000000000000000000000000000000000000000000000000000000000000000000000000000000000000000000000000000000000000000000000000000000000000004000000000000000000000000000000000000000100000",
      "type": "0x2",
      "effectiveGasPrice": "0xb2d05e02"
    },
    {
      "transactionHash": "0x20757f8a5cbc2a9476304b00c82bf6a4111a8cf0d4f20333a25ef1c093ce3b21",
      "transactionIndex": "0x0",
      "blockHash": "0xcad34b8075ef681104a516ba021ba801524c7938ab5ab20ce50821a3c055901f",
      "blockNumber": "0x918342",
      "from": "0x85752248d8ccA2d9321f0278FC785738E1236CE4",
      "to": "0xF3f607cea8B2096882c09f3ceBDff1317c95Ad73",
      "cumulativeGasUsed": "0x271cd",
      "gasUsed": "0x271cd",
      "contractAddress": null,
      "logs": [
        {
          "address": "0xF3f607cea8B2096882c09f3ceBDff1317c95Ad73",
          "topics": [
            "0xc88756dd73e6bb8b762d9037ebc78074164c9f9ae658c709b6137d2fea83f7f8"
          ],
          "data": "0x00000000000000000000000085752248d8cca2d9321f0278fc785738e1236ce4000000000000000000000000000000000000000000000000016345785d8a0000000000000000000000000000000000000000000000000000000000000000000000000000000000000000000085752248d8cca2d9321f0278fc785738e1236ce40000000000000000000000000000000000000000000000000000000000000087b66be44b4a16f13b8383b7643012449ebd639c0904b21de8f5e55778b3f527a2",
          "blockHash": "0xcad34b8075ef681104a516ba021ba801524c7938ab5ab20ce50821a3c055901f",
          "blockNumber": "0x918342",
          "transactionHash": "0x20757f8a5cbc2a9476304b00c82bf6a4111a8cf0d4f20333a25ef1c093ce3b21",
          "transactionIndex": "0x0",
          "logIndex": "0x0",
          "removed": false
        }
      ],
      "status": "0x1",
      "logsBloom": "0x00000000000000000000000000000000000010000000000000000000000000000000000000000000000000010000000000000000000000800000000000000000000000000000000000000000000000000000000000000000000000000000000000000000000000000000000000000000000000000000000000200000000000000000000000000000000000000000000000000000000000000000000000000000000000000000000000000000000000000000000000000000000000000000000000000000000000000000000000000000000000000000000000000000000000000000000000000000004000000000000000000000000000000000000000100000",
      "type": "0x2",
      "effectiveGasPrice": "0xb2d05e02"
    },
    {
      "transactionHash": "0x03166dbb0f7878264d2f859dbfd0d7e8ad68a107d536de2585f67a9b442cfcea",
      "transactionIndex": "0x0",
      "blockHash": "0x961930545dcf5765aae53b8e30b487d59e514b73623cd76448a865a3ec3570cb",
      "blockNumber": "0x918343",
      "from": "0x85752248d8ccA2d9321f0278FC785738E1236CE4",
      "to": "0xF3f607cea8B2096882c09f3ceBDff1317c95Ad73",
      "cumulativeGasUsed": "0x271cd",
      "gasUsed": "0x271cd",
      "contractAddress": null,
      "logs": [
        {
          "address": "0xF3f607cea8B2096882c09f3ceBDff1317c95Ad73",
          "topics": [
            "0xc88756dd73e6bb8b762d9037ebc78074164c9f9ae658c709b6137d2fea83f7f8"
          ],
          "data": "0x00000000000000000000000085752248d8cca2d9321f0278fc785738e1236ce4000000000000000000000000000000000000000000000000016345785d8a0000000000000000000000000000000000000000000000000000000000000000000000000000000000000000000085752248d8cca2d9321f0278fc785738e1236ce40000000000000000000000000000000000000000000000000000000000000088e03b3efc2d61979a5190ff4b4ad99eb095b8a89762de49bbf935dd2fc105d1e3",
          "blockHash": "0x961930545dcf5765aae53b8e30b487d59e514b73623cd76448a865a3ec3570cb",
          "blockNumber": "0x918343",
          "transactionHash": "0x03166dbb0f7878264d2f859dbfd0d7e8ad68a107d536de2585f67a9b442cfcea",
          "transactionIndex": "0x0",
          "logIndex": "0x0",
          "removed": false
        }
      ],
      "status": "0x1",
      "logsBloom": "0x00000000000000000000000000000000000010000000000000000000000000000000000000000000000000010000000000000000000000800000000000000000000000000000000000000000000000000000000000000000000000000000000000000000000000000000000000000000000000000000000000200000000000000000000000000000000000000000000000000000000000000000000000000000000000000000000000000000000000000000000000000000000000000000000000000000000000000000000000000000000000000000000000000000000000000000000000000000004000000000000000000000000000000000000000100000",
      "type": "0x2",
      "effectiveGasPrice": "0xb2d05e02"
    },
    {
      "transactionHash": "0x6f232ec10909f09b7e1786a3eefcf19e17e4880fe44a8fc5d07ec0db8f238a5e",
      "transactionIndex": "0x0",
      "blockHash": "0xb1eb5a27631e59e35bd6093a9b49ac53aad61dfed030e9afca6f229f4704d4a9",
      "blockNumber": "0x918344",
      "from": "0x85752248d8ccA2d9321f0278FC785738E1236CE4",
      "to": "0xF3f607cea8B2096882c09f3ceBDff1317c95Ad73",
      "cumulativeGasUsed": "0x271cd",
      "gasUsed": "0x271cd",
      "contractAddress": null,
      "logs": [
        {
          "address": "0xF3f607cea8B2096882c09f3ceBDff1317c95Ad73",
          "topics": [
            "0xc88756dd73e6bb8b762d9037ebc78074164c9f9ae658c709b6137d2fea83f7f8"
          ],
          "data": "0x00000000000000000000000085752248d8cca2d9321f0278fc785738e1236ce4000000000000000000000000000000000000000000000000016345785d8a0000000000000000000000000000000000000000000000000000000000000000000000000000000000000000000085752248d8cca2d9321f0278fc785738e1236ce40000000000000000000000000000000000000000000000000000000000000089138f958244e32615ccc3c4f15aaf60d30cc23852193815ef5b6edf87d0249b6e",
          "blockHash": "0xb1eb5a27631e59e35bd6093a9b49ac53aad61dfed030e9afca6f229f4704d4a9",
          "blockNumber": "0x918344",
          "transactionHash": "0x6f232ec10909f09b7e1786a3eefcf19e17e4880fe44a8fc5d07ec0db8f238a5e",
          "transactionIndex": "0x0",
          "logIndex": "0x0",
          "removed": false
        }
      ],
      "status": "0x1",
      "logsBloom": "0x00000000000000000000000000000000000010000000000000000000000000000000000000000000000000010000000000000000000000800000000000000000000000000000000000000000000000000000000000000000000000000000000000000000000000000000000000000000000000000000000000200000000000000000000000000000000000000000000000000000000000000000000000000000000000000000000000000000000000000000000000000000000000000000000000000000000000000000000000000000000000000000000000000000000000000000000000000000004000000000000000000000000000000000000000100000",
      "type": "0x2",
      "effectiveGasPrice": "0xb2d05e02"
    },
    {
      "transactionHash": "0x0912ae73bf102898f90381cc364a8156612fe48770d4ccd1a58ef074d14ba3cb",
      "transactionIndex": "0x0",
      "blockHash": "0x2a604a7ba227e2ef1069aacc2730852d34e9923ea47dfdbd8475480d370a3a2b",
      "blockNumber": "0x918345",
      "from": "0x85752248d8ccA2d9321f0278FC785738E1236CE4",
      "to": "0xF3f607cea8B2096882c09f3ceBDff1317c95Ad73",
      "cumulativeGasUsed": "0x271cd",
      "gasUsed": "0x271cd",
      "contractAddress": null,
      "logs": [
        {
          "address": "0xF3f607cea8B2096882c09f3ceBDff1317c95Ad73",
          "topics": [
            "0xc88756dd73e6bb8b762d9037ebc78074164c9f9ae658c709b6137d2fea83f7f8"
          ],
          "data": "0x00000000000000000000000085752248d8cca2d9321f0278fc785738e1236ce4000000000000000000000000000000000000000000000000016345785d8a0000000000000000000000000000000000000000000000000000000000000000000000000000000000000000000085752248d8cca2d9321f0278fc785738e1236ce4000000000000000000000000000000000000000000000000000000000000008a091907b6d49b16bc91f4d89c87a5c72cc47e5d30f037d1cee2fcbdf1ef60f1e1",
          "blockHash": "0x2a604a7ba227e2ef1069aacc2730852d34e9923ea47dfdbd8475480d370a3a2b",
          "blockNumber": "0x918345",
          "transactionHash": "0x0912ae73bf102898f90381cc364a8156612fe48770d4ccd1a58ef074d14ba3cb",
          "transactionIndex": "0x0",
          "logIndex": "0x0",
          "removed": false
        }
      ],
      "status": "0x1",
      "logsBloom": "0x00000000000000000000000000000000000010000000000000000000000000000000000000000000000000010000000000000000000000800000000000000000000000000000000000000000000000000000000000000000000000000000000000000000000000000000000000000000000000000000000000200000000000000000000000000000000000000000000000000000000000000000000000000000000000000000000000000000000000000000000000000000000000000000000000000000000000000000000000000000000000000000000000000000000000000000000000000000004000000000000000000000000000000000000000100000",
      "type": "0x2",
      "effectiveGasPrice": "0xb2d05e02"
    },
    {
      "transactionHash": "0x763e1bb71dccf58ee11eb378d735a04e4069fed494999e7602ce5d569862b79d",
      "transactionIndex": "0x0",
      "blockHash": "0x677e001ede070f3a57e016a310ccd6d9dcdca9d50e6a2acdead1048e0cb577d6",
      "blockNumber": "0x918346",
      "from": "0x85752248d8ccA2d9321f0278FC785738E1236CE4",
      "to": "0xF3f607cea8B2096882c09f3ceBDff1317c95Ad73",
      "cumulativeGasUsed": "0x271cd",
      "gasUsed": "0x271cd",
      "contractAddress": null,
      "logs": [
        {
          "address": "0xF3f607cea8B2096882c09f3ceBDff1317c95Ad73",
          "topics": [
            "0xc88756dd73e6bb8b762d9037ebc78074164c9f9ae658c709b6137d2fea83f7f8"
          ],
          "data": "0x00000000000000000000000085752248d8cca2d9321f0278fc785738e1236ce4000000000000000000000000000000000000000000000000016345785d8a0000000000000000000000000000000000000000000000000000000000000000000000000000000000000000000085752248d8cca2d9321f0278fc785738e1236ce4000000000000000000000000000000000000000000000000000000000000008bc253a8fb2d82d3098810ac08a2180f2ff4da588ee1fed6dd59e46ec8ec0ea832",
          "blockHash": "0x677e001ede070f3a57e016a310ccd6d9dcdca9d50e6a2acdead1048e0cb577d6",
          "blockNumber": "0x918346",
          "transactionHash": "0x763e1bb71dccf58ee11eb378d735a04e4069fed494999e7602ce5d569862b79d",
          "transactionIndex": "0x0",
          "logIndex": "0x0",
          "removed": false
        }
      ],
      "status": "0x1",
      "logsBloom": "0x00000000000000000000000000000000000010000000000000000000000000000000000000000000000000010000000000000000000000800000000000000000000000000000000000000000000000000000000000000000000000000000000000000000000000000000000000000000000000000000000000200000000000000000000000000000000000000000000000000000000000000000000000000000000000000000000000000000000000000000000000000000000000000000000000000000000000000000000000000000000000000000000000000000000000000000000000000000004000000000000000000000000000000000000000100000",
      "type": "0x2",
      "effectiveGasPrice": "0xb2d05e02"
    },
    {
      "transactionHash": "0x1b407454a454e4791c2bd4ba9acf65c6ccd70633e652252c706070e663acf440",
      "transactionIndex": "0x0",
      "blockHash": "0x390be15700f335c1550a03438b5e2649c3c92f12f124c6964aeecfe86f2ae92f",
      "blockNumber": "0x918347",
      "from": "0x85752248d8ccA2d9321f0278FC785738E1236CE4",
      "to": "0xF3f607cea8B2096882c09f3ceBDff1317c95Ad73",
      "cumulativeGasUsed": "0x271cd",
      "gasUsed": "0x271cd",
      "contractAddress": null,
      "logs": [
        {
          "address": "0xF3f607cea8B2096882c09f3ceBDff1317c95Ad73",
          "topics": [
            "0xc88756dd73e6bb8b762d9037ebc78074164c9f9ae658c709b6137d2fea83f7f8"
          ],
          "data": "0x00000000000000000000000085752248d8cca2d9321f0278fc785738e1236ce4000000000000000000000000000000000000000000000000016345785d8a0000000000000000000000000000000000000000000000000000000000000000000000000000000000000000000085752248d8cca2d9321f0278fc785738e1236ce4000000000000000000000000000000000000000000000000000000000000008c1fd208956a56993d35a5d58419b4de89a7a660a1b610548989a009c5560d96ce",
          "blockHash": "0x390be15700f335c1550a03438b5e2649c3c92f12f124c6964aeecfe86f2ae92f",
          "blockNumber": "0x918347",
          "transactionHash": "0x1b407454a454e4791c2bd4ba9acf65c6ccd70633e652252c706070e663acf440",
          "transactionIndex": "0x0",
          "logIndex": "0x0",
          "removed": false
        }
      ],
      "status": "0x1",
      "logsBloom": "0x00000000000000000000000000000000000010000000000000000000000000000000000000000000000000010000000000000000000000800000000000000000000000000000000000000000000000000000000000000000000000000000000000000000000000000000000000000000000000000000000000200000000000000000000000000000000000000000000000000000000000000000000000000000000000000000000000000000000000000000000000000000000000000000000000000000000000000000000000000000000000000000000000000000000000000000000000000000004000000000000000000000000000000000000000100000",
      "type": "0x2",
      "effectiveGasPrice": "0xb2d05e02"
    },
    {
      "transactionHash": "0x7f3e2b3c28c67f63515edc74aed86fae53364e89486b63006960a4ae28940c0c",
      "transactionIndex": "0x0",
      "blockHash": "0x032339fe09e759f1701dbf18511b134bae58a02211a8824112dbd3073c8441af",
      "blockNumber": "0x918348",
      "from": "0x85752248d8ccA2d9321f0278FC785738E1236CE4",
      "to": "0xF3f607cea8B2096882c09f3ceBDff1317c95Ad73",
      "cumulativeGasUsed": "0x1e7ac",
      "gasUsed": "0x1e7ac",
      "contractAddress": null,
      "logs": [
        {
          "address": "0xF3f607cea8B2096882c09f3ceBDff1317c95Ad73",
          "topics": [
            "0x6667b10209a19e78c037ae773e4b5fc3128718495569a6b1fd04f3b3fe6de897"
          ],
          "data": "0x00000000000000000000000085752248d8cca2d9321f0278fc785738e1236ce40000000000000000000000000000000000000000000000000000000000000000000000000000000000000000000000000000000000000000000000000000008d",
          "blockHash": "0x032339fe09e759f1701dbf18511b134bae58a02211a8824112dbd3073c8441af",
          "blockNumber": "0x918348",
          "transactionHash": "0x7f3e2b3c28c67f63515edc74aed86fae53364e89486b63006960a4ae28940c0c",
          "transactionIndex": "0x0",
          "logIndex": "0x0",
          "removed": false
        }
      ],
      "status": "0x1",
      "logsBloom": "0x00000000000000000000000000000000000010000000000000000000000000000000000000000000200000010000000000000000000000000000000000000000000000000000000000000000000000000000000000000000000000000000000004000000000000000000000000000000000000000000000000000000000000000000000000000000000000000000000000000000000000000000000000000000000000000080000000000000000000000000000000000000000000000000000000000000000000000000000000000000000000000000000000000000000000000000000000000000000000000000000000000000000000000000000000100000",
      "type": "0x2",
      "effectiveGasPrice": "0xb2d05e02"
    },
    {
      "transactionHash": "0x2629f0046d3663b81523ee37f76021165be32959351d0699f686d70b483acdb4",
      "transactionIndex": "0x0",
      "blockHash": "0x441a806a5309bda0333d6482cc3b37da80f7c4df0d148f6faebfc02c5496e013",
      "blockNumber": "0x918349",
      "from": "0x85752248d8ccA2d9321f0278FC785738E1236CE4",
      "to": "0xF3f607cea8B2096882c09f3ceBDff1317c95Ad73",
      "cumulativeGasUsed": "0x271cd",
      "gasUsed": "0x271cd",
      "contractAddress": null,
      "logs": [
        {
          "address": "0xF3f607cea8B2096882c09f3ceBDff1317c95Ad73",
          "topics": [
            "0xc88756dd73e6bb8b762d9037ebc78074164c9f9ae658c709b6137d2fea83f7f8"
          ],
          "data": "0x00000000000000000000000085752248d8cca2d9321f0278fc785738e1236ce4000000000000000000000000000000000000000000000000016345785d8a0000000000000000000000000000000000000000000000000000000000000000000000000000000000000000000085752248d8cca2d9321f0278fc785738e1236ce4000000000000000000000000000000000000000000000000000000000000008e7c81593dbc60c077dc16d56bf49af6301638e9c28321abbc8d9cd99addd087ad",
          "blockHash": "0x441a806a5309bda0333d6482cc3b37da80f7c4df0d148f6faebfc02c5496e013",
          "blockNumber": "0x918349",
          "transactionHash": "0x2629f0046d3663b81523ee37f76021165be32959351d0699f686d70b483acdb4",
          "transactionIndex": "0x0",
          "logIndex": "0x0",
          "removed": false
        }
      ],
      "status": "0x1",
      "logsBloom": "0x00000000000000000000000000000000000010000000000000000000000000000000000000000000000000010000000000000000000000800000000000000000000000000000000000000000000000000000000000000000000000000000000000000000000000000000000000000000000000000000000000200000000000000000000000000000000000000000000000000000000000000000000000000000000000000000000000000000000000000000000000000000000000000000000000000000000000000000000000000000000000000000000000000000000000000000000000000000004000000000000000000000000000000000000000100000",
      "type": "0x2",
      "effectiveGasPrice": "0xb2d05e02"
    }
  ],
  "libraries": [],
  "pending": [],
  "returns": {},
  "timestamp": 1692653454,
  "chain": 5,
  "multi": false,
  "commit": "c856ad3"
}