{
  "transactions": [
    {
      "hash": null,
      "transactionType": "CALL",
      "contractName": null,
      "contractAddress": "0x355e4653Db9D29423455041F635C5CfcF7b59746",
      "function": null,
      "arguments": null,
      "transaction": {
        "type": "0x02",
        "from": "0x85752248d8cca2d9321f0278fc785738e1236ce4",
        "to": "0x355e4653db9d29423455041f635c5cfcf7b59746",
        "gas": "0x11522",
        "value": "0x0",
        "data": "0xa9059cbb000000000000000000000000ee45faab3d856a10a8ac03da70d8291587ed0d4300000000000000000000000000000000000000000000000000000002540be400",
        "nonce": "0x8cc",
        "accessList": []
      },
      "additionalContracts": [],
      "isFixedGasLimit": false
    },
    {
      "hash": null,
      "transactionType": "CALL",
      "contractName": null,
      "contractAddress": null,
      "function": null,
      "arguments": null,
      "transaction": {
        "type": "0x02",
        "from": "0x85752248d8cca2d9321f0278fc785738e1236ce4",
        "to": "0xee45faab3d856a10a8ac03da70d8291587ed0d43",
        "gas": "0x714d",
        "value": "0x8ac7230489e80000",
        "data": "0x",
        "nonce": "0x8cd",
        "accessList": []
      },
      "additionalContracts": [],
      "isFixedGasLimit": false
    },
    {
      "hash": null,
      "transactionType": "CALL",
      "contractName": null,
      "contractAddress": "0x355e4653Db9D29423455041F635C5CfcF7b59746",
      "function": null,
      "arguments": null,
      "transaction": {
        "type": "0x02",
        "from": "0x85752248d8cca2d9321f0278fc785738e1236ce4",
        "to": "0x355e4653db9d29423455041f635c5cfcf7b59746",
        "gas": "0x11522",
        "value": "0x0",
        "data": "0xa9059cbb0000000000000000000000000d9d0c3a4413e27d53b59b203f34ffedea7b659c00000000000000000000000000000000000000000000000000000002540be400",
        "nonce": "0x8ce",
        "accessList": []
      },
      "additionalContracts": [],
      "isFixedGasLimit": false
    },
    {
      "hash": null,
      "transactionType": "CALL",
      "contractName": null,
      "contractAddress": null,
      "function": null,
      "arguments": null,
      "transaction": {
        "type": "0x02",
        "from": "0x85752248d8cca2d9321f0278fc785738e1236ce4",
        "to": "0x0d9d0c3a4413e27d53b59b203f34ffedea7b659c",
        "gas": "0x714d",
        "value": "0x8ac7230489e80000",
        "data": "0x",
        "nonce": "0x8cf",
        "accessList": []
      },
      "additionalContracts": [],
      "isFixedGasLimit": false
    },
    {
      "hash": null,
      "transactionType": "CALL",
      "contractName": null,
      "contractAddress": "0x355e4653Db9D29423455041F635C5CfcF7b59746",
      "function": null,
      "arguments": null,
      "transaction": {
        "type": "0x02",
        "from": "0x85752248d8cca2d9321f0278fc785738e1236ce4",
        "to": "0x355e4653db9d29423455041f635c5cfcf7b59746",
        "gas": "0x11522",
        "value": "0x0",
        "data": "0xa9059cbb000000000000000000000000b822e9589b3adc71bd711d97d7e2cea0461e12c700000000000000000000000000000000000000000000000000000002540be400",
        "nonce": "0x8d0",
        "accessList": []
      },
      "additionalContracts": [],
      "isFixedGasLimit": false
    },
    {
      "hash": null,
      "transactionType": "CALL",
      "contractName": null,
      "contractAddress": null,
      "function": null,
      "arguments": null,
      "transaction": {
        "type": "0x02",
        "from": "0x85752248d8cca2d9321f0278fc785738e1236ce4",
        "to": "0xb822e9589b3adc71bd711d97d7e2cea0461e12c7",
        "gas": "0x714d",
        "value": "0x8ac7230489e80000",
        "data": "0x",
        "nonce": "0x8d1",
        "accessList": []
      },
      "additionalContracts": [],
      "isFixedGasLimit": false
    },
    {
      "hash": null,
      "transactionType": "CALL",
      "contractName": null,
      "contractAddress": "0x355e4653Db9D29423455041F635C5CfcF7b59746",
      "function": null,
      "arguments": null,
      "transaction": {
        "type": "0x02",
        "from": "0x85752248d8cca2d9321f0278fc785738e1236ce4",
        "to": "0x355e4653db9d29423455041f635c5cfcf7b59746",
        "gas": "0x11522",
        "value": "0x0",
        "data": "0xa9059cbb0000000000000000000000008763b4913ccc2d1fc72009921b57bafd1831aa1700000000000000000000000000000000000000000000000000000002540be400",
        "nonce": "0x8d2",
        "accessList": []
      },
      "additionalContracts": [],
      "isFixedGasLimit": false
    },
    {
      "hash": null,
      "transactionType": "CALL",
      "contractName": null,
      "contractAddress": null,
      "function": null,
      "arguments": null,
      "transaction": {
        "type": "0x02",
        "from": "0x85752248d8cca2d9321f0278fc785738e1236ce4",
        "to": "0x8763b4913ccc2d1fc72009921b57bafd1831aa17",
        "gas": "0x714d",
        "value": "0x8ac7230489e80000",
        "data": "0x",
        "nonce": "0x8d3",
        "accessList": []
      },
      "additionalContracts": [],
      "isFixedGasLimit": false
    },
    {
      "hash": null,
      "transactionType": "CALL",
      "contractName": null,
      "contractAddress": "0x355e4653Db9D29423455041F635C5CfcF7b59746",
      "function": null,
      "arguments": null,
      "transaction": {
        "type": "0x02",
        "from": "0x85752248d8cca2d9321f0278fc785738e1236ce4",
        "to": "0x355e4653db9d29423455041f635c5cfcf7b59746",
        "gas": "0x11522",
        "value": "0x0",
        "data": "0xa9059cbb0000000000000000000000003ce9fd177f0afb7ca10a345839a714119ccda8cb00000000000000000000000000000000000000000000000000000002540be400",
        "nonce": "0x8d4",
        "accessList": []
      },
      "additionalContracts": [],
      "isFixedGasLimit": false
    },
    {
      "hash": null,
      "transactionType": "CALL",
      "contractName": null,
      "contractAddress": null,
      "function": null,
      "arguments": null,
      "transaction": {
        "type": "0x02",
        "from": "0x85752248d8cca2d9321f0278fc785738e1236ce4",
        "to": "0x3ce9fd177f0afb7ca10a345839a714119ccda8cb",
        "gas": "0x714d",
        "value": "0x8ac7230489e80000",
        "data": "0x",
        "nonce": "0x8d5",
        "accessList": []
      },
      "additionalContracts": [],
      "isFixedGasLimit": false
    },
    {
      "hash": null,
      "transactionType": "CALL",
      "contractName": null,
      "contractAddress": "0x355e4653Db9D29423455041F635C5CfcF7b59746",
      "function": null,
      "arguments": null,
      "transaction": {
        "type": "0x02",
        "from": "0x85752248d8cca2d9321f0278fc785738e1236ce4",
        "to": "0x355e4653db9d29423455041f635c5cfcf7b59746",
        "gas": "0x11522",
        "value": "0x0",
        "data": "0xa9059cbb000000000000000000000000f9e24e7d410fd222fc73a0710335b16ab794fd5900000000000000000000000000000000000000000000000000000002540be400",
        "nonce": "0x8d6",
        "accessList": []
      },
      "additionalContracts": [],
      "isFixedGasLimit": false
    },
    {
      "hash": null,
      "transactionType": "CALL",
      "contractName": null,
      "contractAddress": null,
      "function": null,
      "arguments": null,
      "transaction": {
        "type": "0x02",
        "from": "0x85752248d8cca2d9321f0278fc785738e1236ce4",
        "to": "0xf9e24e7d410fd222fc73a0710335b16ab794fd59",
        "gas": "0x714d",
        "value": "0x8ac7230489e80000",
        "data": "0x",
        "nonce": "0x8d7",
        "accessList": []
      },
      "additionalContracts": [],
      "isFixedGasLimit": false
    },
    {
      "hash": null,
      "transactionType": "CALL",
      "contractName": null,
      "contractAddress": "0x355e4653Db9D29423455041F635C5CfcF7b59746",
      "function": null,
      "arguments": null,
      "transaction": {
        "type": "0x02",
        "from": "0x85752248d8cca2d9321f0278fc785738e1236ce4",
        "to": "0x355e4653db9d29423455041f635c5cfcf7b59746",
        "gas": "0x11522",
        "value": "0x0",
        "data": "0xa9059cbb000000000000000000000000c127f6f27485d0dd37fc69180a4972576ac0440b00000000000000000000000000000000000000000000000000000002540be400",
        "nonce": "0x8d8",
        "accessList": []
      },
      "additionalContracts": [],
      "isFixedGasLimit": false
    },
    {
      "hash": null,
      "transactionType": "CALL",
      "contractName": null,
      "contractAddress": null,
      "function": null,
      "arguments": null,
      "transaction": {
        "type": "0x02",
        "from": "0x85752248d8cca2d9321f0278fc785738e1236ce4",
        "to": "0xc127f6f27485d0dd37fc69180a4972576ac0440b",
        "gas": "0x714d",
        "value": "0x8ac7230489e80000",
        "data": "0x",
        "nonce": "0x8d9",
        "accessList": []
      },
      "additionalContracts": [],
      "isFixedGasLimit": false
    },
    {
      "hash": null,
      "transactionType": "CALL",
      "contractName": null,
      "contractAddress": "0x355e4653Db9D29423455041F635C5CfcF7b59746",
      "function": null,
      "arguments": null,
      "transaction": {
        "type": "0x02",
        "from": "0x85752248d8cca2d9321f0278fc785738e1236ce4",
        "to": "0x355e4653db9d29423455041f635c5cfcf7b59746",
        "gas": "0x11522",
        "value": "0x0",
        "data": "0xa9059cbb000000000000000000000000fa44d6b4ecee81f73623b36d6ef81e0e3dc6dea100000000000000000000000000000000000000000000000000000002540be400",
        "nonce": "0x8da",
        "accessList": []
      },
      "additionalContracts": [],
      "isFixedGasLimit": false
    },
    {
      "hash": null,
      "transactionType": "CALL",
      "contractName": null,
      "contractAddress": null,
      "function": null,
      "arguments": null,
      "transaction": {
        "type": "0x02",
        "from": "0x85752248d8cca2d9321f0278fc785738e1236ce4",
        "to": "0xfa44d6b4ecee81f73623b36d6ef81e0e3dc6dea1",
        "gas": "0x714d",
        "value": "0x8ac7230489e80000",
        "data": "0x",
        "nonce": "0x8db",
        "accessList": []
      },
      "additionalContracts": [],
      "isFixedGasLimit": false
    },
    {
      "hash": null,
      "transactionType": "CALL",
      "contractName": null,
      "contractAddress": "0x355e4653Db9D29423455041F635C5CfcF7b59746",
      "function": null,
      "arguments": null,
      "transaction": {
        "type": "0x02",
        "from": "0x85752248d8cca2d9321f0278fc785738e1236ce4",
        "to": "0x355e4653db9d29423455041f635c5cfcf7b59746",
        "gas": "0xb8de",
        "value": "0x0",
        "data": "0xa9059cbb000000000000000000000000b822e9589b3adc71bd711d97d7e2cea0461e12c700000000000000000000000000000000000000000000000000000002540be400",
        "nonce": "0x8dc",
        "accessList": []
      },
      "additionalContracts": [],
      "isFixedGasLimit": false
    },
    {
      "hash": null,
      "transactionType": "CALL",
      "contractName": null,
      "contractAddress": null,
      "function": null,
      "arguments": null,
      "transaction": {
        "type": "0x02",
        "from": "0x85752248d8cca2d9321f0278fc785738e1236ce4",
        "to": "0xb822e9589b3adc71bd711d97d7e2cea0461e12c7",
        "gas": "0x714d",
        "value": "0x8ac7230489e80000",
        "data": "0x",
        "nonce": "0x8dd",
        "accessList": []
      },
      "additionalContracts": [],
      "isFixedGasLimit": false
    },
    {
      "hash": null,
      "transactionType": "CALL",
      "contractName": null,
      "contractAddress": "0x355e4653Db9D29423455041F635C5CfcF7b59746",
      "function": null,
      "arguments": null,
      "transaction": {
        "type": "0x02",
        "from": "0x85752248d8cca2d9321f0278fc785738e1236ce4",
        "to": "0x355e4653db9d29423455041f635c5cfcf7b59746",
        "gas": "0x11522",
        "value": "0x0",
        "data": "0xa9059cbb000000000000000000000000bb5299284781b1c6dd3e9b7260241da42813b5e500000000000000000000000000000000000000000000000000000002540be400",
        "nonce": "0x8de",
        "accessList": []
      },
      "additionalContracts": [],
      "isFixedGasLimit": false
    },
    {
      "hash": null,
      "transactionType": "CALL",
      "contractName": null,
      "contractAddress": null,
      "function": null,
      "arguments": null,
      "transaction": {
        "type": "0x02",
        "from": "0x85752248d8cca2d9321f0278fc785738e1236ce4",
        "to": "0xbb5299284781b1c6dd3e9b7260241da42813b5e5",
        "gas": "0x714d",
        "value": "0x8ac7230489e80000",
        "data": "0x",
        "nonce": "0x8df",
        "accessList": []
      },
      "additionalContracts": [],
      "isFixedGasLimit": false
    },
    {
      "hash": null,
      "transactionType": "CALL",
      "contractName": null,
      "contractAddress": "0x355e4653Db9D29423455041F635C5CfcF7b59746",
      "function": null,
      "arguments": null,
      "transaction": {
        "type": "0x02",
        "from": "0x85752248d8cca2d9321f0278fc785738e1236ce4",
        "to": "0x355e4653db9d29423455041f635c5cfcf7b59746",
        "gas": "0x11522",
        "value": "0x0",
        "data": "0xa9059cbb00000000000000000000000086144361ba14e59d26423ff6d3e5a40495f43a6f00000000000000000000000000000000000000000000000000000002540be400",
        "nonce": "0x8e0",
        "accessList": []
      },
      "additionalContracts": [],
      "isFixedGasLimit": false
    },
    {
      "hash": null,
      "transactionType": "CALL",
      "contractName": null,
      "contractAddress": null,
      "function": null,
      "arguments": null,
      "transaction": {
        "type": "0x02",
        "from": "0x85752248d8cca2d9321f0278fc785738e1236ce4",
        "to": "0x86144361ba14e59d26423ff6d3e5a40495f43a6f",
        "gas": "0x714d",
        "value": "0x8ac7230489e80000",
        "data": "0x",
        "nonce": "0x8e1",
        "accessList": []
      },
      "additionalContracts": [],
      "isFixedGasLimit": false
    },
    {
      "hash": null,
      "transactionType": "CALL",
      "contractName": null,
      "contractAddress": "0x355e4653Db9D29423455041F635C5CfcF7b59746",
      "function": null,
      "arguments": null,
      "transaction": {
        "type": "0x02",
        "from": "0x85752248d8cca2d9321f0278fc785738e1236ce4",
        "to": "0x355e4653db9d29423455041f635c5cfcf7b59746",
        "gas": "0x11522",
        "value": "0x0",
        "data": "0xa9059cbb0000000000000000000000000d5bfcb3de3c81e60ba11ea19bce7186b180552200000000000000000000000000000000000000000000000000000002540be400",
        "nonce": "0x8e2",
        "accessList": []
      },
      "additionalContracts": [],
      "isFixedGasLimit": false
    },
    {
      "hash": null,
      "transactionType": "CALL",
      "contractName": null,
      "contractAddress": null,
      "function": null,
      "arguments": null,
      "transaction": {
        "type": "0x02",
        "from": "0x85752248d8cca2d9321f0278fc785738e1236ce4",
        "to": "0x0d5bfcb3de3c81e60ba11ea19bce7186b1805522",
        "gas": "0x714d",
        "value": "0x8ac7230489e80000",
        "data": "0x",
        "nonce": "0x8e3",
        "accessList": []
      },
      "additionalContracts": [],
      "isFixedGasLimit": false
    },
    {
      "hash": null,
      "transactionType": "CALL",
      "contractName": null,
      "contractAddress": "0x355e4653Db9D29423455041F635C5CfcF7b59746",
      "function": null,
      "arguments": null,
      "transaction": {
        "type": "0x02",
        "from": "0x85752248d8cca2d9321f0278fc785738e1236ce4",
        "to": "0x355e4653db9d29423455041f635c5cfcf7b59746",
        "gas": "0x11522",
        "value": "0x0",
        "data": "0xa9059cbb0000000000000000000000001da5c062b5e3efc48d288d9abbf1fe93823db05300000000000000000000000000000000000000000000000000000002540be400",
        "nonce": "0x8e4",
        "accessList": []
      },
      "additionalContracts": [],
      "isFixedGasLimit": false
    },
    {
      "hash": null,
      "transactionType": "CALL",
      "contractName": null,
      "contractAddress": null,
      "function": null,
      "arguments": null,
      "transaction": {
        "type": "0x02",
        "from": "0x85752248d8cca2d9321f0278fc785738e1236ce4",
        "to": "0x1da5c062b5e3efc48d288d9abbf1fe93823db053",
        "gas": "0x714d",
        "value": "0x8ac7230489e80000",
        "data": "0x",
        "nonce": "0x8e5",
        "accessList": []
      },
      "additionalContracts": [],
      "isFixedGasLimit": false
    },
    {
      "hash": null,
      "transactionType": "CALL",
      "contractName": null,
      "contractAddress": "0x355e4653Db9D29423455041F635C5CfcF7b59746",
      "function": null,
      "arguments": null,
      "transaction": {
        "type": "0x02",
        "from": "0x85752248d8cca2d9321f0278fc785738e1236ce4",
        "to": "0x355e4653db9d29423455041f635c5cfcf7b59746",
        "gas": "0xb8de",
        "value": "0x0",
        "data": "0xa9059cbb000000000000000000000000c127f6f27485d0dd37fc69180a4972576ac0440b00000000000000000000000000000000000000000000000000000002540be400",
        "nonce": "0x8e6",
        "accessList": []
      },
      "additionalContracts": [],
      "isFixedGasLimit": false
    },
    {
      "hash": null,
      "transactionType": "CALL",
      "contractName": null,
      "contractAddress": null,
      "function": null,
      "arguments": null,
      "transaction": {
        "type": "0x02",
        "from": "0x85752248d8cca2d9321f0278fc785738e1236ce4",
        "to": "0xc127f6f27485d0dd37fc69180a4972576ac0440b",
        "gas": "0x714d",
        "value": "0x8ac7230489e80000",
        "data": "0x",
        "nonce": "0x8e7",
        "accessList": []
      },
      "additionalContracts": [],
      "isFixedGasLimit": false
    },
    {
      "hash": null,
      "transactionType": "CALL",
      "contractName": null,
      "contractAddress": "0x355e4653Db9D29423455041F635C5CfcF7b59746",
      "function": null,
      "arguments": null,
      "transaction": {
        "type": "0x02",
        "from": "0x85752248d8cca2d9321f0278fc785738e1236ce4",
        "to": "0x355e4653db9d29423455041f635c5cfcf7b59746",
        "gas": "0x11522",
        "value": "0x0",
        "data": "0xa9059cbb0000000000000000000000008f7b9942d384b4cdafc596c375ef5bc435d401a000000000000000000000000000000000000000000000000000000002540be400",
        "nonce": "0x8e8",
        "accessList": []
      },
      "additionalContracts": [],
      "isFixedGasLimit": false
    },
    {
      "hash": null,
      "transactionType": "CALL",
      "contractName": null,
      "contractAddress": null,
      "function": null,
      "arguments": null,
      "transaction": {
        "type": "0x02",
        "from": "0x85752248d8cca2d9321f0278fc785738e1236ce4",
        "to": "0x8f7b9942d384b4cdafc596c375ef5bc435d401a0",
        "gas": "0x714d",
        "value": "0x8ac7230489e80000",
        "data": "0x",
        "nonce": "0x8e9",
        "accessList": []
      },
      "additionalContracts": [],
      "isFixedGasLimit": false
    },
    {
      "hash": null,
      "transactionType": "CALL",
      "contractName": null,
      "contractAddress": "0x355e4653Db9D29423455041F635C5CfcF7b59746",
      "function": null,
      "arguments": null,
      "transaction": {
        "type": "0x02",
        "from": "0x85752248d8cca2d9321f0278fc785738e1236ce4",
        "to": "0x355e4653db9d29423455041f635c5cfcf7b59746",
        "gas": "0x11522",
        "value": "0x0",
        "data": "0xa9059cbb000000000000000000000000abc8222f3e4c72c05630b061bf65d56a6d15f04200000000000000000000000000000000000000000000000000000002540be400",
        "nonce": "0x8ea",
        "accessList": []
      },
      "additionalContracts": [],
      "isFixedGasLimit": false
    },
    {
      "hash": null,
      "transactionType": "CALL",
      "contractName": null,
      "contractAddress": null,
      "function": null,
      "arguments": null,
      "transaction": {
        "type": "0x02",
        "from": "0x85752248d8cca2d9321f0278fc785738e1236ce4",
        "to": "0xabc8222f3e4c72c05630b061bf65d56a6d15f042",
        "gas": "0x714d",
        "value": "0x8ac7230489e80000",
        "data": "0x",
        "nonce": "0x8eb",
        "accessList": []
      },
      "additionalContracts": [],
      "isFixedGasLimit": false
    },
    {
      "hash": null,
      "transactionType": "CALL",
      "contractName": null,
      "contractAddress": "0x355e4653Db9D29423455041F635C5CfcF7b59746",
      "function": null,
      "arguments": null,
      "transaction": {
        "type": "0x02",
        "from": "0x85752248d8cca2d9321f0278fc785738e1236ce4",
        "to": "0x355e4653db9d29423455041f635c5cfcf7b59746",
        "gas": "0x11522",
        "value": "0x0",
        "data": "0xa9059cbb000000000000000000000000997afb2c8d6f4f680154366e3bdbbf460766f5f500000000000000000000000000000000000000000000000000000002540be400",
        "nonce": "0x8ec",
        "accessList": []
      },
      "additionalContracts": [],
      "isFixedGasLimit": false
    },
    {
      "hash": null,
      "transactionType": "CALL",
      "contractName": null,
      "contractAddress": null,
      "function": null,
      "arguments": null,
      "transaction": {
        "type": "0x02",
        "from": "0x85752248d8cca2d9321f0278fc785738e1236ce4",
        "to": "0x997afb2c8d6f4f680154366e3bdbbf460766f5f5",
        "gas": "0x714d",
        "value": "0x8ac7230489e80000",
        "data": "0x",
        "nonce": "0x8ed",
        "accessList": []
      },
      "additionalContracts": [],
      "isFixedGasLimit": false
    },
    {
      "hash": null,
      "transactionType": "CALL",
      "contractName": null,
      "contractAddress": "0x355e4653Db9D29423455041F635C5CfcF7b59746",
      "function": null,
      "arguments": null,
      "transaction": {
        "type": "0x02",
        "from": "0x85752248d8cca2d9321f0278fc785738e1236ce4",
        "to": "0x355e4653db9d29423455041f635c5cfcf7b59746",
        "gas": "0x11522",
        "value": "0x0",
        "data": "0xa9059cbb000000000000000000000000011c62434f17b3d690e8976b7468e4eaaf778fa100000000000000000000000000000000000000000000000000000002540be400",
        "nonce": "0x8ee",
        "accessList": []
      },
      "additionalContracts": [],
      "isFixedGasLimit": false
    },
    {
      "hash": null,
      "transactionType": "CALL",
      "contractName": null,
      "contractAddress": null,
      "function": null,
      "arguments": null,
      "transaction": {
        "type": "0x02",
        "from": "0x85752248d8cca2d9321f0278fc785738e1236ce4",
        "to": "0x011c62434f17b3d690e8976b7468e4eaaf778fa1",
        "gas": "0x714d",
        "value": "0x8ac7230489e80000",
        "data": "0x",
        "nonce": "0x8ef",
        "accessList": []
      },
      "additionalContracts": [],
      "isFixedGasLimit": false
    },
    {
      "hash": null,
      "transactionType": "CALL",
      "contractName": null,
      "contractAddress": "0x355e4653Db9D29423455041F635C5CfcF7b59746",
      "function": null,
      "arguments": null,
      "transaction": {
        "type": "0x02",
        "from": "0x85752248d8cca2d9321f0278fc785738e1236ce4",
        "to": "0x355e4653db9d29423455041f635c5cfcf7b59746",
        "gas": "0x11522",
        "value": "0x0",
        "data": "0xa9059cbb000000000000000000000000ac83762f7ba18b863c34267d7f6f3116f9813a9100000000000000000000000000000000000000000000000000000002540be400",
        "nonce": "0x8f0",
        "accessList": []
      },
      "additionalContracts": [],
      "isFixedGasLimit": false
    },
    {
      "hash": null,
      "transactionType": "CALL",
      "contractName": null,
      "contractAddress": null,
      "function": null,
      "arguments": null,
      "transaction": {
        "type": "0x02",
        "from": "0x85752248d8cca2d9321f0278fc785738e1236ce4",
        "to": "0xac83762f7ba18b863c34267d7f6f3116f9813a91",
        "gas": "0x714d",
        "value": "0x8ac7230489e80000",
        "data": "0x",
        "nonce": "0x8f1",
        "accessList": []
      },
      "additionalContracts": [],
      "isFixedGasLimit": false
    },
    {
      "hash": null,
      "transactionType": "CALL",
      "contractName": null,
      "contractAddress": "0x355e4653Db9D29423455041F635C5CfcF7b59746",
      "function": null,
      "arguments": null,
      "transaction": {
        "type": "0x02",
        "from": "0x85752248d8cca2d9321f0278fc785738e1236ce4",
        "to": "0x355e4653db9d29423455041f635c5cfcf7b59746",
        "gas": "0x11522",
        "value": "0x0",
        "data": "0xa9059cbb00000000000000000000000059d2735ecd289f999246944bcc4f5bbcb067c13800000000000000000000000000000000000000000000000000000002540be400",
        "nonce": "0x8f2",
        "accessList": []
      },
      "additionalContracts": [],
      "isFixedGasLimit": false
    },
    {
      "hash": null,
      "transactionType": "CALL",
      "contractName": null,
      "contractAddress": null,
      "function": null,
      "arguments": null,
      "transaction": {
        "type": "0x02",
        "from": "0x85752248d8cca2d9321f0278fc785738e1236ce4",
        "to": "0x59d2735ecd289f999246944bcc4f5bbcb067c138",
        "gas": "0x714d",
        "value": "0x8ac7230489e80000",
        "data": "0x",
        "nonce": "0x8f3",
        "accessList": []
      },
      "additionalContracts": [],
      "isFixedGasLimit": false
    },
    {
      "hash": null,
      "transactionType": "CALL",
      "contractName": null,
      "contractAddress": "0x355e4653Db9D29423455041F635C5CfcF7b59746",
      "function": null,
      "arguments": null,
      "transaction": {
        "type": "0x02",
        "from": "0x85752248d8cca2d9321f0278fc785738e1236ce4",
        "to": "0x355e4653db9d29423455041f635c5cfcf7b59746",
        "gas": "0x11522",
        "value": "0x0",
        "data": "0xa9059cbb000000000000000000000000470d29cb2017e91560362a1d9115a9a286bb456600000000000000000000000000000000000000000000000000000002540be400",
        "nonce": "0x8f4",
        "accessList": []
      },
      "additionalContracts": [],
      "isFixedGasLimit": false
    },
    {
      "hash": null,
      "transactionType": "CALL",
      "contractName": null,
      "contractAddress": null,
      "function": null,
      "arguments": null,
      "transaction": {
        "type": "0x02",
        "from": "0x85752248d8cca2d9321f0278fc785738e1236ce4",
        "to": "0x470d29cb2017e91560362a1d9115a9a286bb4566",
        "gas": "0x714d",
        "value": "0x8ac7230489e80000",
        "data": "0x",
        "nonce": "0x8f5",
        "accessList": []
      },
      "additionalContracts": [],
      "isFixedGasLimit": false
    },
    {
      "hash": null,
      "transactionType": "CALL",
      "contractName": null,
      "contractAddress": "0x355e4653Db9D29423455041F635C5CfcF7b59746",
      "function": null,
      "arguments": null,
      "transaction": {
        "type": "0x02",
        "from": "0x85752248d8cca2d9321f0278fc785738e1236ce4",
        "to": "0x355e4653db9d29423455041f635c5cfcf7b59746",
        "gas": "0x11522",
        "value": "0x0",
        "data": "0xa9059cbb0000000000000000000000000c226b4bf2be96de403cc3dfc4e9072d883afaf400000000000000000000000000000000000000000000000000000002540be400",
        "nonce": "0x8f6",
        "accessList": []
      },
      "additionalContracts": [],
      "isFixedGasLimit": false
    },
    {
      "hash": null,
      "transactionType": "CALL",
      "contractName": null,
      "contractAddress": null,
      "function": null,
      "arguments": null,
      "transaction": {
        "type": "0x02",
        "from": "0x85752248d8cca2d9321f0278fc785738e1236ce4",
        "to": "0x0c226b4bf2be96de403cc3dfc4e9072d883afaf4",
        "gas": "0x714d",
        "value": "0x8ac7230489e80000",
        "data": "0x",
        "nonce": "0x8f7",
        "accessList": []
      },
      "additionalContracts": [],
      "isFixedGasLimit": false
    },
    {
      "hash": null,
      "transactionType": "CALL",
      "contractName": null,
      "contractAddress": "0x355e4653Db9D29423455041F635C5CfcF7b59746",
      "function": null,
      "arguments": null,
      "transaction": {
        "type": "0x02",
        "from": "0x85752248d8cca2d9321f0278fc785738e1236ce4",
        "to": "0x355e4653db9d29423455041f635c5cfcf7b59746",
        "gas": "0x11522",
        "value": "0x0",
        "data": "0xa9059cbb0000000000000000000000006e6d31c25507f180a2e8061580f416ea61923f4700000000000000000000000000000000000000000000000000000002540be400",
        "nonce": "0x8f8",
        "accessList": []
      },
      "additionalContracts": [],
      "isFixedGasLimit": false
    },
    {
      "hash": null,
      "transactionType": "CALL",
      "contractName": null,
      "contractAddress": null,
      "function": null,
      "arguments": null,
      "transaction": {
        "type": "0x02",
        "from": "0x85752248d8cca2d9321f0278fc785738e1236ce4",
        "to": "0x6e6d31c25507f180a2e8061580f416ea61923f47",
        "gas": "0x714d",
        "value": "0x8ac7230489e80000",
        "data": "0x",
        "nonce": "0x8f9",
        "accessList": []
      },
      "additionalContracts": [],
      "isFixedGasLimit": false
    },
    {
      "hash": null,
      "transactionType": "CALL",
      "contractName": null,
      "contractAddress": "0x355e4653Db9D29423455041F635C5CfcF7b59746",
      "function": null,
      "arguments": null,
      "transaction": {
        "type": "0x02",
        "from": "0x85752248d8cca2d9321f0278fc785738e1236ce4",
        "to": "0x355e4653db9d29423455041f635c5cfcf7b59746",
        "gas": "0x11522",
        "value": "0x0",
        "data": "0xa9059cbb00000000000000000000000090892b393de832c55ad4b9d1cb30c02868ccdbfc00000000000000000000000000000000000000000000000000000002540be400",
        "nonce": "0x8fa",
        "accessList": []
      },
      "additionalContracts": [],
      "isFixedGasLimit": false
    },
    {
      "hash": null,
      "transactionType": "CALL",
      "contractName": null,
      "contractAddress": null,
      "function": null,
      "arguments": null,
      "transaction": {
        "type": "0x02",
        "from": "0x85752248d8cca2d9321f0278fc785738e1236ce4",
        "to": "0x90892b393de832c55ad4b9d1cb30c02868ccdbfc",
        "gas": "0x714d",
        "value": "0x8ac7230489e80000",
        "data": "0x",
        "nonce": "0x8fb",
        "accessList": []
      },
      "additionalContracts": [],
      "isFixedGasLimit": false
    }
  ],
  "receipts": [],
  "libraries": [],
  "pending": [],
  "returns": {},
  "timestamp": 1691179830,
  "chain": 5,
  "multi": false,
  "commit": "4388f34"
}