{
  "aws": "05a3dc80ed77acf045c04611e7302211296e9557c56be537c97558388f5b795a",
  "random": "462b7f183a277c236d32917f23de103adcc9ab84fe66ebb97866eb69f45d7f38",
  "template": "cd8665642bf0f5b5f57a53050d10fd83415428c2dc6713b85e174e007fcc93bf"
}