<svg width="72" height="14" viewBox="0 0 72 14" fill="none" xmlns="http://www.w3.org/2000/svg">
<g>
<path d="M1.06156 2.08639C1.64619 2.08639 2.12313 1.60259 2.12313 1.0432C2.12313 0.468683 1.64619 0 1.06156 0C0.476934 0 0 0.468683 0 1.0432C0 1.60259 0.476934 2.08639 1.06156 2.08639ZM0.230775 10.7797H1.89235V3.2203H0.230775V10.7797Z" fill="white"/>
<path d="M8.11401 4.79266V3.2203H6.20627V1.10367L4.5447 1.58747V3.2203H3.12928V4.79266H4.5447V8.42117C4.5447 10.3866 5.56011 11.0821 8.11401 10.7797V9.31318C6.85244 9.37365 6.20627 9.38877 6.20627 8.42117V4.79266H8.11401Z" fill="white"/>
<path d="M10.8279 5.3067C10.8279 4.76242 11.351 4.5054 11.951 4.5054C12.5818 4.5054 13.1203 4.77754 13.3972 5.36717L14.7972 4.59611C14.2587 3.59827 13.2126 3.02376 11.951 3.02376C10.3817 3.02376 9.13555 3.91577 9.13555 5.33693C9.13555 8.0432 13.2741 7.28726 13.2741 8.63283C13.2741 9.23758 12.7049 9.47948 11.9664 9.47948C11.1202 9.47948 10.5048 9.07127 10.2587 8.39093L8.82785 9.20734C9.32017 10.2959 10.4279 10.9762 11.9664 10.9762C13.628 10.9762 14.9665 10.1598 14.9665 8.64795C14.9665 5.85097 10.8279 6.68251 10.8279 5.3067Z" fill="white"/>
<path d="M17.2768 10.9611C17.9076 10.9611 18.4307 10.4471 18.4307 9.82721C18.4307 9.19222 17.9076 8.69331 17.2768 8.69331C16.6307 8.69331 16.123 9.19222 16.123 9.82721C16.123 10.4471 16.6307 10.9611 17.2768 10.9611Z" fill="white"/>
<path d="M25.6746 3.2203V4.29374C25.09 3.50756 24.1823 3.02376 22.9823 3.02376C20.8899 3.02376 19.1514 4.7473 19.1514 7C19.1514 9.23758 20.8899 10.9762 22.9823 10.9762C24.1823 10.9762 25.09 10.4924 25.6746 9.69114V10.7797H27.3362V3.2203H25.6746ZM23.2438 9.41901C21.8592 9.41901 20.813 8.40605 20.813 7C20.813 5.59395 21.8592 4.58099 23.2438 4.58099C24.6285 4.58099 25.6746 5.59395 25.6746 7C25.6746 8.40605 24.6285 9.41901 23.2438 9.41901Z" fill="white"/>
<path d="M35.3961 3.2203V4.33909C34.8115 3.52268 33.9038 3.02376 32.7192 3.02376C30.5499 3.02376 28.8421 4.76242 28.8421 6.92441C28.8421 9.08639 30.5499 10.8251 32.7192 10.8251C33.9038 10.8251 34.8115 10.3261 35.3961 9.50972V10.432C35.3961 11.7473 34.5346 12.5184 33.1038 12.5184C31.7653 12.5184 31.196 12.0043 30.8576 11.3542L29.4268 12.1706C30.0729 13.3801 31.3807 14 33.073 14C35.0884 14 37.0269 12.8661 37.0269 10.432V3.2203H35.3961ZM32.9499 9.29806C31.5499 9.29806 30.5037 8.2851 30.5037 6.92441C30.5037 5.56371 31.5499 4.55076 32.9499 4.55076C34.35 4.55076 35.3961 5.56371 35.3961 6.92441C35.3961 8.2851 34.35 9.29806 32.9499 9.29806Z" fill="white"/>
<path d="M40.2714 7.69547H46.3946C46.4254 7.4838 46.4561 7.2419 46.4561 7.01512C46.4561 4.83801 44.8869 3.02376 42.5945 3.02376C40.1791 3.02376 38.5329 4.76242 38.5329 7C38.5329 9.26782 40.1791 10.9762 42.7176 10.9762C44.2253 10.9762 45.3792 10.3564 46.0869 9.32829L44.7176 8.54212C44.3484 9.07127 43.6561 9.47948 42.733 9.47948C41.5022 9.47948 40.5329 8.87473 40.2714 7.69547ZM40.256 6.36501C40.4868 5.2311 41.3329 4.5054 42.5791 4.5054C43.5791 4.5054 44.5484 5.0648 44.7792 6.36501H40.256Z" fill="white"/>
<path d="M51.9644 3.02376C50.9183 3.02376 50.0875 3.40173 49.5798 4.18791V3.2203H47.9182V10.7797H49.5798V6.72786C49.5798 5.18575 50.4413 4.55076 51.5337 4.55076C52.5798 4.55076 53.2568 5.15551 53.2568 6.30454V10.7797H54.9184V6.13823C54.9184 4.17279 53.6876 3.02376 51.9644 3.02376Z" fill="white"/>
<path d="M60.3383 10.9762C61.846 10.9762 63.1538 10.2052 63.7999 9.0108L62.3691 8.2095C61.9999 8.90497 61.246 9.37365 60.3229 9.37365C58.969 9.37365 57.9383 8.36069 57.9383 7C57.9383 5.63931 58.969 4.62635 60.3229 4.62635C61.246 4.62635 61.9999 5.07991 62.3384 5.7905L63.7692 4.97408C63.1538 3.79482 61.846 3.02376 60.3383 3.02376C58.0152 3.02376 56.2767 4.7473 56.2767 7C56.2767 9.23758 58.0152 10.9762 60.3383 10.9762Z" fill="white"/>
<path d="M70.2307 3.2203L68.2615 8.70842L65.9691 3.2203H64.1537L67.4153 10.6436L67.3383 10.7948C66.9537 11.7927 66.3691 12.3369 65.2922 12.2765V13.8035C67.0614 13.9093 68.323 12.9417 69.0461 11.0216L72 3.2203H70.2307Z" fill="white"/>
</g>
</svg>
