<svg viewBox="0 0 800 198" fill="none" xmlns="http://www.w3.org/2000/svg">
<path d="M0 2.85378H62.8289C74.2915 2.85378 84.289 4.84278 92.8213 8.82078C101.354 12.7988 107.904 18.4199 112.472 25.684C117.126 32.9482 119.453 41.3366 119.453 50.8492C119.453 57.681 118.03 63.9507 115.186 69.6582C112.428 75.3658 108.292 80.4248 102.776 84.8352C98.0355 88.6402 92.4766 91.5805 86.0989 93.6559C79.7212 95.7314 72.9987 96.7692 65.9316 96.7692H0V2.85378ZM64.3802 78.7384C69.2928 78.7384 73.9899 77.6575 78.4715 75.4955C83.0393 73.3336 86.7884 70.3933 89.7187 66.6747C91.6147 64.2533 93.0368 61.659 93.9848 58.8917C95.019 56.1244 95.5361 53.3138 95.5361 50.4601C95.5361 44.839 94.2003 39.78 91.5285 35.2831C88.8568 30.7863 85.1508 27.2839 80.4107 24.776C75.6705 22.1817 70.2839 20.8845 64.251 20.8845H22.7529V78.7384H64.3802Z" fill="white"/>
<path d="M144.806 96.7692V2.85378H246.289V20.8845H167.559V40.0827H222.243V58.1134H167.559V78.7384H249.909V96.7692H144.806Z" fill="white"/>
<path d="M331.919 99.3635C323.645 99.3635 315.932 98.4122 308.779 96.5097C301.625 94.5207 294.687 91.4507 287.965 87.2998C283.828 84.7054 280.208 81.4625 277.105 77.571C274.003 73.6795 271.59 69.3556 269.866 64.5993C268.228 59.7565 267.41 54.7407 267.41 49.552C267.41 42.8067 268.789 36.5371 271.547 30.743C274.304 24.949 278.312 19.8468 283.569 15.4364C289.516 10.5071 296.54 6.70207 304.642 4.02124C312.829 1.34041 321.577 0 330.885 0C343.468 0 354.672 2.29167 364.497 6.87502C374.322 11.3719 383.027 18.3334 390.611 27.7595L369.927 35.1534C364.497 29.7918 358.335 25.6408 351.44 22.7005C344.632 19.6738 337.176 18.1604 329.075 18.1604C321.405 18.1604 314.596 19.5008 308.649 22.1817C302.789 24.8625 298.221 28.6243 294.946 33.4671C291.671 38.2234 290.033 43.585 290.033 49.552C290.033 55.692 291.714 61.1834 295.075 66.0261C298.436 70.7824 303.176 74.501 309.296 77.1818C315.501 79.8627 322.697 81.2031 330.885 81.2031C338.814 81.2031 345.967 79.7762 352.345 76.9224C358.723 74.0686 364.67 69.6582 370.185 63.6912L389.448 74.0686C381.691 82.8894 373.202 89.332 363.98 93.3965C354.844 97.3745 344.157 99.3635 331.919 99.3635Z" fill="white"/>
<path d="M398.844 96.7692L448.615 2.85378H476.669L526.311 96.7692H503.3L492.57 76.5332H432.585L421.855 96.7692H398.844ZM441.893 58.5025H483.003L462.448 19.9765L441.893 58.5025Z" fill="white"/>
<path d="M541.35 2.85378H618.012C624.992 2.85378 631.155 4.15096 636.498 6.74531C641.842 9.33965 645.979 12.9717 648.909 17.6416C651.839 22.2249 653.304 27.5433 653.304 33.5968C653.304 41.0339 651.494 47.1306 647.875 51.8869C644.341 56.6432 639.041 59.9727 631.973 61.8752L655.761 96.7692H630.164L607.152 63.5615H564.103V96.7692H541.35V2.85378ZM615.555 45.5308C620.382 45.5308 624.131 44.4066 626.802 42.1581C629.474 39.9097 630.81 36.8397 630.81 32.9482C630.81 30.5268 630.207 28.4081 629 26.5921C627.794 24.776 626.027 23.3924 623.7 22.4411C621.373 21.4034 618.615 20.8845 615.426 20.8845H564.103V45.5308H615.555Z" fill="white"/>
<path d="M736.266 99.4932C726.872 99.4932 718.081 98.1528 709.894 95.472C701.706 92.7912 694.682 88.9861 688.821 84.0569C683.564 79.6465 679.556 74.5443 676.798 68.7502C674.127 62.9562 672.791 56.6 672.791 49.6818C672.791 42.85 674.127 36.5803 676.798 30.8727C679.556 25.0787 683.607 19.9765 688.951 15.5661C694.897 10.6368 701.965 6.83178 710.152 4.15096C718.426 1.38365 727.174 0 736.395 0C745.703 0 754.451 1.38365 762.639 4.15096C770.826 6.83178 777.894 10.6368 783.84 15.5661C789.184 19.9765 793.191 25.0787 795.863 30.8727C798.621 36.5803 800 42.85 800 49.6818C800 56.5135 798.621 62.8697 795.863 68.7502C793.191 74.5443 789.184 79.6465 783.84 84.0569C777.894 88.9861 770.826 92.7912 762.639 95.472C754.537 98.1528 745.747 99.4932 736.266 99.4932ZM736.266 81.3328C744.454 81.3328 751.564 80.0356 757.597 77.4413C763.716 74.7604 768.413 71.0419 771.688 66.2856C774.963 61.5293 776.601 55.9947 776.601 49.6818C776.601 43.5418 774.963 38.0937 771.688 33.3374C768.413 28.5811 763.716 24.8625 757.597 22.1817C751.564 19.5008 744.497 18.1604 736.395 18.1604C728.38 18.1604 721.313 19.5008 715.194 22.1817C709.161 24.8625 704.464 28.5811 701.103 33.3374C697.828 38.0937 696.19 43.5418 696.19 49.6818C696.19 55.9947 697.828 61.5293 701.103 66.2856C704.378 71.0419 709.032 74.7604 715.065 77.4413C721.098 80.0356 728.165 81.3328 736.266 81.3328Z" fill="white"/>
<path d="M24.2773 149.522H28.483L36.86 175.528L45.6132 149.522H50.8788L39.3218 183.247H34.7743L26.3631 157.585L17.986 183.247H13.4043L1.84734 149.522H7.11292L15.8661 175.528L24.2773 149.522Z" fill="white"/>
<path d="M74.035 163.932L86.9938 161.805C86.9938 159.312 86.2074 157.287 84.6346 155.732C83.0617 154.177 81.0444 153.399 78.5826 153.399C76.8046 153.399 75.1292 153.811 73.5563 154.634C72.0063 155.435 70.8779 156.258 70.1713 157.104L69.1114 158.305L65.9657 155.149C66.1024 154.966 66.2848 154.737 66.5127 154.463C66.7635 154.165 67.2878 153.662 68.0856 152.953C68.9062 152.221 69.761 151.569 70.65 150.998C71.539 150.426 72.7015 149.923 74.1376 149.488C75.5964 149.031 77.0781 148.802 78.5826 148.802C82.4121 148.802 85.5805 150.048 88.088 152.541C90.6182 155.034 91.8833 158.122 91.8833 161.805V183.247H86.9938V178.684C86.9026 178.822 86.7545 179.016 86.5493 179.268C86.3669 179.496 85.9338 179.919 85.25 180.537C84.589 181.132 83.8709 181.669 83.0959 182.15C82.3209 182.607 81.2951 183.019 80.0186 183.385C78.7649 183.751 77.4656 183.934 76.1207 183.934C72.7699 183.934 69.9434 182.939 67.6411 180.949C65.3616 178.959 64.2219 176.683 64.2219 174.121C64.2219 171.308 65.0653 169.044 66.7521 167.328C68.4389 165.59 70.8665 164.458 74.035 163.932ZM76.1207 179.371C79.2892 179.371 81.8878 178.33 83.9165 176.248C85.968 174.167 86.9938 171.468 86.9938 168.152V166.025L75.4369 168.152C71.2427 168.952 69.1341 170.942 69.1114 174.121C69.1114 175.631 69.7268 176.889 70.9577 177.895C72.2114 178.879 73.9324 179.371 76.1207 179.371Z" fill="white"/>
<path d="M117.399 134.049V183.247H112.509V134.049H117.399Z" fill="white"/>
<path d="M143.325 134.049V183.247H138.435V134.049H143.325Z" fill="white"/>
<path d="M172.567 157.31C170.128 159.895 168.908 162.925 168.908 166.402C168.908 169.856 170.128 172.886 172.567 175.494C175.029 178.078 177.776 179.371 180.807 179.371C183.702 179.371 186.289 178.113 188.569 175.597C190.871 173.058 192.022 169.993 192.022 166.402C192.022 162.788 190.871 159.723 188.569 157.207C186.289 154.669 183.702 153.399 180.807 153.399C177.776 153.399 175.029 154.703 172.567 157.31ZM168.908 177.964V198H164.019V149.522H168.908V154.806C169 154.669 169.159 154.463 169.387 154.188C169.638 153.891 170.128 153.399 170.857 152.713C171.61 152.027 172.419 151.421 173.285 150.895C174.151 150.346 175.257 149.865 176.602 149.454C177.969 149.019 179.371 148.802 180.807 148.802C185.093 148.802 188.842 150.529 192.056 153.982C195.293 157.436 196.912 161.576 196.912 166.402C196.912 171.205 195.305 175.334 192.091 178.787C188.877 182.218 185.115 183.934 180.807 183.934C179.371 183.934 177.981 183.728 176.636 183.316C175.314 182.904 174.197 182.413 173.285 181.841C172.373 181.269 171.575 180.697 170.892 180.125C170.231 179.531 169.729 179.027 169.387 178.616L168.908 177.964Z" fill="white"/>
<path d="M222.119 163.932L235.078 161.805C235.078 159.312 234.292 157.287 232.719 155.732C231.146 154.177 229.129 153.399 226.667 153.399C224.889 153.399 223.214 153.811 221.641 154.634C220.091 155.435 218.962 156.258 218.256 157.104L217.196 158.305L214.05 155.149C214.187 154.966 214.369 154.737 214.597 154.463C214.848 154.165 215.372 153.662 216.17 152.953C216.991 152.221 217.845 151.569 218.734 150.998C219.623 150.426 220.786 149.923 222.222 149.488C223.681 149.031 225.163 148.802 226.667 148.802C230.497 148.802 233.665 150.048 236.172 152.541C238.703 155.034 239.968 158.122 239.968 161.805V183.247H235.078V178.684C234.987 178.822 234.839 179.016 234.634 179.268C234.451 179.496 234.018 179.919 233.335 180.537C232.673 181.132 231.955 181.669 231.18 182.15C230.405 182.607 229.38 183.019 228.103 183.385C226.849 183.751 225.55 183.934 224.205 183.934C220.854 183.934 218.028 182.939 215.726 180.949C213.446 178.959 212.306 176.683 212.306 174.121C212.306 171.308 213.15 169.044 214.837 167.328C216.523 165.59 218.951 164.458 222.119 163.932ZM224.205 179.371C227.374 179.371 229.972 178.33 232.001 176.248C234.053 174.167 235.078 171.468 235.078 168.152V166.025L223.521 168.152C219.327 168.952 217.219 170.942 217.196 174.121C217.196 175.631 217.811 176.889 219.042 177.895C220.296 178.879 222.017 179.371 224.205 179.371Z" fill="white"/>
<path d="M268.8 157.31C266.361 159.895 265.141 162.925 265.141 166.402C265.141 169.856 266.361 172.886 268.8 175.494C271.262 178.078 274.008 179.371 277.04 179.371C279.935 179.371 282.522 178.113 284.802 175.597C287.104 173.058 288.255 169.993 288.255 166.402C288.255 162.788 287.104 159.723 284.802 157.207C282.522 154.669 279.935 153.399 277.04 153.399C274.008 153.399 271.262 154.703 268.8 157.31ZM265.141 177.964V198H260.252V149.522H265.141V154.806C265.233 154.669 265.392 154.463 265.62 154.188C265.871 153.891 266.361 153.399 267.09 152.713C267.842 152.027 268.652 151.421 269.518 150.895C270.384 150.346 271.49 149.865 272.835 149.454C274.202 149.019 275.604 148.802 277.04 148.802C281.326 148.802 285.075 150.529 288.289 153.982C291.526 157.436 293.145 161.576 293.145 166.402C293.145 171.205 291.538 175.334 288.324 178.787C285.109 182.218 281.348 183.934 277.04 183.934C275.604 183.934 274.214 183.728 272.869 183.316C271.547 182.904 270.43 182.413 269.518 181.841C268.606 181.269 267.808 180.697 267.124 180.125C266.463 179.531 265.962 179.027 265.62 178.616L265.141 177.964Z" fill="white"/>
<path d="M340.748 168.22L313.429 168.152C313.611 171.194 314.853 173.824 317.156 176.043C319.481 178.261 322.205 179.371 325.328 179.371C327.425 179.371 329.374 178.902 331.174 177.964C332.975 177.026 334.252 176.088 335.004 175.151L336.201 173.778L339.346 176.935C339.21 177.118 339.004 177.381 338.731 177.724C338.48 178.044 337.91 178.604 337.021 179.405C336.155 180.183 335.209 180.88 334.183 181.498C333.18 182.092 331.87 182.653 330.251 183.179C328.656 183.682 327.014 183.934 325.328 183.934C320.746 183.934 316.802 182.23 313.497 178.822C310.192 175.391 308.539 171.239 308.539 166.368C308.539 161.496 310.169 157.356 313.429 153.948C316.711 150.517 320.563 148.802 324.986 148.802C329.567 148.802 333.397 150.403 336.474 153.605C339.551 156.784 341.09 160.81 341.09 165.682L340.748 168.22ZM332.508 156.384C330.434 154.394 327.926 153.399 324.986 153.399C322.045 153.399 319.481 154.44 317.292 156.521C315.104 158.603 313.816 161.073 313.429 163.932H336.201C335.836 160.89 334.605 158.374 332.508 156.384Z" fill="white"/>
<path d="M376.453 148.802V153.742H374.333C371.438 153.742 368.965 154.749 366.913 156.761C364.862 158.774 363.836 161.393 363.836 164.618V183.247H358.947V149.522H363.836V154.085C363.927 153.948 364.064 153.765 364.246 153.536C364.429 153.285 364.862 152.862 365.546 152.267C366.23 151.649 366.959 151.112 367.734 150.654C368.532 150.174 369.58 149.751 370.88 149.385C372.202 148.996 373.592 148.802 375.051 148.802H376.453Z" fill="white"/>
<path d="M412.5 153.399L408.978 156.899C408.795 156.624 408.522 156.304 408.157 155.938C407.815 155.549 407.006 155.034 405.73 154.394C404.453 153.731 403.085 153.399 401.626 153.399C399.757 153.399 398.241 153.891 397.079 154.874C395.916 155.858 395.335 157.001 395.335 158.305C395.335 159.655 395.962 160.741 397.216 161.564C398.469 162.388 399.985 163.051 401.763 163.554C403.541 164.035 405.319 164.595 407.097 165.236C408.875 165.853 410.391 166.882 411.645 168.323C412.898 169.741 413.525 171.56 413.525 173.778C413.525 176.683 412.42 179.108 410.209 181.052C407.998 182.973 405.023 183.934 401.285 183.934C399.689 183.934 398.185 183.728 396.771 183.316C395.381 182.904 394.23 182.413 393.318 181.841C392.406 181.269 391.608 180.697 390.924 180.125C390.263 179.531 389.773 179.027 389.454 178.616L389.01 177.964L392.531 174.464C392.623 174.602 392.748 174.785 392.908 175.013C393.067 175.219 393.42 175.608 393.967 176.18C394.537 176.729 395.141 177.232 395.78 177.689C396.418 178.124 397.239 178.513 398.241 178.856C399.244 179.199 400.259 179.371 401.285 179.371C403.655 179.371 405.467 178.844 406.721 177.792C407.998 176.74 408.636 175.402 408.636 173.778C408.636 172.383 407.998 171.251 406.721 170.382C405.467 169.49 403.952 168.792 402.174 168.289C400.418 167.763 398.652 167.191 396.874 166.574C395.096 165.933 393.569 164.938 392.292 163.589C391.038 162.216 390.411 160.455 390.411 158.305C390.411 155.766 391.471 153.548 393.591 151.649C395.734 149.751 398.412 148.802 401.626 148.802C402.926 148.802 404.191 148.962 405.422 149.282C406.676 149.579 407.701 149.957 408.499 150.414C409.297 150.849 410.004 151.306 410.619 151.787C411.257 152.244 411.713 152.61 411.987 152.884L412.5 153.399Z" fill="white"/>
<path d="M477.96 143.896C477.96 145.245 477.641 146.652 477.002 148.116C476.387 149.557 475.635 150.826 474.746 151.924C473.857 152.999 472.968 153.982 472.079 154.874C471.19 155.766 470.449 156.441 469.856 156.899L468.865 157.585L480.08 171.308C480.307 170.988 480.592 170.496 480.934 169.833C481.299 169.17 481.766 167.809 482.336 165.75C482.929 163.692 483.225 161.564 483.225 159.369H487.773C487.773 161.153 487.613 162.914 487.294 164.652C486.998 166.368 486.622 167.843 486.166 169.078C485.733 170.29 485.277 171.377 484.798 172.337C484.342 173.298 483.977 174.007 483.704 174.464L483.225 175.151C483.408 175.471 483.67 175.871 484.012 176.351C484.376 176.832 485.049 177.461 486.029 178.238C487.009 178.993 487.944 179.371 488.833 179.371L490.918 179.027V183.59C490.075 183.819 489.254 183.934 488.457 183.934C487.522 183.934 486.61 183.751 485.721 183.385C484.855 183.019 484.114 182.561 483.499 182.012C482.883 181.44 482.325 180.869 481.823 180.297C481.345 179.725 480.991 179.256 480.763 178.89L480.421 178.341C480.285 178.479 480.091 178.673 479.84 178.925C479.612 179.176 479.088 179.634 478.267 180.297C477.47 180.96 476.603 181.543 475.669 182.047C474.734 182.527 473.526 182.961 472.044 183.35C470.586 183.739 469.058 183.934 467.463 183.934C463.36 183.934 459.997 182.767 457.376 180.434C454.755 178.101 453.444 175.288 453.444 171.994C453.444 170.347 453.774 168.735 454.436 167.157C455.097 165.556 455.883 164.206 456.795 163.108C457.707 162.011 458.618 161.027 459.53 160.158C460.465 159.289 461.263 158.648 461.924 158.237L462.915 157.585C462.733 157.402 462.471 157.139 462.129 156.796C461.81 156.453 461.217 155.744 460.351 154.669C459.485 153.571 458.732 152.519 458.094 151.512C457.479 150.506 456.897 149.328 456.35 147.978C455.826 146.629 455.564 145.382 455.564 144.239C455.564 141.243 456.647 138.681 458.812 136.554C460.978 134.427 463.622 133.363 466.745 133.363C469.89 133.363 472.546 134.404 474.711 136.485C476.877 138.566 477.96 141.037 477.96 143.896ZM477.276 175.151L465.719 160.398C465.537 160.535 465.263 160.753 464.898 161.05C464.556 161.324 463.941 161.896 463.052 162.765C462.163 163.634 461.376 164.504 460.693 165.373C460.032 166.242 459.416 167.283 458.846 168.495C458.276 169.707 457.991 170.874 457.991 171.994C457.991 174.236 458.835 176.031 460.522 177.381C462.208 178.707 464.522 179.371 467.463 179.371C469.332 179.371 471.076 179.027 472.694 178.341C474.335 177.632 475.509 176.923 476.216 176.214L477.276 175.151ZM460.111 144.239C460.111 145.497 460.636 146.972 461.684 148.665C462.733 150.357 463.77 151.741 464.796 152.816L466.403 154.428C466.585 154.291 466.836 154.097 467.155 153.845C467.497 153.594 468.067 153.079 468.865 152.301C469.662 151.524 470.358 150.746 470.95 149.968C471.566 149.191 472.124 148.276 472.626 147.224C473.15 146.171 473.412 145.177 473.412 144.239C473.412 142.455 472.774 140.957 471.497 139.744C470.244 138.532 468.659 137.926 466.745 137.926C464.853 137.926 463.268 138.532 461.992 139.744C460.738 140.957 460.111 142.455 460.111 144.239Z" fill="white"/>
<path d="M543.83 149.522V154.085H535.761V183.247H530.871V154.085H525.606V149.522H530.871V143.21C530.871 140.076 531.669 137.652 533.265 135.936C534.883 134.221 537.117 133.363 539.966 133.363C540.81 133.363 541.642 133.454 542.462 133.637C543.283 133.82 543.898 134.003 544.309 134.186L544.856 134.427V138.99C543.465 138.281 541.949 137.926 540.308 137.926C537.276 137.926 535.761 139.687 535.761 143.21V149.522H543.83Z" fill="white"/>
<path d="M568.012 163.932L580.971 161.805C580.971 159.312 580.184 157.287 578.612 155.732C577.039 154.177 575.021 153.399 572.56 153.399C570.782 153.399 569.106 153.811 567.533 154.634C565.983 155.435 564.855 156.258 564.148 157.104L563.088 158.305L559.943 155.149C560.079 154.966 560.262 154.737 560.49 154.463C560.74 154.165 561.265 153.662 562.063 152.953C562.883 152.221 563.738 151.569 564.627 150.998C565.516 150.426 566.679 149.923 568.115 149.488C569.573 149.031 571.055 148.802 572.56 148.802C576.389 148.802 579.557 150.048 582.065 152.541C584.595 155.034 585.86 158.122 585.86 161.805V183.247H580.971V178.684C580.88 178.822 580.731 179.016 580.526 179.268C580.344 179.496 579.911 179.919 579.227 180.537C578.566 181.132 577.848 181.669 577.073 182.15C576.298 182.607 575.272 183.019 573.996 183.385C572.742 183.751 571.443 183.934 570.098 183.934C566.747 183.934 563.92 182.939 561.618 180.949C559.339 178.959 558.199 176.683 558.199 174.121C558.199 171.308 559.042 169.044 560.729 167.328C562.416 165.59 564.844 164.458 568.012 163.932ZM570.098 179.371C573.266 179.371 575.865 178.33 577.893 176.248C579.945 174.167 580.971 171.468 580.971 168.152V166.025L569.414 168.152C565.22 168.952 563.111 170.942 563.088 174.121C563.088 175.631 563.704 176.889 564.935 177.895C566.188 178.879 567.909 179.371 570.098 179.371Z" fill="white"/>
<path d="M615.034 157.31C612.595 159.895 611.376 162.925 611.376 166.402C611.376 169.856 612.595 172.886 615.034 175.494C617.496 178.078 620.243 179.371 623.275 179.371C626.169 179.371 628.757 178.113 631.036 175.597C633.338 173.058 634.49 169.993 634.49 166.402C634.49 162.788 633.338 159.723 631.036 157.207C628.757 154.669 626.169 153.399 623.275 153.399C620.243 153.399 617.496 154.703 615.034 157.31ZM611.376 134.049V154.806C611.467 154.669 611.626 154.463 611.854 154.188C612.105 153.891 612.595 153.399 613.325 152.713C614.077 152.027 614.886 151.421 615.752 150.895C616.618 150.346 617.724 149.865 619.069 149.454C620.437 149.019 621.839 148.802 623.275 148.802C627.56 148.802 631.31 150.529 634.524 153.982C637.761 157.436 639.379 161.576 639.379 166.402C639.379 171.205 637.772 175.334 634.558 178.787C631.344 182.218 627.583 183.934 623.275 183.934C621.839 183.934 620.448 183.728 619.103 183.316C617.781 182.904 616.664 182.413 615.752 181.841C614.841 181.269 614.043 180.697 613.359 180.125C612.698 179.531 612.208 179.027 611.889 178.616L611.376 177.964V183.247H606.486V134.049H611.376Z" fill="white"/>
<path d="M674.742 148.802V153.742H672.622C669.727 153.742 667.254 154.749 665.202 156.761C663.151 158.774 662.125 161.393 662.125 164.618V183.247H657.235V149.522H662.125V154.085C662.216 153.948 662.353 153.765 662.535 153.536C662.718 153.285 663.151 152.862 663.835 152.267C664.518 151.649 665.248 151.112 666.023 150.654C666.821 150.174 667.869 149.751 669.169 149.385C670.491 148.996 671.881 148.802 673.34 148.802H674.742Z" fill="white"/>
<path d="M690.478 183.247V149.522H695.368V183.247H690.478ZM690.649 140.533C690.057 139.916 689.76 139.161 689.76 138.269C689.76 137.377 690.057 136.634 690.649 136.039C691.265 135.422 692.017 135.113 692.906 135.113C693.795 135.113 694.536 135.422 695.128 136.039C695.744 136.634 696.052 137.377 696.052 138.269C696.052 139.161 695.744 139.916 695.128 140.533C694.536 141.128 693.795 141.425 692.906 141.425C692.017 141.425 691.265 141.128 690.649 140.533Z" fill="white"/>
<path d="M718.216 178.822C714.911 175.391 713.258 171.239 713.258 166.368C713.258 161.496 714.911 157.356 718.216 153.948C721.544 150.517 725.488 148.802 730.047 148.802C732.668 148.802 735.107 149.374 737.364 150.517C739.643 151.638 741.273 152.759 742.253 153.879L743.724 155.492L740.202 158.991C740.111 158.854 739.974 158.66 739.792 158.408C739.609 158.157 739.199 157.699 738.561 157.036C737.945 156.372 737.273 155.801 736.543 155.32C735.814 154.817 734.868 154.371 733.705 153.982C732.543 153.594 731.323 153.399 730.047 153.399C726.833 153.399 724.04 154.657 721.67 157.173C719.322 159.666 718.148 162.742 718.148 166.402C718.148 170.039 719.322 173.115 721.67 175.631C724.04 178.124 726.833 179.371 730.047 179.371C732.007 179.371 733.865 178.902 735.62 177.964C737.375 177.026 738.652 176.088 739.45 175.151L740.578 173.778L744.066 176.935C743.929 177.118 743.712 177.381 743.416 177.724C743.142 178.044 742.55 178.604 741.638 179.405C740.726 180.183 739.769 180.88 738.766 181.498C737.763 182.092 736.464 182.653 734.868 183.179C733.295 183.682 731.688 183.934 730.047 183.934C725.465 183.934 721.522 182.23 718.216 178.822Z" fill="white"/>
<path d="M781.172 153.399L777.65 156.899C777.468 156.624 777.195 156.304 776.83 155.938C776.488 155.549 775.679 155.034 774.402 154.394C773.126 153.731 771.758 153.399 770.299 153.399C768.43 153.399 766.914 153.891 765.752 154.874C764.589 155.858 764.008 157.001 764.008 158.305C764.008 159.655 764.635 160.741 765.888 161.564C767.142 162.388 768.658 163.051 770.436 163.554C772.214 164.035 773.992 164.595 775.77 165.236C777.548 165.853 779.064 166.882 780.317 168.323C781.571 169.741 782.198 171.56 782.198 173.778C782.198 176.683 781.092 179.108 778.881 181.052C776.67 182.973 773.695 183.934 769.957 183.934C768.362 183.934 766.857 183.728 765.444 183.316C764.053 182.904 762.902 182.413 761.99 181.841C761.079 181.269 760.281 180.697 759.597 180.125C758.936 179.531 758.446 179.027 758.127 178.616L757.682 177.964L761.204 174.464C761.295 174.602 761.421 174.785 761.58 175.013C761.74 175.219 762.093 175.608 762.64 176.18C763.21 176.729 763.814 177.232 764.452 177.689C765.091 178.124 765.911 178.513 766.914 178.856C767.917 179.199 768.931 179.371 769.957 179.371C772.328 179.371 774.14 178.844 775.394 177.792C776.67 176.74 777.308 175.402 777.308 173.778C777.308 172.383 776.67 171.251 775.394 170.382C774.14 169.49 772.624 168.792 770.846 168.289C769.091 167.763 767.324 167.191 765.546 166.574C763.768 165.933 762.241 164.938 760.965 163.589C759.711 162.216 759.084 160.455 759.084 158.305C759.084 155.766 760.144 153.548 762.264 151.649C764.407 149.751 767.085 148.802 770.299 148.802C771.598 148.802 772.864 148.962 774.094 149.282C775.348 149.579 776.374 149.957 777.172 150.414C777.97 150.849 778.676 151.306 779.292 151.787C779.93 152.244 780.386 152.61 780.659 152.884L781.172 153.399Z" fill="white"/>
</svg>
