CREATE EXTENSION hello_world;
\df
                                List of functions
 Schema |       Name        | Result data type |   Argument data types    | Type 
--------+-------------------+------------------+--------------------------+------
 public | hello_param       | text             | text                     | func
 public | hello_world_arr   | text[]           |                          | func
 public | hello_world_row   | SETOF record     | OUT f1 text, OUT f2 text | func
 public | hello_world_value | text             |                          | func
 public | hello_world_warn  | void             |                          | func
(5 rows)

