:020000020000FC
:10000000E4EBF0E043E00FE502E00EBF0DC04395E6
:100010004030F1F0413001F1423011F1433021F133
:10002000443031F1453041F1C8953196602D64314D
:1000300071F34A95403061F0413071F0423081F007
:10004000433091F04430A1F04530B1F00FEF06B9E4
:1000500010E017B927D0E8CF10E817B923D0E4CFC4
:1000600010EC17B91FD0E0CF10EE17B91BD0DCCFC2
:1000700010EF17B917D0D8CF18EF17B913D0739561
:1000800040E0E6CFFFCF26E031E33A95F1F72A953D
:10009000E1F7089524E332EF3A95F1F72A95E1F775
:1000A0000000089520ED3AEC3A95F1F72A95E1F732
:0800B00000000895141414006F
:00000001FF
