Loaded plugin tf.tfwtf
Package: wfram
================================================================================
Static checks summary:

No errors or warnings
================================================================================

ROS Master does not appear to be running.
Online graph checks will not be run.
ROS_MASTER_URI is [http://localhost:11311]