<svg width="120" height="27" viewBox="0 0 120 27" fill="none" xmlns="http://www.w3.org/2000/svg">
<path d="M30.5211 16.2094C30.5211 14.5007 30.8821 12.9207 31.6157 11.4577C32.3377 9.9948 33.409 8.73082 34.7948 7.64239C35.8312 6.83485 36.9607 6.22627 38.1601 5.79324C39.3595 5.36021 40.5706 5.14955 41.7933 5.14955C43.3537 5.14955 44.8559 5.48895 46.3115 6.17945C47.7671 6.86996 49.0364 7.82965 50.131 9.08193C51.9127 11.1183 52.7977 13.4239 52.7977 16.0104C52.7977 17.3095 52.5648 18.5618 52.099 19.7789C51.6332 20.9844 50.9578 22.0845 50.0728 23.091C48.9782 24.3316 47.6972 25.2913 46.2067 25.9701C44.7162 26.6489 43.1558 26.9883 41.5371 26.9883C39.9185 26.9883 38.393 26.6606 36.9258 25.9935C35.4585 25.3381 34.2009 24.4018 33.1412 23.1847C32.3028 22.2367 31.6623 21.1717 31.2082 19.9662C30.754 18.7607 30.5328 17.5085 30.5328 16.2094H30.5211ZM34.1892 16.4434C34.1892 19.3927 34.9811 21.8739 36.5881 23.8986C37.31 24.7997 38.067 25.4551 38.8705 25.8765C39.6739 26.2861 40.5939 26.4967 41.6536 26.4967C42.7132 26.4967 43.6448 26.2978 44.4483 25.8882C45.2518 25.4785 46.0204 24.8231 46.7424 23.9103C48.3377 21.8739 49.1412 19.3693 49.1412 16.3966C49.1412 14.7581 48.9199 13.2133 48.4774 11.762C48.0349 10.2991 47.4178 9.07022 46.6259 8.05202C45.9738 7.22107 45.2635 6.61248 44.4716 6.22627C43.6798 5.84005 42.7365 5.6528 41.6652 5.6528C40.5939 5.6528 39.6623 5.84005 38.8821 6.21456C38.1019 6.58908 37.3799 7.19766 36.7045 8.04031C35.901 9.04681 35.2955 10.2757 34.853 11.7386C34.4221 13.2016 34.2009 14.7698 34.2009 16.4434H34.1892Z" fill="white"/>
<path d="M54.9636 26.1105C55.5459 26.0754 56.0233 25.9935 56.3843 25.8648C56.7453 25.7243 57.0597 25.5137 57.3275 25.2328C57.6536 24.9051 57.8632 24.4954 57.9796 24.0039C58.0961 23.5124 58.1427 22.7399 58.1427 21.6866V10.4629C58.1427 9.42133 58.0844 8.6489 57.9796 8.14564C57.8632 7.6541 57.6536 7.23277 57.3275 6.91678C57.0597 6.62419 56.7336 6.41352 56.3726 6.27308C56.0116 6.14434 55.5342 6.06242 54.9636 6.02731V5.6762H64.9199C65.933 5.6762 66.5968 5.6762 66.8996 5.71131C68.0524 5.80494 69.0073 6.07412 69.7642 6.53056C70.4163 6.94018 70.9287 7.46684 71.2897 8.13394C71.6507 8.78934 71.8253 9.53836 71.8253 10.3576C71.8253 11.6918 71.4178 12.7802 70.6026 13.6346C70.3115 13.9506 69.9738 14.2081 69.6012 14.4187C69.2285 14.6294 68.6929 14.8635 67.9825 15.1092C68.9491 15.2731 69.706 15.4486 70.2416 15.6476C70.7773 15.8349 71.2664 16.104 71.6972 16.4551C72.3377 16.9818 72.8501 17.6372 73.1994 18.4213C73.5604 19.2055 73.7351 20.0598 73.7351 20.9727C73.7351 21.8856 73.5488 22.7399 73.1878 23.5124C72.8151 24.2848 72.3028 24.8934 71.6507 25.3615C71.0568 25.7828 70.3464 26.0637 69.5197 26.2276C68.6929 26.3914 67.54 26.4733 66.0378 26.4733H54.9636V26.1105ZM61.4614 15.2029H62.6841C63.2547 15.2029 63.8603 15.1678 64.4774 15.0858C65.0131 15.0039 65.444 14.9103 65.77 14.7932C66.0961 14.6762 66.3988 14.5241 66.6667 14.3368C67.179 13.9506 67.575 13.459 67.8544 12.8505C68.1339 12.2419 68.2737 11.5748 68.2737 10.8492C68.2737 10.0767 68.1339 9.3394 67.8428 8.6489C67.5517 7.95839 67.179 7.40832 66.7016 7.02211C66.2824 6.6827 65.8166 6.46034 65.2809 6.3316C64.7453 6.21456 63.9418 6.14434 62.8705 6.14434H61.4614V15.2029ZM61.4614 15.671V21.9441C61.4614 22.7048 61.5197 23.3251 61.6245 23.7815C61.7293 24.2497 61.9039 24.6476 62.1485 24.9636C62.6609 25.6424 63.5459 25.9818 64.8035 25.9818C66.4338 25.9818 67.7147 25.5371 68.6579 24.6476C69.6012 23.7581 70.0786 22.541 70.0786 20.9961C70.0786 20.1183 69.9272 19.2874 69.6361 18.5384C69.345 17.7776 68.9491 17.2042 68.46 16.7945C67.5517 16.0455 66.131 15.671 64.1863 15.671H61.4614Z" fill="white"/>
<path d="M85.31 5.6762V6.02731C84.7394 6.06242 84.262 6.14434 83.901 6.27308C83.54 6.40182 83.214 6.61248 82.9461 6.91678C82.6084 7.26788 82.3988 7.68921 82.2824 8.19246C82.1776 8.69571 82.1194 9.57347 82.1194 10.814V19.4278C82.1194 20.8323 82.1776 21.8388 82.2824 22.4707C82.3872 23.091 82.6084 23.6762 82.9229 24.2029C83.4119 25.0104 84.0058 25.5839 84.7162 25.9467C85.4265 26.3095 86.3231 26.485 87.4061 26.485C88.4891 26.485 89.4556 26.3212 90.4105 26.0052C91.3654 25.6892 92.1572 25.2445 92.7977 24.671C93.1936 24.3199 93.4847 23.9337 93.671 23.5124C93.8573 23.091 93.9854 22.5644 94.0437 21.9324C94.0786 21.5111 94.1019 20.528 94.1019 18.9831V10.4746C94.1019 9.43303 94.0437 8.6606 93.9272 8.15735C93.8108 7.6658 93.6012 7.24447 93.2868 6.92848C93.0073 6.63589 92.6812 6.42523 92.3202 6.28479C91.9592 6.15605 91.4934 6.07412 90.9229 6.03901V5.68791H97.9098V6.03901C97.3391 6.07412 96.8617 6.15605 96.5124 6.28479C96.1514 6.41352 95.837 6.62419 95.5459 6.92848C95.2314 7.25618 95.0218 7.6658 94.9054 8.16905C94.7889 8.6723 94.7307 9.44473 94.7307 10.4746V20.0832C94.7307 21.4993 94.6259 22.5527 94.4047 23.2315C94.1834 23.9103 93.7525 24.5189 93.1121 25.0806C91.6332 26.3563 89.5371 27 86.7889 27C84.0408 27 81.8282 26.3914 80.4658 25.186C79.5924 24.4135 79.0568 23.3953 78.8937 22.143C78.8355 21.6983 78.8006 20.8908 78.8006 19.7204V10.4746C78.8006 9.43303 78.7424 8.6606 78.6376 8.15735C78.5211 7.6658 78.3115 7.24447 77.9855 6.92848C77.7176 6.63589 77.3916 6.42523 77.0422 6.28479C76.6812 6.15605 76.2154 6.07412 75.6215 6.03901V5.68791H85.2984L85.31 5.6762Z" fill="white"/>
<path d="M97.9447 5.6762H107.948V6.02731C107.191 6.09753 106.643 6.21456 106.317 6.37841C106.003 6.53056 105.747 6.76463 105.56 7.08062C105.374 7.39662 105.269 7.74772 105.269 8.12224C105.269 8.39142 105.293 8.62549 105.351 8.82445C105.397 9.02341 105.549 9.46814 105.805 10.1469L110.288 22.4005L114.632 11.6567C115.237 10.1469 115.54 9.04681 115.54 8.35631C115.54 7.97009 115.482 7.60728 115.354 7.27958C115.237 6.94018 115.074 6.6827 114.865 6.50715C114.667 6.3316 114.445 6.21456 114.201 6.14434C113.956 6.07412 113.642 6.03901 113.258 6.03901V5.68791H120V6.03901C119.441 6.08583 118.964 6.22627 118.556 6.44864C118.148 6.671 117.753 7.0104 117.38 7.46684C117.124 7.79454 116.868 8.23927 116.588 8.80104C116.309 9.36281 115.924 10.2406 115.447 11.4109L109.24 26.4733H108.6L102.568 10.9077C101.776 8.87126 101.147 7.57217 100.67 7.02211C100.367 6.6827 99.9942 6.42523 99.5517 6.27308C99.1092 6.12094 98.5735 6.03901 97.933 6.03901V5.68791L97.9447 5.6762Z" fill="white"/>
<path d="M20.2271 23.4421C14.0786 23.1964 10.7598 13.0143 10.5619 12.3823C10.4221 12.0312 7.40611 4.45904 2.65502 4.45904H0.197962C1.42067 4.95059 3.64483 6.37841 3.64483 10.3108C3.64483 15.3667 3.64483 21.3472 3.64483 21.3472V24.3082C3.64483 24.4486 3.63319 25.1157 3.0393 25.7594C2.41048 26.4382 1.39738 26.8479 0 26.9532V26.9883H8.09316V26.9532C6.69578 26.8362 5.68268 26.4382 5.05386 25.7594C4.45997 25.1157 4.44833 24.4486 4.44833 24.3082V13.6229C4.44833 12.7802 4.89083 11.5514 5.83406 11.5514C6.19505 11.5514 6.55604 11.7386 6.90539 12.1248C7.54585 12.8388 8.34935 14.9103 9.49054 18C10.1077 19.6619 10.6783 21.2185 11.0975 22.0494C12.262 24.355 14.4396 26.9883 20.9723 26.9883H26.8646C26.2009 25.8531 24.3843 23.606 20.2504 23.4421H20.2271Z" fill="white"/>
<path d="M18.8763 0V0.0351105C20.2737 0.152146 21.2868 0.550065 21.9156 1.22887C22.5095 1.87256 22.5211 2.53966 22.5211 2.6801V13.3654C22.5211 14.2081 22.0786 15.4369 21.1354 15.4369C20.7744 15.4369 20.4134 15.238 20.064 14.8635C19.4236 14.1495 18.6201 12.078 17.4789 8.97659C16.8617 7.3264 16.2911 5.75813 15.8719 4.92718C14.7074 2.64499 12.5298 0 6.00873 0H0.104804C0.756914 1.14694 2.55022 3.38231 6.71907 3.54616C12.8675 3.79194 16.1863 13.974 16.3843 14.606C16.524 14.9571 19.54 22.5293 24.2911 22.5293H26.7598C25.5371 22.0377 23.313 20.6099 23.313 16.6775C23.313 11.6216 23.313 5.64109 23.313 5.64109V2.6801C23.313 2.53966 23.3246 1.87256 23.9185 1.22887C24.5473 0.550065 25.5604 0.140442 26.9578 0.0351105V0H18.8646H18.8763Z" fill="white"/>
</svg>
