{
  "$schema": "https://docs.renovatebot.com/renovate-schema.json",
  "extends": ["config:recommended"],
  "packageRules": [
    {
      "matchUpdateTypes": ["patch"],
      "automerge": true,
      "semanticCommitType": "fix"
    },
    {
      "matchUpdateTypes": ["major", "minor", "pin", "digest"],
      "automerge": false
    },
    {
      "matchDepTypes": ["devDependencies"],
      "automerge": true
    }
  ],
  "platformAutomerge": true
}
