{
  "$schema": "https://docs.renovatebot.com/renovate-schema.json",
  "extends": ["config:recommended"],
  "packageRules": [
    {
      "matchUpdateTypes": ["patch"],
      "automerge": true,
      "semanticCommitType": "fix"
    },
    {
      "matchUpdateTypes": ["major", "minor", "pin", "digest"],
      "automerge": false
    },
    {
      "matchDepTypes": ["devDependencies"],
      "automerge": true
    }
  ],
  "platformAutomerge": true,
  "customManagers": [
    {
      "customType": "regex",
      "description": "Detect station helm charts",
      "fileMatch": ["^helm\\/values\\.yaml$"],
      "matchStrings": [
        "image:\\s&default-station-image\\n\\s+registry:\\s(?<registry>.*)\\n\\s+repository:\\s(?<repository>.*)\\n\\s+tag:\\s(?<currentValue>.*)"
      ],
      "depNameTemplate": "{{registry}}/{{repository}}",
      "packageNameTemplate": "{{registry}}/{{repository}}",
      "registryUrlTemplate": "https://{{registry}}/{{repository}}",
      "datasourceTemplate": "docker",
      "depTypeTemplate": "dependencies"
    },
    {
      "customType": "regex",
      "description": "Detect worker helm charts",
      "fileMatch": ["^helm\\/values\\.yaml$"],
      "matchStrings": [
        "'(?<workerName>[a-zA-Z0-9_-]+)':\\n\\s+image:\\n\\s+registry:\\s(?<registry>.*)\\n\\s+repository:\\s(?<repository>.*)\\n\\s+tag:\\s(?<currentValue>.*)"
      ],
      "depNameTemplate": "{{registry}}/{{repository}}",
      "registryUrlTemplate": "https://{{registry}}/{{repository}}",
      "datasourceTemplate": "docker",
      "depTypeTemplate": "dependencies"
    }
  ]
}
