{
  "@context": "http://clowder.ncsa.illinois.edu/contexts/extractors.jsonld",
  "name": "t2c2.hyperspydm3",
  "version": "2.0",
  "description": "WordCount extractor. Counts the number of characters, words and lines in the text file that was uploaded.",
  "author": "Rob Kooper <kooper@illinois.edu>",
  "contributors": [],
  "contexts": [
    {
      "lines": "http://clowder.ncsa.illinois.edu/metadata/ncsa.wordcount#lines",
      "words": "http://clowder.ncsa.illinois.edu/metadata/ncsa.wordcount#words",
      "characters": "http://clowder.ncsa.illinois.edu/metadata/ncsa.wordcount#characters"
    }
  ],
  "repository": {
    "repType": "git",
    "repUrl": "https://opensource.ncsa.illinois.edu/stash/scm/cats/pyclowder.git"
  },
  "process": {
    "file": [
      "image/*",
      "application/json"
    ]
  },
  "external_services": [],
  "dependencies": [],
  "bibtex": []
}
