{
    "@context": "http://clowder.ncsa.illinois.edu/contexts/extractors.jsonld",
    "name": "rbs.spe.extractor",
    "version": "2.0.0",
    "description": "Processed SIMS SPE files",
    "author": "",
    "contributors": [""],
    "contexts": [],
    "repository": [
        {
            "repType": "git",
            "repUrl": "https://opensource.ncsa.illinois.edu/bitbucket/scm/cats/extractors-core.git"
        },
        {
            "repType": "docker",
            "repUrl": "clowder/extractors-image-metadata"
        }
    ],
    "external_services": [],
    "dependencies": ["imagemagick", "ufraw-batch"],
    "process": {
      "file": [
        "application/simsspe"
      ]
    },
    "bibtex": [""]
}