#FIG 3.2  Produced by xfig version 3.2.8b
Landscape
Center
Metric
A4
100.00
Single
-2
1200 2
1 3 0 1 0 0 35 -1 20 0.000 1 0.0000 3825 3735 23 23 3825 3735 3848 3735
1 3 0 1 9 9 35 -1 20 0.000 1 0.0000 4545 4725 23 23 4545 4725 4568 4725
1 3 0 1 9 9 35 -1 20 0.000 1 0.0000 3401 4049 23 23 3401 4049 3424 4049
2 1 0 1 0 7 45 -1 -1 0.000 0 0 -1 1 0 2
	2 1 1.00 60.00 90.00
	 2250 3375 3600 3150
2 1 0 1 0 7 45 -1 -1 0.000 0 0 -1 1 0 2
	2 1 1.00 60.00 90.00
	 2250 3375 2250 2250
2 3 0 1 0 7 37 -1 -1 0.000 0 0 -1 0 0 5
	 3150 4320 4500 4095 4500 3195 3150 3420 3150 4320
2 2 0 1 7 7 40 -1 20 0.000 0 0 -1 0 0 5
	 3825 3600 3150 3600 3150 4050 3825 4050 3825 3600
2 1 0 1 0 7 37 -1 -1 0.000 0 0 -1 1 0 2
	2 1 1.00 45.00 60.00
	 3825 3735 3825 3375
2 1 0 1 0 7 37 -1 -1 0.000 0 0 -1 1 0 2
	2 1 1.00 45.00 60.00
	 3825 3735 4275 3645
2 1 0 2 9 7 45 -1 -1 0.000 0 0 -1 1 0 2
	2 1 1.00 60.00 90.00
	 2250 3375 4545 4725
2 1 0 1 0 7 45 -1 -1 0.000 0 0 -1 1 0 2
	2 1 1.00 60.00 90.00
	 2250 3375 5175 4050
2 2 0 1 7 7 40 -1 20 0.000 0 0 -1 0 0 5
	 3825 3465 3150 3465 3150 3915 3825 3915 3825 3465
4 0 0 30 -1 0 12 0.0000 6 165 990 2160 2160 $\\vb{Y}_c$\001
4 0 0 30 -1 0 12 0.0000 6 135 630 2610 2565 C frame\001
4 0 0 30 -1 0 12 0.0000 6 180 1200 3870 3465 $\\vb{y}_{m}$\001
4 0 0 30 -1 0 12 0.0000 6 165 540 2070 3555 $O_c$\001
4 0 0 30 -1 0 12 0.0000 6 180 765 3780 3915 $\\vb{p}$\001
4 0 0 30 -1 0 12 0.0000 6 165 990 3645 3195 $\\vb{X}_c$\001
4 0 0 30 -1 0 12 0.0000 6 180 2190 5220 4140 $\\vb{Z}_c$: principal axis\001
4 0 0 30 -1 0 12 0.0000 6 165 1200 4185 3600 $\\vb{x}_{m}$\001
4 0 9 30 -1 0 12 0.0000 6 165 765 4590 4860 $\\vb{v}$\001
4 0 9 30 -1 0 12 0.0000 6 165 765 3330 3960 $\\vb{x}$\001
4 0 0 25 -1 0 10 0.0000 6 165 840 2790 4500 image plane\001
4 0 0 25 -1 0 10 0.0000 6 165 1740 5220 4320 (along camera boresight)\001
4 0 0 25 -1 0 10 0.0000 6 90 960 1645 3690 camera center\001
