#FIG 3.2  Produced by xfig version 3.2.8b
Landscape
Center
Metric
A4
100.00
Single
-2
1200 2
2 1 0 2 0 7 45 -1 -1 0.000 0 0 -1 1 0 2
	2 1 2.00 60.00 90.00
	 3060 4410 2340 4860
2 1 0 2 0 7 45 -1 -1 0.000 0 0 -1 1 0 2
	2 1 2.00 60.00 90.00
	 3060 4410 4050 4410
2 1 0 2 0 7 45 -1 -1 0.000 0 0 -1 1 0 2
	2 1 2.00 60.00 90.00
	 3060 4410 3060 3690
4 0 0 45 -1 -1 12 0.0000 6 135 615 2070 3780 L frame\001
4 0 0 45 -1 -1 10 0.0000 6 150 930 3150 3825 $\\vb{z}$: Up\001
4 0 0 45 -1 -1 10 0.0000 6 135 1020 2160 4995 $\\vb{x}$: East\001
4 0 0 45 -1 -1 10 0.0000 6 150 1140 4095 4455 $\\vb{y}$: North\001
