{
  "FTP_SERVER": "10.132.48.74",
  "CREM_FTP_ACCOUNT": "crem",
  "CREM_FTP_PASSWD": "crem",

  "EDI_FTP_ACCOUNT": "ROPuser",
  "EDI_FTP_PASSWD": "ROPuser",
  "EDI_FTP_DIR": "SmartOpsROP_report",

  "PACKOUT_DRIVER": "FreeTDS",
  "PACKOUT_SERVER": "10.132.44.149",
  "PACKOUT_SERVER_PORT": "3000",
  "PACKOUT_DATABASE": "NSG_ROP_Consumption",
  "PACKOUT_UID": "ODIN",
  "PACKOUT_PASSWD": "ODIN",
  
  "LOCAL_DEV_USER": "root",
  "LOCAL_DEV_PASSWD": "123",
  "LOCAL_DEV_SERVER": "localhost",

  "STAGING_DEV_USER": "gondang_dev",
  "STAGING_DEV_PASSWD": "Foxconn88",
  "STAGING_DEV_SERVER": "10.132.53.202:8876",

  "PROD_DEV_USER": "gondang_dev",
  "PROD_DEV_PASSWD": "Foxconn88",
  "PROD_DEV_SERVER": "10.124.131.87:8876",

  "ROP_FTP_ACCOUNT": "cnsbg_ftp",
  "ROP_FTP_PASSWD": "cnftp#888",
  "ROP_FTP_DIR": "/DDLT/report/SmartOpsROP_report",

  "QUOTA_FTP_ACCOUNT": "cnsbg_ftp",
  "QUOTA_FTP_PASSWD": "cnftp#888",
  "QUOTA_FTP_DIR": "/DDLT/SAP800/Quota"
}
  