<?xml version="1.0" encoding="UTF-8"?>
<svg xmlns="http://www.w3.org/2000/svg" xmlns:xlink="http://www.w3.org/1999/xlink" width="504pt" height="504pt" viewBox="0 0 504 504" version="1.1">
<defs>
<g>
<symbol overflow="visible" id="glyph0-0">
<path style="stroke:none;" d=""/>
</symbol>
<symbol overflow="visible" id="glyph0-1">
<path style="stroke:none;" d="M 3.625 0 L 3.625 -17.5 L 1.625 -17.5 L 1.625 0 Z M 3.625 0 "/>
</symbol>
<symbol overflow="visible" id="glyph0-2">
<path style="stroke:none;" d="M 12.234375 -6.1875 C 12.234375 -10.53125 10.15625 -12.9375 6.53125 -12.9375 C 3 -12.9375 0.859375 -10.515625 0.859375 -6.28125 C 0.859375 -2.0625 2.96875 0.359375 6.546875 0.359375 C 10.078125 0.359375 12.234375 -2.0625 12.234375 -6.1875 Z M 10.15625 -6.21875 C 10.15625 -3.265625 8.765625 -1.484375 6.546875 -1.484375 C 4.3125 -1.484375 2.953125 -3.234375 2.953125 -6.28125 C 2.953125 -9.3125 4.3125 -11.09375 6.546875 -11.09375 C 8.8125 -11.09375 10.15625 -9.34375 10.15625 -6.21875 Z M 10.15625 -6.21875 "/>
</symbol>
<symbol overflow="visible" id="glyph0-3">
<path style="stroke:none;" d="M 11.734375 -2.0625 L 11.734375 -12.578125 L 9.890625 -12.578125 L 9.890625 -10.75 C 8.875 -12.234375 7.65625 -12.9375 6.046875 -12.9375 C 2.859375 -12.9375 0.703125 -10.25 0.703125 -6.171875 C 0.703125 -2.203125 2.921875 0.359375 5.875 0.359375 C 7.46875 0.359375 8.5625 -0.3125 9.890625 -1.890625 L 9.890625 -1.0625 C 9.890625 2.28125 8.515625 3.546875 6.1875 3.546875 C 4.609375 3.546875 3.390625 2.96875 3.140625 1.4375 L 1.109375 1.4375 C 1.3125 3.8125 3.171875 5.234375 6.125 5.234375 C 10.0625 5.234375 11.734375 3.484375 11.734375 -2.0625 Z M 9.703125 -6.21875 C 9.703125 -3.21875 8.40625 -1.484375 6.28125 -1.484375 C 4.109375 -1.484375 2.78125 -3.234375 2.78125 -6.28125 C 2.78125 -9.3125 4.125 -11.09375 6.265625 -11.09375 C 8.421875 -11.09375 9.703125 -9.265625 9.703125 -6.21875 Z M 9.703125 -6.21875 "/>
</symbol>
<symbol overflow="visible" id="glyph0-4">
<path style="stroke:none;" d="M 11.65625 0 L 11.65625 -9.5 C 11.65625 -11.609375 10.15625 -12.9375 7.703125 -12.9375 C 5.921875 -12.9375 4.84375 -12.390625 3.671875 -10.84375 L 3.671875 -17.5 L 1.6875 -17.5 L 1.6875 0 L 3.671875 0 L 3.671875 -6.9375 C 3.671875 -9.5 5.015625 -11.1875 7.078125 -11.1875 C 8.5 -11.1875 9.671875 -10.375 9.671875 -8.71875 L 9.671875 0 Z M 11.65625 0 "/>
</symbol>
<symbol overflow="visible" id="glyph0-5">
<path style="stroke:none;" d="M 12.3125 -5.71875 C 12.3125 -7.53125 12.171875 -8.6875 11.8125 -9.625 C 10.984375 -11.6875 9.078125 -12.9375 6.71875 -12.9375 C 3.21875 -12.9375 0.953125 -10.34375 0.953125 -6.21875 C 0.953125 -2.09375 3.140625 0.359375 6.671875 0.359375 C 9.546875 0.359375 11.546875 -1.265625 12.046875 -3.8125 L 10.03125 -3.8125 C 9.484375 -2.15625 8.359375 -1.484375 6.75 -1.484375 C 4.65625 -1.484375 3.09375 -2.828125 3.046875 -5.71875 Z M 10.171875 -7.484375 C 10.171875 -7.484375 10.171875 -7.390625 10.15625 -7.34375 L 3.09375 -7.34375 C 3.265625 -9.578125 4.6875 -11.09375 6.703125 -11.09375 C 8.65625 -11.09375 10.171875 -9.453125 10.171875 -7.484375 Z M 10.171875 -7.484375 "/>
</symbol>
<symbol overflow="visible" id="glyph0-6">
<path style="stroke:none;" d="M 7.703125 -10.828125 L 7.703125 -12.859375 C 7.375 -12.90625 7.203125 -12.9375 6.9375 -12.9375 C 5.640625 -12.9375 4.65625 -12.171875 3.5 -10.296875 L 3.5 -12.578125 L 1.6875 -12.578125 L 1.6875 0 L 3.671875 0 L 3.671875 -6.53125 C 3.671875 -9.359375 4.609375 -10.78125 7.703125 -10.828125 Z M 7.703125 -10.828125 "/>
</symbol>
<symbol overflow="visible" id="glyph0-7">
<path style="stroke:none;" d="M 6.1875 -10.9375 L 6.1875 -12.578125 L 4.109375 -12.578125 L 4.109375 -14.546875 C 4.109375 -15.390625 4.578125 -15.8125 5.5 -15.8125 C 5.65625 -15.8125 5.734375 -15.8125 6.1875 -15.796875 L 6.1875 -17.453125 C 5.734375 -17.546875 5.46875 -17.5625 5.0625 -17.5625 C 3.21875 -17.5625 2.109375 -16.515625 2.109375 -14.71875 L 2.109375 -12.578125 L 0.4375 -12.578125 L 0.4375 -10.9375 L 2.109375 -10.9375 L 2.109375 0 L 4.109375 0 L 4.109375 -10.9375 Z M 6.1875 -10.9375 "/>
</symbol>
<symbol overflow="visible" id="glyph0-8">
<path style="stroke:none;" d="M 4.578125 0 L 4.578125 -2.5 L 2.09375 -2.5 L 2.09375 0 Z M 4.578125 0 "/>
</symbol>
<symbol overflow="visible" id="glyph0-9">
<path style="stroke:none;" d=""/>
</symbol>
<symbol overflow="visible" id="glyph0-10">
<path style="stroke:none;" d="M 3.671875 0 L 3.671875 -12.578125 L 1.6875 -12.578125 L 1.6875 0 Z M 3.9375 -14.46875 L 3.9375 -16.96875 L 1.4375 -16.96875 L 1.4375 -14.46875 Z M 3.9375 -14.46875 "/>
</symbol>
<symbol overflow="visible" id="glyph0-11">
<path style="stroke:none;" d="M 11.6875 0 L 11.6875 -9.5 C 11.6875 -11.59375 10.125 -12.9375 7.703125 -12.9375 C 5.828125 -12.9375 4.625 -12.21875 3.53125 -10.46875 L 3.53125 -12.578125 L 1.6875 -12.578125 L 1.6875 0 L 3.671875 0 L 3.671875 -6.9375 C 3.671875 -9.5 5.0625 -11.1875 7.109375 -11.1875 C 8.6875 -11.1875 9.703125 -10.21875 9.703125 -8.71875 L 9.703125 0 Z M 11.6875 0 "/>
</symbol>
<symbol overflow="visible" id="glyph0-12">
<path style="stroke:none;" d="M 6.984375 5.09375 C 4.875 1.65625 3.703125 -2.375 3.703125 -6.21875 C 3.703125 -10.03125 4.875 -14.09375 6.984375 -17.5 L 5.65625 -17.5 C 3.265625 -14.359375 1.75 -9.984375 1.75 -6.21875 C 1.75 -2.421875 3.265625 1.9375 5.65625 5.09375 Z M 6.984375 5.09375 "/>
</symbol>
<symbol overflow="visible" id="glyph0-13">
<path style="stroke:none;" d="M 11.015625 -3.53125 C 11.015625 -5.40625 9.953125 -6.34375 7.46875 -6.9375 L 5.546875 -7.390625 C 3.90625 -7.78125 3.21875 -8.296875 3.21875 -9.1875 C 3.21875 -10.34375 4.25 -11.09375 5.875 -11.09375 C 7.484375 -11.09375 8.359375 -10.390625 8.40625 -9.078125 L 10.515625 -9.078125 C 10.484375 -11.546875 8.859375 -12.9375 5.953125 -12.9375 C 3.03125 -12.9375 1.125 -11.421875 1.125 -9.09375 C 1.125 -7.125 2.140625 -6.1875 5.109375 -5.46875 L 6.984375 -5.015625 C 8.375 -4.6875 8.921875 -4.265625 8.921875 -3.359375 C 8.921875 -2.1875 7.75 -1.484375 6 -1.484375 C 4.203125 -1.484375 3.1875 -1.921875 2.921875 -3.84375 L 0.8125 -3.84375 C 0.90625 -0.9375 2.546875 0.359375 5.828125 0.359375 C 9 0.359375 11.015625 -1.109375 11.015625 -3.53125 Z M 11.015625 -3.53125 "/>
</symbol>
<symbol overflow="visible" id="glyph0-14">
<path style="stroke:none;" d="M 12.546875 -6.171875 C 12.546875 -10.390625 10.484375 -12.9375 7.15625 -12.9375 C 5.453125 -12.9375 4.078125 -12.171875 3.140625 -10.6875 L 3.140625 -12.578125 L 1.3125 -12.578125 L 1.3125 5.234375 L 3.3125 5.234375 L 3.3125 -1.515625 C 4.375 -0.21875 5.546875 0.359375 7.171875 0.359375 C 10.421875 0.359375 12.546875 -2.15625 12.546875 -6.171875 Z M 10.46875 -6.21875 C 10.46875 -3.359375 9 -1.515625 6.8125 -1.515625 C 4.703125 -1.515625 3.3125 -3.234375 3.3125 -6.1875 C 3.3125 -9.140625 4.703125 -11.0625 6.8125 -11.0625 C 9.03125 -11.0625 10.46875 -9.21875 10.46875 -6.21875 Z M 10.46875 -6.21875 "/>
</symbol>
<symbol overflow="visible" id="glyph0-15">
<path style="stroke:none;" d="M 12.484375 -4.078125 L 12.484375 -5.96875 L 9.953125 -5.96875 L 9.953125 -17.015625 L 8.40625 -17.015625 L 0.671875 -6.3125 L 0.671875 -4.078125 L 7.84375 -4.078125 L 7.84375 0 L 9.953125 0 L 9.953125 -4.078125 Z M 7.84375 -5.96875 L 2.515625 -5.96875 L 7.84375 -13.421875 Z M 7.84375 -5.96875 "/>
</symbol>
<symbol overflow="visible" id="glyph0-16">
<path style="stroke:none;" d="M 6.140625 -6.1875 C 6.140625 -9.984375 4.625 -14.359375 2.234375 -17.5 L 0.90625 -17.5 C 3.03125 -14.0625 4.203125 -10.03125 4.203125 -6.1875 C 4.203125 -2.375 3.03125 1.6875 0.90625 5.09375 L 2.234375 5.09375 C 4.625 1.9375 6.140625 -2.421875 6.140625 -6.1875 Z M 6.140625 -6.1875 "/>
</symbol>
<symbol overflow="visible" id="glyph1-0">
<path style="stroke:none;" d=""/>
</symbol>
<symbol overflow="visible" id="glyph1-1">
<path style="stroke:none;" d="M 8.578125 -8.421875 C 8.578125 -10.4375 7.015625 -11.90625 4.765625 -11.90625 C 2.328125 -11.90625 0.921875 -10.671875 0.84375 -7.78125 L 2.3125 -7.78125 C 2.4375 -9.78125 3.265625 -10.609375 4.71875 -10.609375 C 6.0625 -10.609375 7.078125 -9.65625 7.078125 -8.375 C 7.078125 -7.4375 6.515625 -6.640625 5.453125 -6.03125 L 3.90625 -5.15625 C 1.421875 -3.75 0.703125 -2.625 0.578125 0 L 8.5 0 L 8.5 -1.46875 L 2.234375 -1.46875 C 2.390625 -2.4375 2.921875 -3.0625 4.390625 -3.90625 L 6.0625 -4.828125 C 7.71875 -5.703125 8.578125 -6.953125 8.578125 -8.421875 Z M 8.578125 -8.421875 "/>
</symbol>
<symbol overflow="visible" id="glyph2-0">
<path style="stroke:none;" d=""/>
</symbol>
<symbol overflow="visible" id="glyph2-1">
<path style="stroke:none;" d="M 9 4.65625 C 7.984375 3.953125 7.5 3.515625 6.90625 2.734375 C 5.28125 0.5625 4.34375 -3.1875 4.34375 -7.625 C 4.34375 -11.671875 5.125 -15.265625 6.515625 -17.4375 C 7.171875 -18.453125 7.734375 -19.015625 9 -19.890625 L 8.609375 -20.40625 C 7.234375 -19.6875 6.625 -19.265625 5.84375 -18.546875 C 3.15625 -16.046875 1.59375 -12 1.59375 -7.625 C 1.59375 -3.515625 2.9375 0.265625 5.375 2.796875 C 6.265625 3.78125 6.984375 4.296875 8.609375 5.15625 Z M 9 4.65625 "/>
</symbol>
<symbol overflow="visible" id="glyph2-2">
<path style="stroke:none;" d="M 1.296875 5.15625 C 2.671875 4.40625 3.265625 4.015625 4.046875 3.296875 C 6.71875 0.8125 8.3125 -3.234375 8.3125 -7.625 C 8.3125 -11.734375 6.9375 -15.515625 4.53125 -18.0625 C 3.625 -19.015625 2.90625 -19.5625 1.296875 -20.40625 L 0.90625 -19.890625 C 1.953125 -19.171875 2.40625 -18.75 3 -17.96875 C 4.625 -15.8125 5.546875 -12.0625 5.546875 -7.625 C 5.546875 -3.5625 4.765625 0 3.390625 2.15625 C 2.703125 3.203125 2.125 3.8125 0.90625 4.65625 Z M 1.296875 5.15625 "/>
</symbol>
<symbol overflow="visible" id="glyph3-0">
<path style="stroke:none;" d=""/>
</symbol>
<symbol overflow="visible" id="glyph3-1">
<path style="stroke:none;" d="M 0 -3.625 L -17.5 -3.625 L -17.5 -1.625 L 0 -1.625 Z M 0 -3.625 "/>
</symbol>
<symbol overflow="visible" id="glyph3-2">
<path style="stroke:none;" d="M -6.1875 -12.234375 C -10.53125 -12.234375 -12.9375 -10.15625 -12.9375 -6.53125 C -12.9375 -3 -10.515625 -0.859375 -6.28125 -0.859375 C -2.0625 -0.859375 0.359375 -2.96875 0.359375 -6.546875 C 0.359375 -10.078125 -2.0625 -12.234375 -6.1875 -12.234375 Z M -6.21875 -10.15625 C -3.265625 -10.15625 -1.484375 -8.765625 -1.484375 -6.546875 C -1.484375 -4.3125 -3.234375 -2.953125 -6.28125 -2.953125 C -9.3125 -2.953125 -11.09375 -4.3125 -11.09375 -6.546875 C -11.09375 -8.8125 -9.34375 -10.15625 -6.21875 -10.15625 Z M -6.21875 -10.15625 "/>
</symbol>
<symbol overflow="visible" id="glyph3-3">
<path style="stroke:none;" d="M -2.0625 -11.734375 L -12.578125 -11.734375 L -12.578125 -9.890625 L -10.75 -9.890625 C -12.234375 -8.875 -12.9375 -7.65625 -12.9375 -6.046875 C -12.9375 -2.859375 -10.25 -0.703125 -6.171875 -0.703125 C -2.203125 -0.703125 0.359375 -2.921875 0.359375 -5.875 C 0.359375 -7.46875 -0.3125 -8.5625 -1.890625 -9.890625 L -1.0625 -9.890625 C 2.28125 -9.890625 3.546875 -8.515625 3.546875 -6.1875 C 3.546875 -4.609375 2.96875 -3.390625 1.4375 -3.140625 L 1.4375 -1.109375 C 3.8125 -1.3125 5.234375 -3.171875 5.234375 -6.125 C 5.234375 -10.0625 3.484375 -11.734375 -2.0625 -11.734375 Z M -6.21875 -9.703125 C -3.21875 -9.703125 -1.484375 -8.40625 -1.484375 -6.28125 C -1.484375 -4.109375 -3.234375 -2.78125 -6.28125 -2.78125 C -9.3125 -2.78125 -11.09375 -4.125 -11.09375 -6.265625 C -11.09375 -8.421875 -9.265625 -9.703125 -6.21875 -9.703125 Z M -6.21875 -9.703125 "/>
</symbol>
<symbol overflow="visible" id="glyph3-4">
<path style="stroke:none;" d="M -5.71875 -12.3125 C -7.53125 -12.3125 -8.6875 -12.171875 -9.625 -11.8125 C -11.6875 -10.984375 -12.9375 -9.078125 -12.9375 -6.71875 C -12.9375 -3.21875 -10.34375 -0.953125 -6.21875 -0.953125 C -2.09375 -0.953125 0.359375 -3.140625 0.359375 -6.671875 C 0.359375 -9.546875 -1.265625 -11.546875 -3.8125 -12.046875 L -3.8125 -10.03125 C -2.15625 -9.484375 -1.484375 -8.359375 -1.484375 -6.75 C -1.484375 -4.65625 -2.828125 -3.09375 -5.71875 -3.046875 Z M -7.484375 -10.171875 C -7.484375 -10.171875 -7.390625 -10.171875 -7.34375 -10.15625 L -7.34375 -3.09375 C -9.578125 -3.265625 -11.09375 -4.6875 -11.09375 -6.703125 C -11.09375 -8.65625 -9.453125 -10.171875 -7.484375 -10.171875 Z M -7.484375 -10.171875 "/>
</symbol>
<symbol overflow="visible" id="glyph3-5">
<path style="stroke:none;" d="M -10.828125 -7.703125 L -12.859375 -7.703125 C -12.90625 -7.375 -12.9375 -7.203125 -12.9375 -6.9375 C -12.9375 -5.640625 -12.171875 -4.65625 -10.296875 -3.5 L -12.578125 -3.5 L -12.578125 -1.6875 L 0 -1.6875 L 0 -3.671875 L -6.53125 -3.671875 C -9.359375 -3.671875 -10.78125 -4.609375 -10.828125 -7.703125 Z M -10.828125 -7.703125 "/>
</symbol>
<symbol overflow="visible" id="glyph4-0">
<path style="stroke:none;" d=""/>
</symbol>
<symbol overflow="visible" id="glyph4-1">
<path style="stroke:none;" d="M -8.421875 -8.578125 C -10.4375 -8.578125 -11.90625 -7.015625 -11.90625 -4.765625 C -11.90625 -2.328125 -10.671875 -0.921875 -7.78125 -0.84375 L -7.78125 -2.3125 C -9.78125 -2.4375 -10.609375 -3.265625 -10.609375 -4.71875 C -10.609375 -6.0625 -9.65625 -7.078125 -8.375 -7.078125 C -7.4375 -7.078125 -6.640625 -6.515625 -6.03125 -5.453125 L -5.15625 -3.90625 C -3.75 -1.421875 -2.625 -0.703125 0 -0.578125 L 0 -8.5 L -1.46875 -8.5 L -1.46875 -2.234375 C -2.4375 -2.390625 -3.0625 -2.921875 -3.90625 -4.390625 L -4.828125 -6.0625 C -5.703125 -7.71875 -6.953125 -8.578125 -8.421875 -8.578125 Z M -8.421875 -8.578125 "/>
</symbol>
<symbol overflow="visible" id="glyph5-0">
<path style="stroke:none;" d=""/>
</symbol>
<symbol overflow="visible" id="glyph5-1">
<path style="stroke:none;" d="M 4.65625 -9 C 3.953125 -7.984375 3.515625 -7.5 2.734375 -6.90625 C 0.5625 -5.28125 -3.1875 -4.34375 -7.625 -4.34375 C -11.671875 -4.34375 -15.265625 -5.125 -17.4375 -6.515625 C -18.453125 -7.171875 -19.015625 -7.734375 -19.890625 -9 L -20.40625 -8.609375 C -19.6875 -7.234375 -19.265625 -6.625 -18.546875 -5.84375 C -16.046875 -3.15625 -12 -1.59375 -7.625 -1.59375 C -3.515625 -1.59375 0.265625 -2.9375 2.796875 -5.375 C 3.78125 -6.265625 4.296875 -6.984375 5.15625 -8.609375 Z M 4.65625 -9 "/>
</symbol>
<symbol overflow="visible" id="glyph5-2">
<path style="stroke:none;" d="M 5.15625 -1.296875 C 4.40625 -2.671875 4.015625 -3.265625 3.296875 -4.046875 C 0.8125 -6.71875 -3.234375 -8.3125 -7.625 -8.3125 C -11.734375 -8.3125 -15.515625 -6.9375 -18.0625 -4.53125 C -19.015625 -3.625 -19.5625 -2.90625 -20.40625 -1.296875 L -19.890625 -0.90625 C -19.171875 -1.953125 -18.75 -2.40625 -17.96875 -3 C -15.8125 -4.625 -12.0625 -5.546875 -7.625 -5.546875 C -3.5625 -5.546875 0 -4.765625 2.15625 -3.390625 C 3.203125 -2.703125 3.8125 -2.125 4.65625 -0.90625 Z M 5.15625 -1.296875 "/>
</symbol>
<symbol overflow="visible" id="glyph6-0">
<path style="stroke:none;" d=""/>
</symbol>
<symbol overflow="visible" id="glyph6-1">
<path style="stroke:none;" d="M 5.796875 -4.890625 L 5.796875 -6.359375 L 0.9375 -6.359375 L 0.9375 -4.890625 Z M 5.796875 -4.890625 "/>
</symbol>
<symbol overflow="visible" id="glyph6-2">
<path style="stroke:none;" d="M 10.609375 -12.65625 L 10.609375 -14.15625 L 0.9375 -14.15625 L 0.9375 -12.390625 L 8.75 -12.390625 C 5.875 -8.75 3.84375 -4.53125 2.8125 0 L 4.734375 0 C 5.53125 -4.671875 7.578125 -9.046875 10.609375 -12.65625 Z M 10.609375 -12.65625 "/>
</symbol>
<symbol overflow="visible" id="glyph6-3">
<path style="stroke:none;" d="M 10.46875 -4.484375 C 10.46875 -7.1875 8.625 -9 6.046875 -9 C 4.609375 -9 3.484375 -8.453125 2.71875 -7.390625 C 2.734375 -10.921875 3.875 -12.875 5.9375 -12.875 C 7.203125 -12.875 8.078125 -12.078125 8.359375 -10.6875 L 10.15625 -10.6875 C 9.8125 -13.0625 8.265625 -14.46875 6.0625 -14.46875 C 2.6875 -14.46875 0.875 -11.625 0.875 -6.59375 C 0.875 -2.078125 2.421875 0.3125 5.734375 0.3125 C 8.484375 0.3125 10.46875 -1.65625 10.46875 -4.484375 Z M 8.625 -4.34375 C 8.625 -2.53125 7.40625 -1.28125 5.75 -1.28125 C 4.078125 -1.28125 2.8125 -2.59375 2.8125 -4.453125 C 2.8125 -6.25 4.046875 -7.40625 5.8125 -7.40625 C 7.546875 -7.40625 8.625 -6.28125 8.625 -4.34375 Z M 8.625 -4.34375 "/>
</symbol>
<symbol overflow="visible" id="glyph6-4">
<path style="stroke:none;" d="M 10.46875 -4.796875 C 10.46875 -7.65625 8.578125 -9.53125 5.796875 -9.53125 C 4.78125 -9.53125 3.953125 -9.265625 3.125 -8.65625 L 3.6875 -12.390625 L 9.71875 -12.390625 L 9.71875 -14.15625 L 2.25 -14.15625 L 1.15625 -6.59375 L 2.8125 -6.59375 C 3.65625 -7.59375 4.34375 -7.9375 5.46875 -7.9375 C 7.40625 -7.9375 8.625 -6.6875 8.625 -4.546875 C 8.625 -2.46875 7.421875 -1.28125 5.46875 -1.28125 C 3.890625 -1.28125 2.9375 -2.078125 2.515625 -3.71875 L 0.71875 -3.71875 C 1.3125 -0.84375 2.9375 0.3125 5.515625 0.3125 C 8.421875 0.3125 10.46875 -1.734375 10.46875 -4.796875 Z M 10.46875 -4.796875 "/>
</symbol>
<symbol overflow="visible" id="glyph6-5">
<path style="stroke:none;" d="M 10.609375 -3.46875 L 10.609375 -5.078125 L 8.46875 -5.078125 L 8.46875 -14.46875 L 7.140625 -14.46875 L 0.578125 -5.359375 L 0.578125 -3.46875 L 6.671875 -3.46875 L 6.671875 0 L 8.46875 0 L 8.46875 -3.46875 Z M 6.671875 -5.078125 L 2.140625 -5.078125 L 6.671875 -11.40625 Z M 6.671875 -5.078125 "/>
</symbol>
<symbol overflow="visible" id="glyph6-6">
<path style="stroke:none;" d="M 10.328125 -4.203125 C 10.328125 -5.953125 9.609375 -6.984375 7.875 -7.578125 C 9.21875 -8.09375 9.890625 -9.046875 9.890625 -10.484375 C 9.890625 -12.984375 8.25 -14.46875 5.484375 -14.46875 C 2.578125 -14.46875 1.015625 -12.875 0.953125 -9.796875 L 2.75 -9.796875 C 2.796875 -11.9375 3.671875 -12.890625 5.515625 -12.890625 C 7.09375 -12.890625 8.0625 -11.953125 8.0625 -10.421875 C 8.0625 -8.875 7.390625 -8.25 4.515625 -8.25 L 4.515625 -6.734375 L 5.484375 -6.734375 C 7.46875 -6.734375 8.484375 -5.796875 8.484375 -4.1875 C 8.484375 -2.359375 7.359375 -1.28125 5.484375 -1.28125 C 3.53125 -1.28125 2.578125 -2.265625 2.453125 -4.359375 L 0.65625 -4.359375 C 0.875 -1.140625 2.46875 0.3125 5.421875 0.3125 C 8.40625 0.3125 10.328125 -1.46875 10.328125 -4.203125 Z M 10.328125 -4.203125 "/>
</symbol>
<symbol overflow="visible" id="glyph7-0">
<path style="stroke:none;" d=""/>
</symbol>
<symbol overflow="visible" id="glyph7-1">
<path style="stroke:none;" d="M -4.890625 -5.796875 L -6.359375 -5.796875 L -6.359375 -0.9375 L -4.890625 -0.9375 Z M -4.890625 -5.796875 "/>
</symbol>
<symbol overflow="visible" id="glyph7-2">
<path style="stroke:none;" d="M 0 -7.078125 L -14.46875 -7.078125 L -14.46875 -5.890625 C -12.25 -5.265625 -11.9375 -4.859375 -11.59375 -2.078125 L -10.3125 -2.078125 L -10.3125 -5.28125 L 0 -5.28125 Z M 0 -7.078125 "/>
</symbol>
<symbol overflow="visible" id="glyph7-3">
<path style="stroke:none;" d="M -4.484375 -10.46875 C -7.1875 -10.46875 -9 -8.625 -9 -6.046875 C -9 -4.609375 -8.453125 -3.484375 -7.390625 -2.71875 C -10.921875 -2.734375 -12.875 -3.875 -12.875 -5.9375 C -12.875 -7.203125 -12.078125 -8.078125 -10.6875 -8.359375 L -10.6875 -10.15625 C -13.0625 -9.8125 -14.46875 -8.265625 -14.46875 -6.0625 C -14.46875 -2.6875 -11.625 -0.875 -6.59375 -0.875 C -2.078125 -0.875 0.3125 -2.421875 0.3125 -5.734375 C 0.3125 -8.484375 -1.65625 -10.46875 -4.484375 -10.46875 Z M -4.34375 -8.625 C -2.53125 -8.625 -1.28125 -7.40625 -1.28125 -5.75 C -1.28125 -4.078125 -2.59375 -2.8125 -4.453125 -2.8125 C -6.25 -2.8125 -7.40625 -4.046875 -7.40625 -5.8125 C -7.40625 -7.546875 -6.28125 -8.625 -4.34375 -8.625 Z M -4.34375 -8.625 "/>
</symbol>
<symbol overflow="visible" id="glyph7-4">
<path style="stroke:none;" d="M -4.203125 -10.328125 C -5.953125 -10.328125 -6.984375 -9.609375 -7.578125 -7.875 C -8.09375 -9.21875 -9.046875 -9.890625 -10.484375 -9.890625 C -12.984375 -9.890625 -14.46875 -8.25 -14.46875 -5.484375 C -14.46875 -2.578125 -12.875 -1.015625 -9.796875 -0.953125 L -9.796875 -2.75 C -11.9375 -2.796875 -12.890625 -3.671875 -12.890625 -5.515625 C -12.890625 -7.09375 -11.953125 -8.0625 -10.421875 -8.0625 C -8.875 -8.0625 -8.25 -7.390625 -8.25 -4.515625 L -6.734375 -4.515625 L -6.734375 -5.484375 C -6.734375 -7.46875 -5.796875 -8.484375 -4.1875 -8.484375 C -2.359375 -8.484375 -1.28125 -7.359375 -1.28125 -5.484375 C -1.28125 -3.53125 -2.265625 -2.578125 -4.359375 -2.453125 L -4.359375 -0.65625 C -1.140625 -0.875 0.3125 -2.46875 0.3125 -5.421875 C 0.3125 -8.40625 -1.46875 -10.328125 -4.203125 -10.328125 Z M -4.203125 -10.328125 "/>
</symbol>
<symbol overflow="visible" id="glyph7-5">
<path style="stroke:none;" d="M -6.953125 -10.34375 C -11.984375 -10.34375 -14.46875 -8.75 -14.46875 -5.609375 C -14.46875 -2.484375 -11.9375 -0.875 -7.078125 -0.875 C -2.203125 -0.875 0.3125 -2.515625 0.3125 -5.609375 C 0.3125 -8.671875 -2.203125 -10.34375 -6.953125 -10.34375 Z M -7.125 -8.515625 C -3.015625 -8.515625 -1.1875 -7.578125 -1.1875 -5.578125 C -1.1875 -3.671875 -3.109375 -2.71875 -7.0625 -2.71875 C -11.015625 -2.71875 -12.875 -3.671875 -12.875 -5.609375 C -12.875 -7.546875 -11 -8.515625 -7.125 -8.515625 Z M -7.125 -8.515625 "/>
</symbol>
<symbol overflow="visible" id="glyph7-6">
<path style="stroke:none;" d="M -12.65625 -10.609375 L -14.15625 -10.609375 L -14.15625 -0.9375 L -12.390625 -0.9375 L -12.390625 -8.75 C -8.75 -5.875 -4.53125 -3.84375 0 -2.8125 L 0 -4.734375 C -4.671875 -5.53125 -9.046875 -7.578125 -12.65625 -10.609375 Z M -12.65625 -10.609375 "/>
</symbol>
<symbol overflow="visible" id="glyph7-7">
<path style="stroke:none;" d="M -3.46875 -10.609375 L -5.078125 -10.609375 L -5.078125 -8.46875 L -14.46875 -8.46875 L -14.46875 -7.140625 L -5.359375 -0.578125 L -3.46875 -0.578125 L -3.46875 -6.671875 L 0 -6.671875 L 0 -8.46875 L -3.46875 -8.46875 Z M -5.078125 -6.671875 L -5.078125 -2.140625 L -11.40625 -6.671875 Z M -5.078125 -6.671875 "/>
</symbol>
<symbol overflow="visible" id="glyph7-8">
<path style="stroke:none;" d="M -4.796875 -10.46875 C -7.65625 -10.46875 -9.53125 -8.578125 -9.53125 -5.796875 C -9.53125 -4.78125 -9.265625 -3.953125 -8.65625 -3.125 L -12.390625 -3.6875 L -12.390625 -9.71875 L -14.15625 -9.71875 L -14.15625 -2.25 L -6.59375 -1.15625 L -6.59375 -2.8125 C -7.59375 -3.65625 -7.9375 -4.34375 -7.9375 -5.46875 C -7.9375 -7.40625 -6.6875 -8.625 -4.546875 -8.625 C -2.46875 -8.625 -1.28125 -7.421875 -1.28125 -5.46875 C -1.28125 -3.890625 -2.078125 -2.9375 -3.71875 -2.515625 L -3.71875 -0.71875 C -0.84375 -1.3125 0.3125 -2.9375 0.3125 -5.515625 C 0.3125 -8.421875 -1.734375 -10.46875 -4.796875 -10.46875 Z M -4.796875 -10.46875 "/>
</symbol>
</g>
<clipPath id="clip1">
  <path d="M 91 196 L 490 196 L 490 447.398438 L 91 447.398438 Z M 91 196 "/>
</clipPath>
</defs>
<g id="surface4780">
<rect x="0" y="0" width="504" height="504" style="fill:rgb(100%,100%,100%);fill-opacity:1;stroke:none;"/>
<path style="fill:none;stroke-width:0.75;stroke-linecap:round;stroke-linejoin:round;stroke:rgb(0%,0%,100%);stroke-opacity:1;stroke-miterlimit:10;" d="M 488.160156 136.464844 L 479.5 155.078125 L 471.335938 160.164062 L 463.613281 180.863281 L 456.289062 194.757812 L 449.320312 144.515625 L 442.675781 206.359375 L 436.328125 194.722656 L 430.25 149.984375 L 424.417969 202.480469 L 418.816406 210.601562 L 413.425781 119.453125 L 408.230469 73.359375 L 403.21875 212.898438 L 398.378906 227.746094 L 393.695312 238.515625 L 389.160156 226.746094 L 384.765625 267.535156 L 380.5 209.964844 L 376.359375 239.835938 L 372.335938 248.757812 L 368.425781 266.246094 L 364.613281 251.566406 L 360.90625 262.605469 L 357.289062 78.773438 L 353.761719 58.730469 L 350.320312 266.203125 L 346.960938 256.734375 L 343.675781 270.945312 L 340.464844 250.488281 L 337.328125 256.835938 L 334.253906 274.925781 L 331.25 286.558594 L 328.304688 257.277344 L 325.417969 257.277344 L 322.589844 277.136719 L 319.816406 293.089844 L 317.097656 277.492188 L 314.425781 247.894531 L 311.804688 301.859375 L 309.230469 285.664062 L 306.703125 296.042969 L 304.21875 286.492188 L 301.777344 296.777344 L 299.378906 304.515625 L 297.015625 171.457031 L 294.695312 284.65625 L 292.410156 275.140625 L 290.160156 315.585938 L 287.945312 315.386719 L 285.765625 288.035156 L 283.617188 78.542969 L 281.5 255.941406 L 279.417969 325.703125 L 277.359375 237.707031 L 275.335938 248.214844 L 273.335938 325.894531 L 271.367188 306.953125 L 269.425781 312.042969 L 267.507812 321.097656 L 265.613281 337.503906 L 263.75 247.152344 L 261.90625 298.085938 L 260.085938 275.734375 L 258.289062 327.273438 L 256.515625 261.320312 L 254.761719 331.886719 L 253.03125 267.804688 L 251.320312 227.582031 L 249.628906 264.660156 L 247.960938 257.699219 L 246.308594 338.441406 L 244.675781 333.878906 L 243.0625 330.660156 L 241.464844 324.742188 L 239.886719 290.253906 L 238.328125 335.546875 L 236.785156 328.976562 L 235.253906 263.949219 L 233.746094 245.203125 L 232.25 187.109375 L 230.769531 226.789062 L 229.304688 349.371094 L 227.855469 349.371094 L 226.417969 351.546875 L 224.996094 353.613281 L 223.589844 190.554688 L 222.195312 116.742188 L 220.816406 116.742188 L 219.449219 350.066406 L 218.097656 341.136719 L 216.753906 306.867188 L 215.425781 306.867188 L 214.109375 287.242188 L 212.804688 238.269531 L 211.511719 288.101562 L 210.230469 313.339844 L 208.960938 266.855469 L 207.703125 272.910156 L 206.457031 369.867188 L 205.21875 319.558594 L 203.992188 354.921875 L 202.777344 328.347656 L 201.574219 361.761719 L 200.378906 260.007812 L 199.191406 307.496094 L 198.015625 344.480469 L 196.851562 372.65625 L 195.695312 338.796875 L 194.546875 361.101562 L 193.410156 367.503906 L 192.28125 370.96875 L 191.160156 285.300781 L 190.046875 358.203125 L 188.945312 368.484375 L 187.851562 305.09375 L 186.765625 333.503906 L 185.6875 305.730469 L 184.617188 301.429688 L 183.554688 380.355469 L 182.5 380.542969 L 181.453125 306.703125 L 180.417969 387.28125 L 179.386719 298.1875 L 178.359375 238.371094 L 177.34375 369.777344 L 176.335938 332.699219 L 175.332031 380.871094 L 174.335938 366.996094 L 173.347656 336.285156 L 172.367188 386.996094 L 171.390625 365.851562 L 170.425781 385.519531 L 169.460938 312.34375 L 168.507812 382.691406 L 167.558594 396.75 L 166.613281 256.433594 L 165.679688 348.992188 L 164.75 367.769531 L 163.824219 389.210938 L 162.90625 384.210938 L 161.992188 378.484375 L 161.085938 327.210938 L 160.183594 384.242188 L 159.289062 407.375 L 158.398438 397.332031 L 157.515625 356.671875 L 156.636719 400.679688 L 155.761719 388.941406 L 154.894531 338.238281 L 154.03125 364.578125 L 153.171875 351.136719 L 152.320312 336.453125 L 151.472656 411.695312 L 150.628906 412.59375 L 149.792969 353.832031 L 148.960938 324.898438 L 148.132812 315.835938 L 147.308594 409.617188 L 146.488281 384.277344 L 145.675781 365.023438 L 144.867188 406.105469 L 144.0625 366.582031 L 143.261719 369.546875 L 142.464844 383.597656 L 141.675781 366.667969 L 140.886719 422.839844 L 140.105469 303.3125 L 139.328125 347.371094 L 138.554688 368.226562 L 137.785156 412.003906 L 137.015625 373.046875 L 136.253906 408.730469 L 135.496094 377.679688 L 134.746094 337.9375 L 133.996094 408.675781 L 133.25 417.558594 L 132.507812 391.867188 L 131.769531 308.589844 L 131.035156 336.363281 L 130.304688 407.726562 L 129.578125 401.179688 L 128.855469 401.179688 L 128.132812 371.84375 L 127.417969 413.867188 L 126.707031 158.933594 L 125.996094 411.230469 L 125.292969 368.386719 L 124.589844 401.523438 L 123.890625 402.921875 L 123.195312 378.816406 L 122.503906 378.816406 L 121.816406 400.152344 L 121.132812 413.675781 L 120.449219 415.269531 L 119.769531 380.535156 L 119.097656 337.507812 L 118.421875 410.242188 L 117.753906 403.214844 L 117.089844 403.214844 L 116.425781 418.28125 L 115.765625 352.40625 L 115.109375 418.039062 L 114.457031 419.132812 L 113.804688 411.023438 L 113.15625 368.261719 L 112.511719 314.796875 L 111.871094 399.832031 L 111.230469 391.488281 L 110.59375 395.339844 L 109.960938 420.054688 L 109.332031 393.75 L 108.703125 411.332031 L 108.078125 381.652344 L 107.457031 282.617188 L 106.835938 401.695312 L 106.21875 429.738281 L 105.605469 198.601562 L 104.992188 390.875 L 104.386719 391.898438 L 103.777344 334.347656 L 103.175781 420.535156 L 102.574219 420.535156 L 101.972656 420.941406 L 101.378906 420.941406 L 100.785156 335.238281 L 100.191406 419.128906 L 99.605469 395.222656 L 99.015625 423.589844 L 98.433594 298.558594 L 97.851562 420.523438 L 97.273438 429.054688 L 96.695312 414.707031 L 96.121094 318.121094 L 95.546875 318.121094 L 94.976562 399.195312 L 94.410156 395.398438 L 93.84375 419.449219 L 93.28125 419.449219 L 92.71875 390.871094 "/>
<g style="fill:rgb(0%,0%,0%);fill-opacity:1;">
  <use xlink:href="#glyph0-1" x="251.160156" y="494.672852"/>
</g>
<g style="fill:rgb(0%,0%,0%);fill-opacity:1;">
  <use xlink:href="#glyph0-2" x="257.160156" y="494.672852"/>
</g>
<g style="fill:rgb(0%,0%,0%);fill-opacity:1;">
  <use xlink:href="#glyph0-3" x="271.160156" y="494.672852"/>
</g>
<g style="fill:rgb(0%,0%,0%);fill-opacity:1;">
  <use xlink:href="#glyph1-1" x="285.160156" y="498.958008"/>
</g>
<g style="fill:rgb(0%,0%,0%);fill-opacity:1;">
  <use xlink:href="#glyph2-1" x="295.160156" y="494.420898"/>
</g>
<g style="fill:rgb(0%,0%,0%);fill-opacity:1;">
  <use xlink:href="#glyph0-4" x="305.160156" y="494.672852"/>
</g>
<g style="fill:rgb(0%,0%,0%);fill-opacity:1;">
  <use xlink:href="#glyph2-2" x="319.160156" y="494.420898"/>
</g>
<g style="fill:rgb(0%,0%,0%);fill-opacity:1;">
  <use xlink:href="#glyph3-1" x="23.790039" y="299.199219"/>
</g>
<g style="fill:rgb(0%,0%,0%);fill-opacity:1;">
  <use xlink:href="#glyph3-2" x="23.790039" y="293.199219"/>
</g>
<g style="fill:rgb(0%,0%,0%);fill-opacity:1;">
  <use xlink:href="#glyph3-3" x="23.790039" y="279.199219"/>
</g>
<g style="fill:rgb(0%,0%,0%);fill-opacity:1;">
  <use xlink:href="#glyph4-1" x="28.075195" y="265.199219"/>
</g>
<g style="fill:rgb(0%,0%,0%);fill-opacity:1;">
  <use xlink:href="#glyph5-1" x="23.538086" y="255.199219"/>
</g>
<g style="fill:rgb(0%,0%,0%);fill-opacity:1;">
  <use xlink:href="#glyph3-4" x="23.790039" y="245.199219"/>
</g>
<g style="fill:rgb(0%,0%,0%);fill-opacity:1;">
  <use xlink:href="#glyph3-5" x="23.790039" y="231.199219"/>
</g>
<g style="fill:rgb(0%,0%,0%);fill-opacity:1;">
  <use xlink:href="#glyph3-5" x="23.790039" y="223.199219"/>
</g>
<g style="fill:rgb(0%,0%,0%);fill-opacity:1;">
  <use xlink:href="#glyph3-2" x="23.790039" y="215.199219"/>
</g>
<g style="fill:rgb(0%,0%,0%);fill-opacity:1;">
  <use xlink:href="#glyph3-5" x="23.790039" y="201.199219"/>
</g>
<g style="fill:rgb(0%,0%,0%);fill-opacity:1;">
  <use xlink:href="#glyph5-2" x="23.538086" y="193.199219"/>
</g>
<g clip-path="url(#clip1)" clip-rule="nonzero">
<path style="fill:none;stroke-width:2.25;stroke-linecap:round;stroke-linejoin:round;stroke:rgb(100%,0%,0%);stroke-opacity:1;stroke-dasharray:9,9;stroke-miterlimit:10;" d="M 488.160156 198 L 479.5 204.042969 L 471.335938 209.742188 L 463.613281 215.128906 L 456.289062 220.242188 L 449.320312 225.105469 L 442.675781 229.742188 L 436.328125 234.175781 L 430.25 238.417969 L 424.417969 242.484375 L 418.816406 246.394531 L 413.425781 250.15625 L 408.230469 253.78125 L 403.21875 257.28125 L 398.378906 260.660156 L 393.695312 263.925781 L 389.160156 267.09375 L 384.765625 270.160156 L 380.5 273.136719 L 376.359375 276.023438 L 372.335938 278.832031 L 368.425781 281.5625 L 364.613281 284.222656 L 360.90625 286.8125 L 357.289062 289.335938 L 353.761719 291.796875 L 350.320312 294.199219 L 346.960938 296.542969 L 343.675781 298.835938 L 340.464844 301.074219 L 337.328125 303.265625 L 334.253906 305.410156 L 331.25 307.507812 L 328.304688 309.5625 L 325.417969 311.578125 L 322.589844 313.550781 L 319.816406 315.484375 L 317.097656 317.382812 L 314.425781 319.246094 L 311.804688 321.078125 L 309.230469 322.871094 L 306.703125 324.636719 L 304.21875 326.371094 L 301.777344 328.074219 L 299.378906 329.75 L 297.015625 331.398438 L 294.695312 333.019531 L 292.410156 334.613281 L 290.160156 336.183594 L 287.945312 337.726562 L 285.765625 339.25 L 283.617188 340.75 L 281.5 342.226562 L 279.417969 343.679688 L 277.359375 345.113281 L 275.335938 346.527344 L 273.335938 347.921875 L 271.367188 349.296875 L 269.425781 350.652344 L 267.507812 351.992188 L 265.613281 353.3125 L 263.75 354.617188 L 261.90625 355.902344 L 260.085938 357.171875 L 258.289062 358.425781 L 256.515625 359.664062 L 254.761719 360.886719 L 253.03125 362.09375 L 251.320312 363.289062 L 249.628906 364.46875 L 247.960938 365.632812 L 246.308594 366.785156 L 244.675781 367.925781 L 243.0625 369.050781 L 241.464844 370.164062 L 239.886719 371.265625 L 238.328125 372.355469 L 236.785156 373.433594 L 235.253906 374.5 L 233.746094 375.554688 L 232.25 376.597656 L 230.769531 377.632812 L 229.304688 378.652344 L 227.855469 379.664062 L 226.417969 380.667969 L 224.996094 381.660156 L 223.589844 382.640625 L 222.195312 383.613281 L 220.816406 384.578125 L 219.449219 385.53125 L 218.097656 386.476562 L 216.753906 387.410156 L 215.425781 388.339844 L 214.109375 389.257812 L 212.804688 390.167969 L 211.511719 391.070312 L 210.230469 391.964844 L 208.960938 392.851562 L 207.703125 393.726562 L 206.457031 394.597656 L 205.21875 395.460938 L 203.992188 396.316406 L 202.777344 397.164062 L 201.574219 398.007812 L 200.378906 398.839844 L 199.191406 399.667969 L 198.015625 400.488281 L 196.851562 401.300781 L 195.695312 402.109375 L 194.546875 402.910156 L 193.410156 403.703125 L 192.28125 404.492188 L 191.160156 405.273438 L 190.046875 406.050781 L 188.945312 406.820312 L 187.851562 407.582031 L 186.765625 408.339844 L 185.6875 409.09375 L 184.617188 409.839844 L 183.554688 410.582031 L 182.5 411.316406 L 181.453125 412.046875 L 180.417969 412.773438 L 179.386719 413.492188 L 178.359375 414.207031 L 177.34375 414.914062 L 176.335938 415.621094 L 175.332031 416.320312 L 174.335938 417.015625 L 173.347656 417.703125 L 172.367188 418.390625 L 171.390625 419.070312 L 170.425781 419.746094 L 169.460938 420.417969 L 168.507812 421.082031 L 167.558594 421.746094 L 166.613281 422.402344 L 165.679688 423.058594 L 164.75 423.707031 L 163.824219 424.351562 L 162.90625 424.992188 L 161.992188 425.628906 L 161.085938 426.261719 L 160.183594 426.890625 L 159.289062 427.515625 L 158.398438 428.136719 L 157.515625 428.753906 L 156.636719 429.367188 L 155.761719 429.976562 L 154.894531 430.582031 L 154.03125 431.1875 L 153.171875 431.785156 L 152.320312 432.378906 L 151.472656 432.972656 L 150.628906 433.558594 L 149.792969 434.144531 L 148.960938 434.726562 L 148.132812 435.300781 L 147.308594 435.878906 L 146.488281 436.449219 L 145.675781 437.015625 L 144.867188 437.582031 L 144.0625 438.144531 L 143.261719 438.699219 L 142.464844 439.257812 L 140.886719 440.359375 L 140.105469 440.902344 L 139.328125 441.445312 L 138.554688 441.988281 L 137.015625 443.058594 L 136.253906 443.589844 L 135.496094 444.121094 L 133.996094 445.167969 L 133.25 445.6875 L 132.507812 446.207031 L 131.769531 446.722656 L 131.035156 447.234375 L 130.304688 447.746094 L 129.578125 448.25 L 128.855469 448.757812 L 128.132812 449.257812 L 127.417969 449.757812 L 125.996094 450.75 L 125.292969 451.242188 L 124.589844 451.730469 L 123.890625 452.21875 L 123.195312 452.703125 L 122.503906 453.1875 L 121.816406 453.667969 L 120.449219 454.621094 L 119.769531 455.09375 L 119.097656 455.566406 L 118.421875 456.035156 L 117.753906 456.503906 L 117.089844 456.96875 L 116.425781 457.429688 L 115.765625 457.890625 L 115.109375 458.347656 L 114.457031 458.804688 L 113.804688 459.257812 L 113.15625 459.710938 L 112.511719 460.160156 L 111.871094 460.609375 L 111.230469 461.054688 L 110.59375 461.5 L 109.960938 461.941406 L 109.332031 462.378906 L 108.703125 462.820312 L 108.078125 463.253906 L 107.457031 463.691406 L 106.835938 464.121094 L 106.21875 464.550781 L 105.605469 464.980469 L 104.992188 465.40625 L 104.386719 465.832031 L 103.777344 466.257812 L 103.175781 466.679688 L 101.972656 467.515625 L 101.378906 467.933594 L 100.785156 468.347656 L 100.191406 468.757812 L 99.605469 469.167969 L 99.015625 469.578125 L 98.433594 469.988281 L 97.851562 470.394531 L 96.695312 471.199219 L 96.121094 471.601562 L 95.546875 472 L 94.976562 472.398438 L 94.410156 472.796875 L 93.84375 473.191406 L 92.71875 473.972656 "/>
</g>
<path style="fill:none;stroke-width:0.75;stroke-linecap:round;stroke-linejoin:round;stroke:rgb(0%,0%,0%);stroke-opacity:1;stroke-miterlimit:10;" d="M 92.160156 446.398438 L 488.160156 446.398438 "/>
<path style="fill:none;stroke-width:0.75;stroke-linecap:round;stroke-linejoin:round;stroke:rgb(0%,0%,0%);stroke-opacity:1;stroke-miterlimit:10;" d="M 92.160156 446.398438 L 92.160156 453.601562 "/>
<path style="fill:none;stroke-width:0.75;stroke-linecap:round;stroke-linejoin:round;stroke:rgb(0%,0%,0%);stroke-opacity:1;stroke-miterlimit:10;" d="M 191.160156 446.398438 L 191.160156 453.601562 "/>
<path style="fill:none;stroke-width:0.75;stroke-linecap:round;stroke-linejoin:round;stroke:rgb(0%,0%,0%);stroke-opacity:1;stroke-miterlimit:10;" d="M 290.160156 446.398438 L 290.160156 453.601562 "/>
<path style="fill:none;stroke-width:0.75;stroke-linecap:round;stroke-linejoin:round;stroke:rgb(0%,0%,0%);stroke-opacity:1;stroke-miterlimit:10;" d="M 389.160156 446.398438 L 389.160156 453.601562 "/>
<path style="fill:none;stroke-width:0.75;stroke-linecap:round;stroke-linejoin:round;stroke:rgb(0%,0%,0%);stroke-opacity:1;stroke-miterlimit:10;" d="M 488.160156 446.398438 L 488.160156 453.601562 "/>
<g style="fill:rgb(0%,0%,0%);fill-opacity:1;">
  <use xlink:href="#glyph6-1" x="82.660156" y="471.739258"/>
  <use xlink:href="#glyph6-2" x="89.455078" y="471.739258"/>
</g>
<g style="fill:rgb(0%,0%,0%);fill-opacity:1;">
  <use xlink:href="#glyph6-1" x="181.660156" y="471.739258"/>
  <use xlink:href="#glyph6-3" x="188.455078" y="471.739258"/>
</g>
<g style="fill:rgb(0%,0%,0%);fill-opacity:1;">
  <use xlink:href="#glyph6-1" x="280.660156" y="471.739258"/>
  <use xlink:href="#glyph6-4" x="287.455078" y="471.739258"/>
</g>
<g style="fill:rgb(0%,0%,0%);fill-opacity:1;">
  <use xlink:href="#glyph6-1" x="379.660156" y="471.739258"/>
  <use xlink:href="#glyph6-5" x="386.455078" y="471.739258"/>
</g>
<g style="fill:rgb(0%,0%,0%);fill-opacity:1;">
  <use xlink:href="#glyph6-1" x="478.660156" y="471.739258"/>
  <use xlink:href="#glyph6-6" x="485.455078" y="471.739258"/>
</g>
<path style="fill:none;stroke-width:0.75;stroke-linecap:round;stroke-linejoin:round;stroke:rgb(0%,0%,0%);stroke-opacity:1;stroke-miterlimit:10;" d="M 76.320312 431.199219 L 76.320312 51.199219 "/>
<path style="fill:none;stroke-width:0.75;stroke-linecap:round;stroke-linejoin:round;stroke:rgb(0%,0%,0%);stroke-opacity:1;stroke-miterlimit:10;" d="M 76.320312 431.199219 L 69.121094 431.199219 "/>
<path style="fill:none;stroke-width:0.75;stroke-linecap:round;stroke-linejoin:round;stroke:rgb(0%,0%,0%);stroke-opacity:1;stroke-miterlimit:10;" d="M 76.320312 413.925781 L 69.121094 413.925781 "/>
<path style="fill:none;stroke-width:0.75;stroke-linecap:round;stroke-linejoin:round;stroke:rgb(0%,0%,0%);stroke-opacity:1;stroke-miterlimit:10;" d="M 76.320312 396.65625 L 69.121094 396.65625 "/>
<path style="fill:none;stroke-width:0.75;stroke-linecap:round;stroke-linejoin:round;stroke:rgb(0%,0%,0%);stroke-opacity:1;stroke-miterlimit:10;" d="M 76.320312 379.382812 L 69.121094 379.382812 "/>
<path style="fill:none;stroke-width:0.75;stroke-linecap:round;stroke-linejoin:round;stroke:rgb(0%,0%,0%);stroke-opacity:1;stroke-miterlimit:10;" d="M 76.320312 362.109375 L 69.121094 362.109375 "/>
<path style="fill:none;stroke-width:0.75;stroke-linecap:round;stroke-linejoin:round;stroke:rgb(0%,0%,0%);stroke-opacity:1;stroke-miterlimit:10;" d="M 76.320312 344.835938 L 69.121094 344.835938 "/>
<path style="fill:none;stroke-width:0.75;stroke-linecap:round;stroke-linejoin:round;stroke:rgb(0%,0%,0%);stroke-opacity:1;stroke-miterlimit:10;" d="M 76.320312 327.5625 L 69.121094 327.5625 "/>
<path style="fill:none;stroke-width:0.75;stroke-linecap:round;stroke-linejoin:round;stroke:rgb(0%,0%,0%);stroke-opacity:1;stroke-miterlimit:10;" d="M 76.320312 310.289062 L 69.121094 310.289062 "/>
<path style="fill:none;stroke-width:0.75;stroke-linecap:round;stroke-linejoin:round;stroke:rgb(0%,0%,0%);stroke-opacity:1;stroke-miterlimit:10;" d="M 76.320312 293.019531 L 69.121094 293.019531 "/>
<path style="fill:none;stroke-width:0.75;stroke-linecap:round;stroke-linejoin:round;stroke:rgb(0%,0%,0%);stroke-opacity:1;stroke-miterlimit:10;" d="M 76.320312 275.746094 L 69.121094 275.746094 "/>
<path style="fill:none;stroke-width:0.75;stroke-linecap:round;stroke-linejoin:round;stroke:rgb(0%,0%,0%);stroke-opacity:1;stroke-miterlimit:10;" d="M 76.320312 258.472656 L 69.121094 258.472656 "/>
<path style="fill:none;stroke-width:0.75;stroke-linecap:round;stroke-linejoin:round;stroke:rgb(0%,0%,0%);stroke-opacity:1;stroke-miterlimit:10;" d="M 76.320312 241.199219 L 69.121094 241.199219 "/>
<path style="fill:none;stroke-width:0.75;stroke-linecap:round;stroke-linejoin:round;stroke:rgb(0%,0%,0%);stroke-opacity:1;stroke-miterlimit:10;" d="M 76.320312 223.925781 L 69.121094 223.925781 "/>
<path style="fill:none;stroke-width:0.75;stroke-linecap:round;stroke-linejoin:round;stroke:rgb(0%,0%,0%);stroke-opacity:1;stroke-miterlimit:10;" d="M 76.320312 206.65625 L 69.121094 206.65625 "/>
<path style="fill:none;stroke-width:0.75;stroke-linecap:round;stroke-linejoin:round;stroke:rgb(0%,0%,0%);stroke-opacity:1;stroke-miterlimit:10;" d="M 76.320312 189.382812 L 69.121094 189.382812 "/>
<path style="fill:none;stroke-width:0.75;stroke-linecap:round;stroke-linejoin:round;stroke:rgb(0%,0%,0%);stroke-opacity:1;stroke-miterlimit:10;" d="M 76.320312 172.109375 L 69.121094 172.109375 "/>
<path style="fill:none;stroke-width:0.75;stroke-linecap:round;stroke-linejoin:round;stroke:rgb(0%,0%,0%);stroke-opacity:1;stroke-miterlimit:10;" d="M 76.320312 154.835938 L 69.121094 154.835938 "/>
<path style="fill:none;stroke-width:0.75;stroke-linecap:round;stroke-linejoin:round;stroke:rgb(0%,0%,0%);stroke-opacity:1;stroke-miterlimit:10;" d="M 76.320312 137.5625 L 69.121094 137.5625 "/>
<path style="fill:none;stroke-width:0.75;stroke-linecap:round;stroke-linejoin:round;stroke:rgb(0%,0%,0%);stroke-opacity:1;stroke-miterlimit:10;" d="M 76.320312 120.289062 L 69.121094 120.289062 "/>
<path style="fill:none;stroke-width:0.75;stroke-linecap:round;stroke-linejoin:round;stroke:rgb(0%,0%,0%);stroke-opacity:1;stroke-miterlimit:10;" d="M 76.320312 103.019531 L 69.121094 103.019531 "/>
<path style="fill:none;stroke-width:0.75;stroke-linecap:round;stroke-linejoin:round;stroke:rgb(0%,0%,0%);stroke-opacity:1;stroke-miterlimit:10;" d="M 76.320312 85.746094 L 69.121094 85.746094 "/>
<path style="fill:none;stroke-width:0.75;stroke-linecap:round;stroke-linejoin:round;stroke:rgb(0%,0%,0%);stroke-opacity:1;stroke-miterlimit:10;" d="M 76.320312 68.472656 L 69.121094 68.472656 "/>
<path style="fill:none;stroke-width:0.75;stroke-linecap:round;stroke-linejoin:round;stroke:rgb(0%,0%,0%);stroke-opacity:1;stroke-miterlimit:10;" d="M 76.320312 51.199219 L 69.121094 51.199219 "/>
<g style="fill:rgb(0%,0%,0%);fill-opacity:1;">
  <use xlink:href="#glyph7-1" x="58.458008" y="446.199219"/>
  <use xlink:href="#glyph7-2" x="58.458008" y="439.404297"/>
  <use xlink:href="#glyph7-3" x="58.458008" y="428.058594"/>
</g>
<g style="fill:rgb(0%,0%,0%);fill-opacity:1;">
  <use xlink:href="#glyph7-1" x="58.458008" y="394.382812"/>
  <use xlink:href="#glyph7-2" x="58.458008" y="387.587891"/>
  <use xlink:href="#glyph7-4" x="58.458008" y="376.242188"/>
</g>
<g style="fill:rgb(0%,0%,0%);fill-opacity:1;">
  <use xlink:href="#glyph7-1" x="58.458008" y="342.5625"/>
  <use xlink:href="#glyph7-2" x="58.458008" y="335.767578"/>
  <use xlink:href="#glyph7-5" x="58.458008" y="324.421875"/>
</g>
<g style="fill:rgb(0%,0%,0%);fill-opacity:1;">
  <use xlink:href="#glyph7-1" x="58.458008" y="285.246094"/>
  <use xlink:href="#glyph7-6" x="58.458008" y="278.451172"/>
</g>
<g style="fill:rgb(0%,0%,0%);fill-opacity:1;">
  <use xlink:href="#glyph7-1" x="58.458008" y="233.425781"/>
  <use xlink:href="#glyph7-7" x="58.458008" y="226.630859"/>
</g>
<g style="fill:rgb(0%,0%,0%);fill-opacity:1;">
  <use xlink:href="#glyph7-1" x="58.458008" y="181.609375"/>
  <use xlink:href="#glyph7-2" x="58.458008" y="174.814453"/>
</g>
<g style="fill:rgb(0%,0%,0%);fill-opacity:1;">
  <use xlink:href="#glyph7-2" x="58.458008" y="143.5625"/>
</g>
<g style="fill:rgb(0%,0%,0%);fill-opacity:1;">
  <use xlink:href="#glyph7-4" x="58.458008" y="109.019531"/>
</g>
<g style="fill:rgb(0%,0%,0%);fill-opacity:1;">
  <use xlink:href="#glyph7-8" x="58.458008" y="74.472656"/>
</g>
<path style="fill-rule:nonzero;fill:rgb(100%,100%,100%);fill-opacity:1;stroke-width:0.75;stroke-linecap:round;stroke-linejoin:round;stroke:rgb(0%,0%,0%);stroke-opacity:1;stroke-miterlimit:10;" d="M 97.703125 56.519531 L 358.78125 56.519531 L 358.78125 142.917969 L 97.703125 142.917969 Z M 97.703125 56.519531 "/>
<path style="fill:none;stroke-width:2.25;stroke-linecap:round;stroke-linejoin:round;stroke:rgb(0%,0%,100%);stroke-opacity:1;stroke-miterlimit:10;" d="M 104.183594 85.320312 L 147.382812 85.320312 "/>
<path style="fill:none;stroke-width:2.25;stroke-linecap:round;stroke-linejoin:round;stroke:rgb(100%,0%,0%);stroke-opacity:1;stroke-miterlimit:10;" d="M 104.183594 114.121094 L 147.382812 114.121094 "/>
<g style="fill:rgb(0%,0%,0%);fill-opacity:1;">
  <use xlink:href="#glyph0-5" x="168.984375" y="93.87207"/>
  <use xlink:href="#glyph0-6" x="182.328125" y="93.87207"/>
  <use xlink:href="#glyph0-6" x="190.320312" y="93.87207"/>
  <use xlink:href="#glyph0-2" x="198.192383" y="93.87207"/>
  <use xlink:href="#glyph0-6" x="211.536133" y="93.87207"/>
</g>
<g style="fill:rgb(0%,0%,0%);fill-opacity:1;">
  <use xlink:href="#glyph0-6" x="168.984375" y="122.672852"/>
  <use xlink:href="#glyph0-5" x="176.736328" y="122.672852"/>
  <use xlink:href="#glyph0-7" x="190.080078" y="122.672852"/>
  <use xlink:href="#glyph0-8" x="196.751953" y="122.672852"/>
  <use xlink:href="#glyph0-9" x="203.423828" y="122.672852"/>
  <use xlink:href="#glyph0-1" x="210.095703" y="122.672852"/>
  <use xlink:href="#glyph0-10" x="215.423828" y="122.672852"/>
  <use xlink:href="#glyph0-11" x="220.751953" y="122.672852"/>
  <use xlink:href="#glyph0-5" x="234.095703" y="122.672852"/>
  <use xlink:href="#glyph0-9" x="247.439453" y="122.672852"/>
  <use xlink:href="#glyph0-12" x="254.111328" y="122.672852"/>
  <use xlink:href="#glyph0-13" x="262.103516" y="122.672852"/>
  <use xlink:href="#glyph0-1" x="274.103516" y="122.672852"/>
  <use xlink:href="#glyph0-2" x="279.431641" y="122.672852"/>
  <use xlink:href="#glyph0-14" x="292.775391" y="122.672852"/>
  <use xlink:href="#glyph0-5" x="306.119141" y="122.672852"/>
  <use xlink:href="#glyph0-9" x="319.462891" y="122.672852"/>
  <use xlink:href="#glyph0-15" x="326.134766" y="122.672852"/>
  <use xlink:href="#glyph0-16" x="339.478516" y="122.672852"/>
</g>
</g>
</svg>
