<?xml version="1.0" encoding="UTF-8"?>
<svg xmlns="http://www.w3.org/2000/svg" xmlns:xlink="http://www.w3.org/1999/xlink" width="504pt" height="504pt" viewBox="0 0 504 504" version="1.1">
<defs>
<g>
<symbol overflow="visible" id="glyph0-0">
<path style="stroke:none;" d=""/>
</symbol>
<symbol overflow="visible" id="glyph0-1">
<path style="stroke:none;" d="M 3.625 0 L 3.625 -17.5 L 1.625 -17.5 L 1.625 0 Z M 3.625 0 "/>
</symbol>
<symbol overflow="visible" id="glyph0-2">
<path style="stroke:none;" d="M 12.234375 -6.1875 C 12.234375 -10.53125 10.15625 -12.9375 6.53125 -12.9375 C 3 -12.9375 0.859375 -10.515625 0.859375 -6.28125 C 0.859375 -2.0625 2.96875 0.359375 6.546875 0.359375 C 10.078125 0.359375 12.234375 -2.0625 12.234375 -6.1875 Z M 10.15625 -6.21875 C 10.15625 -3.265625 8.765625 -1.484375 6.546875 -1.484375 C 4.3125 -1.484375 2.953125 -3.234375 2.953125 -6.28125 C 2.953125 -9.3125 4.3125 -11.09375 6.546875 -11.09375 C 8.8125 -11.09375 10.15625 -9.34375 10.15625 -6.21875 Z M 10.15625 -6.21875 "/>
</symbol>
<symbol overflow="visible" id="glyph0-3">
<path style="stroke:none;" d="M 11.734375 -2.0625 L 11.734375 -12.578125 L 9.890625 -12.578125 L 9.890625 -10.75 C 8.875 -12.234375 7.65625 -12.9375 6.046875 -12.9375 C 2.859375 -12.9375 0.703125 -10.25 0.703125 -6.171875 C 0.703125 -2.203125 2.921875 0.359375 5.875 0.359375 C 7.46875 0.359375 8.5625 -0.3125 9.890625 -1.890625 L 9.890625 -1.0625 C 9.890625 2.28125 8.515625 3.546875 6.1875 3.546875 C 4.609375 3.546875 3.390625 2.96875 3.140625 1.4375 L 1.109375 1.4375 C 1.3125 3.8125 3.171875 5.234375 6.125 5.234375 C 10.0625 5.234375 11.734375 3.484375 11.734375 -2.0625 Z M 9.703125 -6.21875 C 9.703125 -3.21875 8.40625 -1.484375 6.28125 -1.484375 C 4.109375 -1.484375 2.78125 -3.234375 2.78125 -6.28125 C 2.78125 -9.3125 4.125 -11.09375 6.265625 -11.09375 C 8.421875 -11.09375 9.703125 -9.265625 9.703125 -6.21875 Z M 9.703125 -6.21875 "/>
</symbol>
<symbol overflow="visible" id="glyph0-4">
<path style="stroke:none;" d="M 11.65625 0 L 11.65625 -9.5 C 11.65625 -11.609375 10.15625 -12.9375 7.703125 -12.9375 C 5.921875 -12.9375 4.84375 -12.390625 3.671875 -10.84375 L 3.671875 -17.5 L 1.6875 -17.5 L 1.6875 0 L 3.671875 0 L 3.671875 -6.9375 C 3.671875 -9.5 5.015625 -11.1875 7.078125 -11.1875 C 8.5 -11.1875 9.671875 -10.375 9.671875 -8.71875 L 9.671875 0 Z M 11.65625 0 "/>
</symbol>
<symbol overflow="visible" id="glyph0-5">
<path style="stroke:none;" d="M 12.796875 0 L 12.796875 -1.96875 L 4.15625 -1.96875 L 4.15625 -17.5 L 1.921875 -17.5 L 1.921875 0 Z M 12.796875 0 "/>
</symbol>
<symbol overflow="visible" id="glyph0-6">
<path style="stroke:none;" d="M 12.265625 -12.03125 C 12.265625 -14.90625 10.03125 -17.015625 6.8125 -17.015625 C 3.34375 -17.015625 1.3125 -15.234375 1.203125 -11.109375 L 3.3125 -11.109375 C 3.484375 -13.96875 4.65625 -15.171875 6.75 -15.171875 C 8.65625 -15.171875 10.109375 -13.796875 10.109375 -11.96875 C 10.109375 -10.625 9.3125 -9.484375 7.796875 -8.609375 L 5.59375 -7.375 C 2.046875 -5.359375 1.015625 -3.75 0.8125 0 L 12.140625 0 L 12.140625 -2.09375 L 3.1875 -2.09375 C 3.40625 -3.484375 4.171875 -4.375 6.265625 -5.59375 L 8.65625 -6.890625 C 11.046875 -8.15625 12.265625 -9.9375 12.265625 -12.03125 Z M 12.265625 -12.03125 "/>
</symbol>
<symbol overflow="visible" id="glyph0-7">
<path style="stroke:none;" d=""/>
</symbol>
<symbol overflow="visible" id="glyph0-8">
<path style="stroke:none;" d="M 12.3125 -5.71875 C 12.3125 -7.53125 12.171875 -8.6875 11.8125 -9.625 C 10.984375 -11.6875 9.078125 -12.9375 6.71875 -12.9375 C 3.21875 -12.9375 0.953125 -10.34375 0.953125 -6.21875 C 0.953125 -2.09375 3.140625 0.359375 6.671875 0.359375 C 9.546875 0.359375 11.546875 -1.265625 12.046875 -3.8125 L 10.03125 -3.8125 C 9.484375 -2.15625 8.359375 -1.484375 6.75 -1.484375 C 4.65625 -1.484375 3.09375 -2.828125 3.046875 -5.71875 Z M 10.171875 -7.484375 C 10.171875 -7.484375 10.171875 -7.390625 10.15625 -7.34375 L 3.09375 -7.34375 C 3.265625 -9.578125 4.6875 -11.09375 6.703125 -11.09375 C 8.65625 -11.09375 10.171875 -9.453125 10.171875 -7.484375 Z M 10.171875 -7.484375 "/>
</symbol>
<symbol overflow="visible" id="glyph0-9">
<path style="stroke:none;" d="M 7.703125 -10.828125 L 7.703125 -12.859375 C 7.375 -12.90625 7.203125 -12.9375 6.9375 -12.9375 C 5.640625 -12.9375 4.65625 -12.171875 3.5 -10.296875 L 3.5 -12.578125 L 1.6875 -12.578125 L 1.6875 0 L 3.671875 0 L 3.671875 -6.53125 C 3.671875 -9.359375 4.609375 -10.78125 7.703125 -10.828125 Z M 7.703125 -10.828125 "/>
</symbol>
<symbol overflow="visible" id="glyph0-10">
<path style="stroke:none;" d="M 6.1875 -10.9375 L 6.1875 -12.578125 L 4.109375 -12.578125 L 4.109375 -14.546875 C 4.109375 -15.390625 4.578125 -15.8125 5.5 -15.8125 C 5.65625 -15.8125 5.734375 -15.8125 6.1875 -15.796875 L 6.1875 -17.453125 C 5.734375 -17.546875 5.46875 -17.5625 5.0625 -17.5625 C 3.21875 -17.5625 2.109375 -16.515625 2.109375 -14.71875 L 2.109375 -12.578125 L 0.4375 -12.578125 L 0.4375 -10.9375 L 2.109375 -10.9375 L 2.109375 0 L 4.109375 0 L 4.109375 -10.9375 Z M 6.1875 -10.9375 "/>
</symbol>
<symbol overflow="visible" id="glyph0-11">
<path style="stroke:none;" d="M 4.578125 0 L 4.578125 -2.5 L 2.09375 -2.5 L 2.09375 0 Z M 4.578125 0 "/>
</symbol>
<symbol overflow="visible" id="glyph0-12">
<path style="stroke:none;" d="M 3.671875 0 L 3.671875 -12.578125 L 1.6875 -12.578125 L 1.6875 0 Z M 3.9375 -14.46875 L 3.9375 -16.96875 L 1.4375 -16.96875 L 1.4375 -14.46875 Z M 3.9375 -14.46875 "/>
</symbol>
<symbol overflow="visible" id="glyph0-13">
<path style="stroke:none;" d="M 11.6875 0 L 11.6875 -9.5 C 11.6875 -11.59375 10.125 -12.9375 7.703125 -12.9375 C 5.828125 -12.9375 4.625 -12.21875 3.53125 -10.46875 L 3.53125 -12.578125 L 1.6875 -12.578125 L 1.6875 0 L 3.671875 0 L 3.671875 -6.9375 C 3.671875 -9.5 5.0625 -11.1875 7.109375 -11.1875 C 8.6875 -11.1875 9.703125 -10.21875 9.703125 -8.71875 L 9.703125 0 Z M 11.6875 0 "/>
</symbol>
<symbol overflow="visible" id="glyph0-14">
<path style="stroke:none;" d="M 6.984375 5.09375 C 4.875 1.65625 3.703125 -2.375 3.703125 -6.21875 C 3.703125 -10.03125 4.875 -14.09375 6.984375 -17.5 L 5.65625 -17.5 C 3.265625 -14.359375 1.75 -9.984375 1.75 -6.21875 C 1.75 -2.421875 3.265625 1.9375 5.65625 5.09375 Z M 6.984375 5.09375 "/>
</symbol>
<symbol overflow="visible" id="glyph0-15">
<path style="stroke:none;" d="M 11.015625 -3.53125 C 11.015625 -5.40625 9.953125 -6.34375 7.46875 -6.9375 L 5.546875 -7.390625 C 3.90625 -7.78125 3.21875 -8.296875 3.21875 -9.1875 C 3.21875 -10.34375 4.25 -11.09375 5.875 -11.09375 C 7.484375 -11.09375 8.359375 -10.390625 8.40625 -9.078125 L 10.515625 -9.078125 C 10.484375 -11.546875 8.859375 -12.9375 5.953125 -12.9375 C 3.03125 -12.9375 1.125 -11.421875 1.125 -9.09375 C 1.125 -7.125 2.140625 -6.1875 5.109375 -5.46875 L 6.984375 -5.015625 C 8.375 -4.6875 8.921875 -4.265625 8.921875 -3.359375 C 8.921875 -2.1875 7.75 -1.484375 6 -1.484375 C 4.203125 -1.484375 3.1875 -1.921875 2.921875 -3.84375 L 0.8125 -3.84375 C 0.90625 -0.9375 2.546875 0.359375 5.828125 0.359375 C 9 0.359375 11.015625 -1.109375 11.015625 -3.53125 Z M 11.015625 -3.53125 "/>
</symbol>
<symbol overflow="visible" id="glyph0-16">
<path style="stroke:none;" d="M 12.546875 -6.171875 C 12.546875 -10.390625 10.484375 -12.9375 7.15625 -12.9375 C 5.453125 -12.9375 4.078125 -12.171875 3.140625 -10.6875 L 3.140625 -12.578125 L 1.3125 -12.578125 L 1.3125 5.234375 L 3.3125 5.234375 L 3.3125 -1.515625 C 4.375 -0.21875 5.546875 0.359375 7.171875 0.359375 C 10.421875 0.359375 12.546875 -2.15625 12.546875 -6.171875 Z M 10.46875 -6.21875 C 10.46875 -3.359375 9 -1.515625 6.8125 -1.515625 C 4.703125 -1.515625 3.3125 -3.234375 3.3125 -6.1875 C 3.3125 -9.140625 4.703125 -11.0625 6.8125 -11.0625 C 9.03125 -11.0625 10.46875 -9.21875 10.46875 -6.21875 Z M 10.46875 -6.21875 "/>
</symbol>
<symbol overflow="visible" id="glyph0-17">
<path style="stroke:none;" d="M 6.140625 -6.1875 C 6.140625 -9.984375 4.625 -14.359375 2.234375 -17.5 L 0.90625 -17.5 C 3.03125 -14.0625 4.203125 -10.03125 4.203125 -6.1875 C 4.203125 -2.375 3.03125 1.6875 0.90625 5.09375 L 2.234375 5.09375 C 4.625 1.9375 6.140625 -2.421875 6.140625 -6.1875 Z M 6.140625 -6.1875 "/>
</symbol>
<symbol overflow="visible" id="glyph1-0">
<path style="stroke:none;" d=""/>
</symbol>
<symbol overflow="visible" id="glyph1-1">
<path style="stroke:none;" d="M 8.578125 -8.421875 C 8.578125 -10.4375 7.015625 -11.90625 4.765625 -11.90625 C 2.328125 -11.90625 0.921875 -10.671875 0.84375 -7.78125 L 2.3125 -7.78125 C 2.4375 -9.78125 3.265625 -10.609375 4.71875 -10.609375 C 6.0625 -10.609375 7.078125 -9.65625 7.078125 -8.375 C 7.078125 -7.4375 6.515625 -6.640625 5.453125 -6.03125 L 3.90625 -5.15625 C 1.421875 -3.75 0.703125 -2.625 0.578125 0 L 8.5 0 L 8.5 -1.46875 L 2.234375 -1.46875 C 2.390625 -2.4375 2.921875 -3.0625 4.390625 -3.90625 L 6.0625 -4.828125 C 7.71875 -5.703125 8.578125 -6.953125 8.578125 -8.421875 Z M 8.578125 -8.421875 "/>
</symbol>
<symbol overflow="visible" id="glyph2-0">
<path style="stroke:none;" d=""/>
</symbol>
<symbol overflow="visible" id="glyph2-1">
<path style="stroke:none;" d="M 9 4.65625 C 7.984375 3.953125 7.5 3.515625 6.90625 2.734375 C 5.28125 0.5625 4.34375 -3.1875 4.34375 -7.625 C 4.34375 -11.671875 5.125 -15.265625 6.515625 -17.4375 C 7.171875 -18.453125 7.734375 -19.015625 9 -19.890625 L 8.609375 -20.40625 C 7.234375 -19.6875 6.625 -19.265625 5.84375 -18.546875 C 3.15625 -16.046875 1.59375 -12 1.59375 -7.625 C 1.59375 -3.515625 2.9375 0.265625 5.375 2.796875 C 6.265625 3.78125 6.984375 4.296875 8.609375 5.15625 Z M 9 4.65625 "/>
</symbol>
<symbol overflow="visible" id="glyph2-2">
<path style="stroke:none;" d="M 1.296875 5.15625 C 2.671875 4.40625 3.265625 4.015625 4.046875 3.296875 C 6.71875 0.8125 8.3125 -3.234375 8.3125 -7.625 C 8.3125 -11.734375 6.9375 -15.515625 4.53125 -18.0625 C 3.625 -19.015625 2.90625 -19.5625 1.296875 -20.40625 L 0.90625 -19.890625 C 1.953125 -19.171875 2.40625 -18.75 3 -17.96875 C 4.625 -15.8125 5.546875 -12.0625 5.546875 -7.625 C 5.546875 -3.5625 4.765625 0 3.390625 2.15625 C 2.703125 3.203125 2.125 3.8125 0.90625 4.65625 Z M 1.296875 5.15625 "/>
</symbol>
<symbol overflow="visible" id="glyph3-0">
<path style="stroke:none;" d=""/>
</symbol>
<symbol overflow="visible" id="glyph3-1">
<path style="stroke:none;" d="M 0 -3.625 L -17.5 -3.625 L -17.5 -1.625 L 0 -1.625 Z M 0 -3.625 "/>
</symbol>
<symbol overflow="visible" id="glyph3-2">
<path style="stroke:none;" d="M -6.1875 -12.234375 C -10.53125 -12.234375 -12.9375 -10.15625 -12.9375 -6.53125 C -12.9375 -3 -10.515625 -0.859375 -6.28125 -0.859375 C -2.0625 -0.859375 0.359375 -2.96875 0.359375 -6.546875 C 0.359375 -10.078125 -2.0625 -12.234375 -6.1875 -12.234375 Z M -6.21875 -10.15625 C -3.265625 -10.15625 -1.484375 -8.765625 -1.484375 -6.546875 C -1.484375 -4.3125 -3.234375 -2.953125 -6.28125 -2.953125 C -9.3125 -2.953125 -11.09375 -4.3125 -11.09375 -6.546875 C -11.09375 -8.8125 -9.34375 -10.15625 -6.21875 -10.15625 Z M -6.21875 -10.15625 "/>
</symbol>
<symbol overflow="visible" id="glyph3-3">
<path style="stroke:none;" d="M -2.0625 -11.734375 L -12.578125 -11.734375 L -12.578125 -9.890625 L -10.75 -9.890625 C -12.234375 -8.875 -12.9375 -7.65625 -12.9375 -6.046875 C -12.9375 -2.859375 -10.25 -0.703125 -6.171875 -0.703125 C -2.203125 -0.703125 0.359375 -2.921875 0.359375 -5.875 C 0.359375 -7.46875 -0.3125 -8.5625 -1.890625 -9.890625 L -1.0625 -9.890625 C 2.28125 -9.890625 3.546875 -8.515625 3.546875 -6.1875 C 3.546875 -4.609375 2.96875 -3.390625 1.4375 -3.140625 L 1.4375 -1.109375 C 3.8125 -1.3125 5.234375 -3.171875 5.234375 -6.125 C 5.234375 -10.0625 3.484375 -11.734375 -2.0625 -11.734375 Z M -6.21875 -9.703125 C -3.21875 -9.703125 -1.484375 -8.40625 -1.484375 -6.28125 C -1.484375 -4.109375 -3.234375 -2.78125 -6.28125 -2.78125 C -9.3125 -2.78125 -11.09375 -4.125 -11.09375 -6.265625 C -11.09375 -8.421875 -9.265625 -9.703125 -6.21875 -9.703125 Z M -6.21875 -9.703125 "/>
</symbol>
<symbol overflow="visible" id="glyph3-4">
<path style="stroke:none;" d="M 0 -12.796875 L -1.96875 -12.796875 L -1.96875 -4.15625 L -17.5 -4.15625 L -17.5 -1.921875 L 0 -1.921875 Z M 0 -12.796875 "/>
</symbol>
<symbol overflow="visible" id="glyph3-5">
<path style="stroke:none;" d="M -12.03125 -12.265625 C -14.90625 -12.265625 -17.015625 -10.03125 -17.015625 -6.8125 C -17.015625 -3.34375 -15.234375 -1.3125 -11.109375 -1.203125 L -11.109375 -3.3125 C -13.96875 -3.484375 -15.171875 -4.65625 -15.171875 -6.75 C -15.171875 -8.65625 -13.796875 -10.109375 -11.96875 -10.109375 C -10.625 -10.109375 -9.484375 -9.3125 -8.609375 -7.796875 L -7.375 -5.59375 C -5.359375 -2.046875 -3.75 -1.015625 0 -0.8125 L 0 -12.140625 L -2.09375 -12.140625 L -2.09375 -3.1875 C -3.484375 -3.40625 -4.375 -4.171875 -5.59375 -6.265625 L -6.890625 -8.65625 C -8.15625 -11.046875 -9.9375 -12.265625 -12.03125 -12.265625 Z M -12.03125 -12.265625 "/>
</symbol>
<symbol overflow="visible" id="glyph3-6">
<path style="stroke:none;" d="M -5.71875 -12.3125 C -7.53125 -12.3125 -8.6875 -12.171875 -9.625 -11.8125 C -11.6875 -10.984375 -12.9375 -9.078125 -12.9375 -6.71875 C -12.9375 -3.21875 -10.34375 -0.953125 -6.21875 -0.953125 C -2.09375 -0.953125 0.359375 -3.140625 0.359375 -6.671875 C 0.359375 -9.546875 -1.265625 -11.546875 -3.8125 -12.046875 L -3.8125 -10.03125 C -2.15625 -9.484375 -1.484375 -8.359375 -1.484375 -6.75 C -1.484375 -4.65625 -2.828125 -3.09375 -5.71875 -3.046875 Z M -7.484375 -10.171875 C -7.484375 -10.171875 -7.390625 -10.171875 -7.34375 -10.15625 L -7.34375 -3.09375 C -9.578125 -3.265625 -11.09375 -4.6875 -11.09375 -6.703125 C -11.09375 -8.65625 -9.453125 -10.171875 -7.484375 -10.171875 Z M -7.484375 -10.171875 "/>
</symbol>
<symbol overflow="visible" id="glyph3-7">
<path style="stroke:none;" d="M -10.828125 -7.703125 L -12.859375 -7.703125 C -12.90625 -7.375 -12.9375 -7.203125 -12.9375 -6.9375 C -12.9375 -5.640625 -12.171875 -4.65625 -10.296875 -3.5 L -12.578125 -3.5 L -12.578125 -1.6875 L 0 -1.6875 L 0 -3.671875 L -6.53125 -3.671875 C -9.359375 -3.671875 -10.78125 -4.609375 -10.828125 -7.703125 Z M -10.828125 -7.703125 "/>
</symbol>
<symbol overflow="visible" id="glyph4-0">
<path style="stroke:none;" d=""/>
</symbol>
<symbol overflow="visible" id="glyph4-1">
<path style="stroke:none;" d="M -8.421875 -8.578125 C -10.4375 -8.578125 -11.90625 -7.015625 -11.90625 -4.765625 C -11.90625 -2.328125 -10.671875 -0.921875 -7.78125 -0.84375 L -7.78125 -2.3125 C -9.78125 -2.4375 -10.609375 -3.265625 -10.609375 -4.71875 C -10.609375 -6.0625 -9.65625 -7.078125 -8.375 -7.078125 C -7.4375 -7.078125 -6.640625 -6.515625 -6.03125 -5.453125 L -5.15625 -3.90625 C -3.75 -1.421875 -2.625 -0.703125 0 -0.578125 L 0 -8.5 L -1.46875 -8.5 L -1.46875 -2.234375 C -2.4375 -2.390625 -3.0625 -2.921875 -3.90625 -4.390625 L -4.828125 -6.0625 C -5.703125 -7.71875 -6.953125 -8.578125 -8.421875 -8.578125 Z M -8.421875 -8.578125 "/>
</symbol>
<symbol overflow="visible" id="glyph5-0">
<path style="stroke:none;" d=""/>
</symbol>
<symbol overflow="visible" id="glyph5-1">
<path style="stroke:none;" d="M 4.65625 -9 C 3.953125 -7.984375 3.515625 -7.5 2.734375 -6.90625 C 0.5625 -5.28125 -3.1875 -4.34375 -7.625 -4.34375 C -11.671875 -4.34375 -15.265625 -5.125 -17.4375 -6.515625 C -18.453125 -7.171875 -19.015625 -7.734375 -19.890625 -9 L -20.40625 -8.609375 C -19.6875 -7.234375 -19.265625 -6.625 -18.546875 -5.84375 C -16.046875 -3.15625 -12 -1.59375 -7.625 -1.59375 C -3.515625 -1.59375 0.265625 -2.9375 2.796875 -5.375 C 3.78125 -6.265625 4.296875 -6.984375 5.15625 -8.609375 Z M 4.65625 -9 "/>
</symbol>
<symbol overflow="visible" id="glyph5-2">
<path style="stroke:none;" d="M 5.15625 -1.296875 C 4.40625 -2.671875 4.015625 -3.265625 3.296875 -4.046875 C 0.8125 -6.71875 -3.234375 -8.3125 -7.625 -8.3125 C -11.734375 -8.3125 -15.515625 -6.9375 -18.0625 -4.53125 C -19.015625 -3.625 -19.5625 -2.90625 -20.40625 -1.296875 L -19.890625 -0.90625 C -19.171875 -1.953125 -18.75 -2.40625 -17.96875 -3 C -15.8125 -4.625 -12.0625 -5.546875 -7.625 -5.546875 C -3.5625 -5.546875 0 -4.765625 2.15625 -3.390625 C 3.203125 -2.703125 3.8125 -2.125 4.65625 -0.90625 Z M 5.15625 -1.296875 "/>
</symbol>
<symbol overflow="visible" id="glyph6-0">
<path style="stroke:none;" d=""/>
</symbol>
<symbol overflow="visible" id="glyph6-1">
<path style="stroke:none;" d=""/>
</symbol>
<symbol overflow="visible" id="glyph7-0">
<path style="stroke:none;" d=""/>
</symbol>
<symbol overflow="visible" id="glyph7-1">
<path style="stroke:none;" d="M 5.796875 -4.890625 L 5.796875 -6.359375 L 0.9375 -6.359375 L 0.9375 -4.890625 Z M 5.796875 -4.890625 "/>
</symbol>
<symbol overflow="visible" id="glyph7-2">
<path style="stroke:none;" d="M 10.46875 -4.078125 C 10.46875 -5.6875 9.65625 -6.8125 7.984375 -7.609375 C 9.46875 -8.515625 9.953125 -9.25 9.953125 -10.609375 C 9.953125 -12.875 8.1875 -14.46875 5.609375 -14.46875 C 3.0625 -14.46875 1.265625 -12.875 1.265625 -10.609375 C 1.265625 -9.265625 1.75 -8.53125 3.21875 -7.609375 C 1.578125 -6.8125 0.75 -5.6875 0.75 -4.109375 C 0.75 -1.453125 2.75 0.3125 5.609375 0.3125 C 8.46875 0.3125 10.46875 -1.453125 10.46875 -4.078125 Z M 8.125 -10.578125 C 8.125 -9.21875 7.125 -8.328125 5.609375 -8.328125 C 4.109375 -8.328125 3.109375 -9.21875 3.109375 -10.59375 C 3.109375 -11.984375 4.109375 -12.875 5.609375 -12.875 C 7.140625 -12.875 8.125 -11.984375 8.125 -10.578125 Z M 8.625 -4.0625 C 8.625 -2.34375 7.40625 -1.28125 5.578125 -1.28125 C 3.8125 -1.28125 2.59375 -2.359375 2.59375 -4.0625 C 2.59375 -5.75 3.8125 -6.8125 5.609375 -6.8125 C 7.40625 -6.8125 8.625 -5.75 8.625 -4.0625 Z M 8.625 -4.0625 "/>
</symbol>
<symbol overflow="visible" id="glyph7-3">
<path style="stroke:none;" d="M 10.609375 -12.65625 L 10.609375 -14.15625 L 0.9375 -14.15625 L 0.9375 -12.390625 L 8.75 -12.390625 C 5.875 -8.75 3.84375 -4.53125 2.8125 0 L 4.734375 0 C 5.53125 -4.671875 7.578125 -9.046875 10.609375 -12.65625 Z M 10.609375 -12.65625 "/>
</symbol>
<symbol overflow="visible" id="glyph7-4">
<path style="stroke:none;" d="M 10.46875 -4.484375 C 10.46875 -7.1875 8.625 -9 6.046875 -9 C 4.609375 -9 3.484375 -8.453125 2.71875 -7.390625 C 2.734375 -10.921875 3.875 -12.875 5.9375 -12.875 C 7.203125 -12.875 8.078125 -12.078125 8.359375 -10.6875 L 10.15625 -10.6875 C 9.8125 -13.0625 8.265625 -14.46875 6.0625 -14.46875 C 2.6875 -14.46875 0.875 -11.625 0.875 -6.59375 C 0.875 -2.078125 2.421875 0.3125 5.734375 0.3125 C 8.484375 0.3125 10.46875 -1.65625 10.46875 -4.484375 Z M 8.625 -4.34375 C 8.625 -2.53125 7.40625 -1.28125 5.75 -1.28125 C 4.078125 -1.28125 2.8125 -2.59375 2.8125 -4.453125 C 2.8125 -6.25 4.046875 -7.40625 5.8125 -7.40625 C 7.546875 -7.40625 8.625 -6.28125 8.625 -4.34375 Z M 8.625 -4.34375 "/>
</symbol>
<symbol overflow="visible" id="glyph7-5">
<path style="stroke:none;" d="M 10.46875 -4.796875 C 10.46875 -7.65625 8.578125 -9.53125 5.796875 -9.53125 C 4.78125 -9.53125 3.953125 -9.265625 3.125 -8.65625 L 3.6875 -12.390625 L 9.71875 -12.390625 L 9.71875 -14.15625 L 2.25 -14.15625 L 1.15625 -6.59375 L 2.8125 -6.59375 C 3.65625 -7.59375 4.34375 -7.9375 5.46875 -7.9375 C 7.40625 -7.9375 8.625 -6.6875 8.625 -4.546875 C 8.625 -2.46875 7.421875 -1.28125 5.46875 -1.28125 C 3.890625 -1.28125 2.9375 -2.078125 2.515625 -3.71875 L 0.71875 -3.71875 C 1.3125 -0.84375 2.9375 0.3125 5.515625 0.3125 C 8.421875 0.3125 10.46875 -1.734375 10.46875 -4.796875 Z M 10.46875 -4.796875 "/>
</symbol>
<symbol overflow="visible" id="glyph7-6">
<path style="stroke:none;" d="M 10.609375 -3.46875 L 10.609375 -5.078125 L 8.46875 -5.078125 L 8.46875 -14.46875 L 7.140625 -14.46875 L 0.578125 -5.359375 L 0.578125 -3.46875 L 6.671875 -3.46875 L 6.671875 0 L 8.46875 0 L 8.46875 -3.46875 Z M 6.671875 -5.078125 L 2.140625 -5.078125 L 6.671875 -11.40625 Z M 6.671875 -5.078125 "/>
</symbol>
<symbol overflow="visible" id="glyph7-7">
<path style="stroke:none;" d="M 10.328125 -4.203125 C 10.328125 -5.953125 9.609375 -6.984375 7.875 -7.578125 C 9.21875 -8.09375 9.890625 -9.046875 9.890625 -10.484375 C 9.890625 -12.984375 8.25 -14.46875 5.484375 -14.46875 C 2.578125 -14.46875 1.015625 -12.875 0.953125 -9.796875 L 2.75 -9.796875 C 2.796875 -11.9375 3.671875 -12.890625 5.515625 -12.890625 C 7.09375 -12.890625 8.0625 -11.953125 8.0625 -10.421875 C 8.0625 -8.875 7.390625 -8.25 4.515625 -8.25 L 4.515625 -6.734375 L 5.484375 -6.734375 C 7.46875 -6.734375 8.484375 -5.796875 8.484375 -4.1875 C 8.484375 -2.359375 7.359375 -1.28125 5.484375 -1.28125 C 3.53125 -1.28125 2.578125 -2.265625 2.453125 -4.359375 L 0.65625 -4.359375 C 0.875 -1.140625 2.46875 0.3125 5.421875 0.3125 C 8.40625 0.3125 10.328125 -1.46875 10.328125 -4.203125 Z M 10.328125 -4.203125 "/>
</symbol>
<symbol overflow="visible" id="glyph8-0">
<path style="stroke:none;" d=""/>
</symbol>
<symbol overflow="visible" id="glyph8-1">
<path style="stroke:none;" d="M -4.890625 -5.796875 L -6.359375 -5.796875 L -6.359375 -0.9375 L -4.890625 -0.9375 Z M -4.890625 -5.796875 "/>
</symbol>
<symbol overflow="visible" id="glyph8-2">
<path style="stroke:none;" d="M -10.21875 -10.421875 C -12.671875 -10.421875 -14.46875 -8.53125 -14.46875 -5.796875 C -14.46875 -2.84375 -12.953125 -1.125 -9.453125 -1.015625 L -9.453125 -2.8125 C -11.875 -2.953125 -12.890625 -3.953125 -12.890625 -5.734375 C -12.890625 -7.359375 -11.734375 -8.59375 -10.1875 -8.59375 C -9.046875 -8.59375 -8.0625 -7.921875 -7.328125 -6.625 L -6.265625 -4.75 C -4.546875 -1.734375 -3.1875 -0.859375 0 -0.6875 L 0 -10.328125 L -1.78125 -10.328125 L -1.78125 -2.71875 C -2.953125 -2.890625 -3.71875 -3.546875 -4.75 -5.328125 L -5.859375 -7.359375 C -6.9375 -9.390625 -8.453125 -10.421875 -10.21875 -10.421875 Z M -10.21875 -10.421875 "/>
</symbol>
<symbol overflow="visible" id="glyph8-3">
<path style="stroke:none;" d="M -6.953125 -10.34375 C -11.984375 -10.34375 -14.46875 -8.75 -14.46875 -5.609375 C -14.46875 -2.484375 -11.9375 -0.875 -7.078125 -0.875 C -2.203125 -0.875 0.3125 -2.515625 0.3125 -5.609375 C 0.3125 -8.671875 -2.203125 -10.34375 -6.953125 -10.34375 Z M -7.125 -8.515625 C -3.015625 -8.515625 -1.1875 -7.578125 -1.1875 -5.578125 C -1.1875 -3.671875 -3.109375 -2.71875 -7.0625 -2.71875 C -11.015625 -2.71875 -12.875 -3.671875 -12.875 -5.609375 C -12.875 -7.546875 -11 -8.515625 -7.125 -8.515625 Z M -7.125 -8.515625 "/>
</symbol>
<symbol overflow="visible" id="glyph8-4">
<path style="stroke:none;" d="M 0 -7.078125 L -14.46875 -7.078125 L -14.46875 -5.890625 C -12.25 -5.265625 -11.9375 -4.859375 -11.59375 -2.078125 L -10.3125 -2.078125 L -10.3125 -5.28125 L 0 -5.28125 Z M 0 -7.078125 "/>
</symbol>
<symbol overflow="visible" id="glyph8-5">
<path style="stroke:none;" d="M -4.078125 -10.46875 C -5.6875 -10.46875 -6.8125 -9.65625 -7.609375 -7.984375 C -8.515625 -9.46875 -9.25 -9.953125 -10.609375 -9.953125 C -12.875 -9.953125 -14.46875 -8.1875 -14.46875 -5.609375 C -14.46875 -3.0625 -12.875 -1.265625 -10.609375 -1.265625 C -9.265625 -1.265625 -8.53125 -1.75 -7.609375 -3.21875 C -6.8125 -1.578125 -5.6875 -0.75 -4.109375 -0.75 C -1.453125 -0.75 0.3125 -2.75 0.3125 -5.609375 C 0.3125 -8.46875 -1.453125 -10.46875 -4.078125 -10.46875 Z M -10.578125 -8.125 C -9.21875 -8.125 -8.328125 -7.125 -8.328125 -5.609375 C -8.328125 -4.109375 -9.21875 -3.109375 -10.59375 -3.109375 C -11.984375 -3.109375 -12.875 -4.109375 -12.875 -5.609375 C -12.875 -7.140625 -11.984375 -8.125 -10.578125 -8.125 Z M -4.0625 -8.625 C -2.34375 -8.625 -1.28125 -7.40625 -1.28125 -5.578125 C -1.28125 -3.8125 -2.359375 -2.59375 -4.0625 -2.59375 C -5.75 -2.59375 -6.8125 -3.8125 -6.8125 -5.609375 C -6.8125 -7.40625 -5.75 -8.625 -4.0625 -8.625 Z M -4.0625 -8.625 "/>
</symbol>
<symbol overflow="visible" id="glyph8-6">
<path style="stroke:none;" d="M -4.484375 -10.46875 C -7.1875 -10.46875 -9 -8.625 -9 -6.046875 C -9 -4.609375 -8.453125 -3.484375 -7.390625 -2.71875 C -10.921875 -2.734375 -12.875 -3.875 -12.875 -5.9375 C -12.875 -7.203125 -12.078125 -8.078125 -10.6875 -8.359375 L -10.6875 -10.15625 C -13.0625 -9.8125 -14.46875 -8.265625 -14.46875 -6.0625 C -14.46875 -2.6875 -11.625 -0.875 -6.59375 -0.875 C -2.078125 -0.875 0.3125 -2.421875 0.3125 -5.734375 C 0.3125 -8.484375 -1.65625 -10.46875 -4.484375 -10.46875 Z M -4.34375 -8.625 C -2.53125 -8.625 -1.28125 -7.40625 -1.28125 -5.75 C -1.28125 -4.078125 -2.59375 -2.8125 -4.453125 -2.8125 C -6.25 -2.8125 -7.40625 -4.046875 -7.40625 -5.8125 C -7.40625 -7.546875 -6.28125 -8.625 -4.34375 -8.625 Z M -4.34375 -8.625 "/>
</symbol>
<symbol overflow="visible" id="glyph8-7">
<path style="stroke:none;" d="M -3.46875 -10.609375 L -5.078125 -10.609375 L -5.078125 -8.46875 L -14.46875 -8.46875 L -14.46875 -7.140625 L -5.359375 -0.578125 L -3.46875 -0.578125 L -3.46875 -6.671875 L 0 -6.671875 L 0 -8.46875 L -3.46875 -8.46875 Z M -5.078125 -6.671875 L -5.078125 -2.140625 L -11.40625 -6.671875 Z M -5.078125 -6.671875 "/>
</symbol>
</g>
</defs>
<g id="surface4750">
<rect x="0" y="0" width="504" height="504" style="fill:rgb(100%,100%,100%);fill-opacity:1;stroke:none;"/>
<path style="fill:none;stroke-width:0.75;stroke-linecap:round;stroke-linejoin:round;stroke:rgb(0%,0%,100%);stroke-opacity:1;stroke-miterlimit:10;" d="M 488.160156 114.546875 L 481.234375 72.679688 L 474.703125 125.152344 L 468.523438 82.605469 L 462.664062 134.65625 L 457.089844 91.542969 L 451.773438 143.238281 L 446.695312 99.683594 L 441.832031 151.082031 L 437.167969 107.152344 L 432.683594 158.296875 L 428.371094 114.054688 L 424.21875 164.972656 L 420.207031 120.472656 L 416.335938 171.195312 L 412.585938 126.464844 L 408.960938 177.019531 L 405.445312 132.085938 L 402.03125 182.488281 L 398.722656 137.378906 L 395.503906 187.648438 L 392.371094 142.382812 L 389.324219 192.53125 L 386.355469 147.125 L 383.464844 197.164062 L 380.640625 151.636719 L 377.886719 201.574219 L 375.199219 155.929688 L 372.574219 205.78125 L 370.003906 160.035156 L 367.492188 209.796875 L 365.035156 163.960938 L 362.632812 213.648438 L 360.273438 167.722656 L 357.964844 217.339844 L 355.703125 171.339844 L 353.484375 220.890625 L 351.308594 174.816406 L 349.171875 224.304688 L 347.078125 178.164062 L 345.015625 227.597656 L 342.996094 181.394531 L 341.007812 230.777344 L 339.054688 184.515625 L 337.132812 233.847656 L 335.246094 187.53125 L 333.386719 236.816406 L 331.558594 190.453125 L 329.761719 239.695312 L 327.988281 193.28125 L 326.242188 242.480469 L 324.527344 196.027344 L 322.832031 245.1875 L 321.164062 198.691406 L 319.519531 247.816406 L 317.898438 201.28125 L 316.300781 250.371094 L 314.726562 203.796875 L 313.171875 252.855469 L 311.636719 206.246094 L 310.125 255.273438 L 308.628906 208.632812 L 307.15625 257.632812 L 305.699219 210.957031 L 304.261719 259.929688 L 302.84375 213.226562 L 301.441406 262.167969 L 300.058594 215.4375 L 298.6875 264.355469 L 297.335938 217.597656 L 296 266.492188 L 294.679688 219.707031 L 293.375 268.578125 L 292.082031 221.769531 L 290.804688 270.621094 L 289.542969 223.789062 L 288.292969 272.617188 L 287.058594 225.761719 L 285.835938 274.570312 L 284.628906 227.691406 L 283.429688 276.480469 L 282.246094 229.585938 L 281.074219 278.355469 L 279.914062 231.4375 L 278.765625 280.1875 L 277.628906 233.253906 L 276.503906 281.988281 L 275.390625 235.035156 L 274.285156 283.753906 L 273.191406 236.78125 L 272.109375 285.484375 L 271.035156 238.496094 L 269.972656 287.183594 L 268.917969 240.179688 L 267.875 288.851562 L 266.84375 241.828125 L 265.816406 290.488281 L 264.800781 243.453125 L 263.796875 292.097656 L 262.796875 245.046875 L 261.808594 293.675781 L 260.828125 246.613281 L 259.855469 295.230469 L 258.890625 248.15625 L 257.933594 296.757812 L 256.984375 249.667969 L 256.046875 298.261719 L 255.113281 251.160156 L 254.1875 299.742188 L 253.269531 252.625 L 252.359375 301.195312 L 251.457031 254.070312 L 250.558594 302.628906 L 249.671875 255.492188 L 248.789062 304.039062 L 247.914062 256.890625 L 247.042969 305.425781 L 246.183594 258.265625 L 245.324219 306.792969 L 244.476562 259.625 L 243.632812 308.140625 L 242.796875 260.960938 L 241.964844 309.46875 L 241.140625 262.28125 L 240.320312 310.777344 L 239.507812 263.578125 L 238.699219 312.070312 L 237.898438 264.859375 L 237.101562 313.34375 L 236.3125 266.125 L 235.527344 314.597656 L 234.746094 267.371094 L 233.972656 315.835938 L 233.203125 268.601562 L 232.4375 317.058594 L 231.679688 269.8125 L 230.925781 318.261719 L 230.175781 271.011719 L 229.429688 319.453125 L 228.691406 272.191406 L 227.957031 320.625 L 227.226562 273.359375 L 226.5 321.785156 L 225.78125 274.511719 L 225.0625 322.929688 L 224.351562 275.648438 L 223.644531 324.0625 L 222.941406 276.773438 L 222.242188 325.179688 L 221.546875 277.882812 L 220.855469 326.28125 L 220.171875 278.980469 L 219.488281 327.371094 L 218.808594 280.0625 L 218.136719 328.449219 L 217.464844 281.132812 L 216.800781 329.511719 L 216.136719 282.191406 L 215.480469 330.566406 L 214.824219 283.238281 L 214.171875 331.609375 L 213.523438 284.273438 L 212.882812 332.636719 L 212.242188 285.296875 L 211.605469 333.65625 L 210.972656 286.308594 L 210.34375 334.65625 L 209.71875 287.308594 L 209.09375 335.652344 L 208.472656 288.296875 L 207.859375 336.640625 L 207.246094 289.277344 L 206.636719 337.613281 L 206.03125 290.246094 L 205.425781 338.578125 L 204.828125 291.203125 L 204.230469 339.527344 L 203.636719 292.152344 L 203.046875 340.476562 L 202.460938 293.089844 L 201.875 341.410156 L 201.292969 294.019531 L 200.714844 342.335938 L 200.140625 294.941406 L 199.566406 343.25 L 198.996094 295.851562 L 198.429688 344.15625 L 197.867188 296.753906 L 197.304688 345.046875 L 196.746094 297.648438 L 196.1875 345.941406 L 195.636719 298.53125 L 195.085938 346.824219 L 194.539062 299.40625 L 193.992188 347.691406 L 193.449219 300.273438 L 192.910156 348.558594 L 192.371094 301.132812 L 191.835938 349.414062 L 191.304688 301.984375 L 190.773438 350.265625 L 190.246094 302.828125 L 189.71875 351.105469 L 189.195312 303.664062 L 188.675781 351.929688 L 188.15625 304.492188 L 187.640625 352.757812 L 187.128906 305.320312 L 186.617188 353.574219 L 186.109375 306.125 L 185.601562 354.382812 L 185.097656 306.933594 L 184.59375 355.160156 L 184.09375 307.734375 L 183.597656 355.980469 L 183.101562 308.523438 L 182.609375 356.78125 L 182.117188 309.3125 L 181.628906 357.558594 L 181.140625 310.089844 L 180.65625 358.328125 L 180.171875 310.859375 L 179.691406 359.101562 L 179.210938 311.628906 L 178.734375 359.859375 L 178.257812 312.386719 L 177.785156 360.605469 L 177.316406 313.136719 L 176.84375 361.359375 L 176.378906 313.886719 L 175.914062 362.109375 L 175.449219 314.628906 L 174.988281 362.824219 L 174.527344 315.363281 L 174.070312 363.5625 L 173.613281 316.09375 L 173.160156 364.289062 L 172.707031 316.8125 L 172.257812 365.015625 L 171.808594 317.527344 L 171.359375 365.746094 L 170.914062 318.242188 L 170.472656 366.449219 L 170.027344 318.949219 L 169.589844 367.144531 L 169.148438 319.65625 L 168.714844 367.859375 L 168.277344 320.339844 L 167.84375 368.535156 L 167.410156 321.039062 L 166.980469 369.226562 L 166.554688 321.710938 L 166.125 369.921875 L 165.699219 322.398438 L 165.277344 370.585938 L 164.855469 323.074219 L 164.433594 371.273438 L 164.015625 323.742188 L 163.597656 371.925781 L 163.179688 324.421875 L 162.765625 372.597656 L 162.351562 325.074219 L 161.941406 373.246094 L 161.53125 325.722656 L 161.121094 373.886719 L 160.714844 326.378906 L 160.308594 374.566406 L 159.902344 327.019531 L 159.5 375.191406 L 159.097656 327.675781 L 158.699219 375.839844 L 158.300781 328.300781 L 157.902344 376.480469 L 157.507812 328.9375 L 157.109375 377.09375 L 156.71875 329.566406 L 156.324219 377.765625 L 155.933594 330.183594 L 155.546875 378.316406 L 155.15625 330.8125 L 154.769531 378.9375 L 154.386719 331.421875 L 154 379.605469 L 153.617188 332.023438 L 153.238281 380.210938 L 152.855469 332.648438 L 152.476562 380.84375 L 152.101562 333.25 L 151.722656 381.40625 L 151.347656 333.863281 L 150.976562 382.019531 L 150.601562 334.449219 L 150.230469 382.597656 L 149.859375 335.0625 L 149.492188 383.195312 L 149.121094 335.644531 L 148.757812 383.785156 L 148.390625 336.222656 L 148.027344 384.394531 L 147.664062 336.808594 L 147.300781 384.910156 L 146.941406 337.410156 L 146.578125 385.535156 L 146.222656 337.933594 L 145.863281 386.03125 L 145.507812 338.496094 L 145.152344 386.613281 L 144.796875 339.070312 L 144.445312 387.273438 L 144.09375 339.652344 L 143.742188 387.765625 L 143.390625 340.144531 L 143.042969 388.304688 L 142.695312 340.746094 L 142.347656 388.839844 L 142 341.300781 L 141.65625 389.464844 L 141.3125 341.855469 L 140.96875 390.09375 L 140.628906 342.390625 L 140.289062 390.539062 L 139.949219 342.917969 L 139.609375 391.09375 L 139.273438 343.476562 L 138.9375 391.628906 L 138.601562 344.011719 L 138.265625 392.09375 L 137.933594 344.585938 L 137.601562 392.632812 L 137.269531 345.070312 L 136.9375 393.199219 L 136.609375 345.640625 L 136.277344 393.664062 L 135.949219 346.113281 L 135.625 394.394531 L 135.296875 346.65625 L 134.972656 394.742188 L 134.648438 347.148438 L 134.324219 395.339844 L 134.003906 347.695312 L 133.683594 395.722656 L 133.363281 348.226562 L 133.042969 396.375 L 132.722656 348.738281 L 132.40625 396.816406 L 132.089844 349.1875 L 131.773438 397.300781 L 131.457031 349.675781 L 131.144531 397.609375 L 130.828125 350.222656 L 130.515625 398.4375 L 130.203125 350.722656 L 129.894531 398.761719 L 129.582031 351.199219 L 129.273438 399.226562 L 128.964844 351.773438 L 128.660156 399.796875 L 128.351562 352.1875 L 128.046875 400.316406 L 127.742188 352.664062 L 127.4375 400.96875 L 127.132812 353.175781 L 126.832031 401.203125 L 126.527344 353.667969 L 126.226562 401.710938 L 125.925781 354.191406 L 125.628906 402.207031 L 125.328125 354.554688 L 125.03125 402.765625 L 124.734375 355.070312 L 124.4375 403.257812 L 124.140625 355.613281 L 123.847656 403.625 L 123.554688 356.050781 L 123.257812 404.042969 L 122.96875 356.445312 L 122.675781 404.5 L 122.382812 356.972656 L 122.09375 404.945312 L 121.804688 357.453125 L 121.515625 405.558594 L 121.226562 357.816406 L 120.9375 406.195312 L 120.652344 358.34375 L 120.367188 406.390625 L 120.082031 358.792969 L 119.796875 406.984375 L 119.511719 359.257812 L 119.230469 407.394531 L 118.945312 359.667969 L 118.664062 407.921875 L 118.382812 360.0625 L 118.105469 408.148438 "/>
<g style="fill:rgb(0%,0%,0%);fill-opacity:1;">
  <use xlink:href="#glyph0-1" x="251.160156" y="494.672852"/>
</g>
<g style="fill:rgb(0%,0%,0%);fill-opacity:1;">
  <use xlink:href="#glyph0-2" x="257.160156" y="494.672852"/>
</g>
<g style="fill:rgb(0%,0%,0%);fill-opacity:1;">
  <use xlink:href="#glyph0-3" x="271.160156" y="494.672852"/>
</g>
<g style="fill:rgb(0%,0%,0%);fill-opacity:1;">
  <use xlink:href="#glyph1-1" x="285.160156" y="498.958008"/>
</g>
<g style="fill:rgb(0%,0%,0%);fill-opacity:1;">
  <use xlink:href="#glyph2-1" x="295.160156" y="494.420898"/>
</g>
<g style="fill:rgb(0%,0%,0%);fill-opacity:1;">
  <use xlink:href="#glyph0-4" x="305.160156" y="494.672852"/>
</g>
<g style="fill:rgb(0%,0%,0%);fill-opacity:1;">
  <use xlink:href="#glyph2-2" x="319.160156" y="494.420898"/>
</g>
<g style="fill:rgb(0%,0%,0%);fill-opacity:1;">
  <use xlink:href="#glyph3-1" x="23.790039" y="315.699219"/>
</g>
<g style="fill:rgb(0%,0%,0%);fill-opacity:1;">
  <use xlink:href="#glyph3-2" x="23.790039" y="309.699219"/>
</g>
<g style="fill:rgb(0%,0%,0%);fill-opacity:1;">
  <use xlink:href="#glyph3-3" x="23.790039" y="295.699219"/>
</g>
<g style="fill:rgb(0%,0%,0%);fill-opacity:1;">
  <use xlink:href="#glyph4-1" x="28.075195" y="281.699219"/>
</g>
<g style="fill:rgb(0%,0%,0%);fill-opacity:1;">
  <use xlink:href="#glyph5-1" x="23.538086" y="271.699219"/>
</g>
<g style="fill:rgb(0%,0%,0%);fill-opacity:1;">
  <use xlink:href="#glyph3-4" x="23.790039" y="261.699219"/>
  <use xlink:href="#glyph3-5" x="23.790039" y="248.355469"/>
</g>
<g style="fill:rgb(0%,0%,0%);fill-opacity:1;">
  <use xlink:href="#glyph6-1" x="23.478516" y="234.699219"/>
</g>
<g style="fill:rgb(0%,0%,0%);fill-opacity:1;">
  <use xlink:href="#glyph3-6" x="23.790039" y="228.699219"/>
</g>
<g style="fill:rgb(0%,0%,0%);fill-opacity:1;">
  <use xlink:href="#glyph3-7" x="23.790039" y="214.699219"/>
</g>
<g style="fill:rgb(0%,0%,0%);fill-opacity:1;">
  <use xlink:href="#glyph3-7" x="23.790039" y="206.699219"/>
</g>
<g style="fill:rgb(0%,0%,0%);fill-opacity:1;">
  <use xlink:href="#glyph3-2" x="23.790039" y="198.699219"/>
</g>
<g style="fill:rgb(0%,0%,0%);fill-opacity:1;">
  <use xlink:href="#glyph3-7" x="23.790039" y="184.699219"/>
</g>
<g style="fill:rgb(0%,0%,0%);fill-opacity:1;">
  <use xlink:href="#glyph5-2" x="23.538086" y="176.699219"/>
</g>
<path style="fill:none;stroke-width:2.25;stroke-linecap:round;stroke-linejoin:round;stroke:rgb(100%,0%,0%);stroke-opacity:1;stroke-dasharray:9,9;stroke-miterlimit:10;" d="M 488.160156 119.359375 L 481.234375 124.898438 L 474.703125 130.121094 L 468.523438 135.0625 L 462.664062 139.746094 L 457.089844 144.207031 L 451.773438 148.457031 L 446.695312 152.515625 L 441.832031 156.40625 L 437.167969 160.136719 L 432.683594 163.71875 L 428.371094 167.167969 L 424.21875 170.492188 L 420.207031 173.699219 L 416.335938 176.792969 L 412.585938 179.789062 L 408.960938 182.691406 L 405.445312 185.503906 L 402.03125 188.230469 L 398.722656 190.878906 L 395.503906 193.453125 L 392.371094 195.957031 L 389.324219 198.394531 L 386.355469 200.765625 L 383.464844 203.082031 L 380.640625 205.335938 L 377.886719 207.539062 L 375.199219 209.6875 L 372.574219 211.789062 L 370.003906 213.84375 L 367.492188 215.851562 L 365.035156 217.816406 L 362.632812 219.738281 L 360.273438 221.625 L 357.964844 223.46875 L 355.703125 225.277344 L 353.484375 227.054688 L 351.308594 228.792969 L 349.171875 230.5 L 347.078125 232.179688 L 345.015625 233.824219 L 342.996094 235.441406 L 341.007812 237.03125 L 339.054688 238.59375 L 337.132812 240.128906 L 335.246094 241.636719 L 333.386719 243.125 L 331.558594 244.585938 L 329.761719 246.023438 L 327.988281 247.441406 L 326.242188 248.835938 L 324.527344 250.210938 L 322.832031 251.5625 L 321.164062 252.898438 L 319.519531 254.214844 L 317.898438 255.507812 L 316.300781 256.785156 L 314.726562 258.046875 L 313.171875 259.289062 L 311.636719 260.515625 L 310.125 261.726562 L 308.628906 262.921875 L 307.15625 264.101562 L 305.699219 265.265625 L 304.261719 266.414062 L 302.84375 267.550781 L 301.441406 268.671875 L 300.058594 269.777344 L 298.6875 270.871094 L 297.335938 271.953125 L 296 273.023438 L 294.679688 274.078125 L 293.375 275.121094 L 292.082031 276.15625 L 290.804688 277.175781 L 289.542969 278.1875 L 288.292969 279.183594 L 287.058594 280.171875 L 285.835938 281.148438 L 284.628906 282.117188 L 283.429688 283.074219 L 282.246094 284.019531 L 281.074219 284.957031 L 279.914062 285.882812 L 278.765625 286.804688 L 277.628906 287.710938 L 276.503906 288.613281 L 275.390625 289.503906 L 274.285156 290.386719 L 273.191406 291.261719 L 272.109375 292.125 L 271.035156 292.984375 L 269.972656 293.835938 L 268.917969 294.675781 L 267.875 295.511719 L 266.84375 296.339844 L 265.816406 297.15625 L 264.800781 297.96875 L 263.796875 298.773438 L 262.796875 299.574219 L 261.808594 300.363281 L 260.828125 301.148438 L 259.855469 301.925781 L 258.890625 302.695312 L 257.933594 303.460938 L 256.984375 304.21875 L 256.046875 304.972656 L 255.113281 305.71875 L 254.1875 306.457031 L 253.269531 307.191406 L 252.359375 307.917969 L 251.457031 308.640625 L 250.558594 309.359375 L 249.671875 310.070312 L 248.789062 310.773438 L 247.914062 311.476562 L 247.042969 312.171875 L 246.183594 312.859375 L 245.324219 313.542969 L 244.476562 314.222656 L 243.632812 314.898438 L 242.796875 315.566406 L 241.964844 316.230469 L 241.140625 316.890625 L 240.320312 317.546875 L 239.507812 318.195312 L 238.699219 318.84375 L 237.898438 319.484375 L 237.101562 320.121094 L 236.3125 320.753906 L 235.527344 321.382812 L 234.746094 322.003906 L 233.972656 322.625 L 233.203125 323.238281 L 232.4375 323.851562 L 231.679688 324.457031 L 230.925781 325.0625 L 230.175781 325.660156 L 229.429688 326.253906 L 228.691406 326.847656 L 227.957031 327.433594 L 227.226562 328.015625 L 226.5 328.597656 L 225.78125 329.175781 L 225.0625 329.746094 L 224.351562 330.316406 L 223.644531 330.882812 L 222.941406 331.445312 L 222.242188 332.003906 L 221.546875 332.558594 L 220.855469 333.109375 L 220.171875 333.660156 L 219.488281 334.203125 L 218.808594 334.746094 L 217.464844 335.824219 L 216.136719 336.886719 L 214.824219 337.933594 L 214.171875 338.457031 L 213.523438 338.972656 L 212.882812 339.488281 L 212.242188 340 L 211.605469 340.507812 L 210.972656 341.015625 L 210.34375 341.519531 L 209.71875 342.019531 L 209.09375 342.515625 L 208.472656 343.011719 L 207.246094 343.996094 L 206.636719 344.484375 L 206.03125 344.96875 L 205.425781 345.449219 L 204.828125 345.929688 L 204.230469 346.40625 L 203.636719 346.878906 L 203.046875 347.351562 L 202.460938 347.824219 L 201.875 348.289062 L 201.292969 348.753906 L 200.714844 349.21875 L 200.140625 349.675781 L 199.566406 350.136719 L 198.996094 350.589844 L 198.429688 351.046875 L 197.304688 351.945312 L 196.1875 352.835938 L 195.636719 353.28125 L 195.085938 353.71875 L 193.992188 354.59375 L 193.449219 355.027344 L 192.910156 355.460938 L 192.371094 355.890625 L 191.835938 356.316406 L 190.773438 357.167969 L 189.71875 358.011719 L 189.195312 358.429688 L 188.15625 359.257812 L 187.640625 359.671875 L 186.617188 360.492188 L 185.601562 361.304688 L 184.59375 362.109375 L 184.09375 362.507812 L 183.597656 362.90625 L 183.101562 363.300781 L 182.609375 363.699219 L 182.117188 364.089844 L 181.140625 364.871094 L 180.171875 365.644531 L 179.691406 366.03125 L 179.210938 366.414062 L 178.734375 366.796875 L 178.257812 367.175781 L 177.785156 367.554688 L 177.316406 367.929688 L 176.84375 368.304688 L 176.378906 368.679688 L 175.449219 369.421875 L 174.988281 369.789062 L 174.527344 370.160156 L 174.070312 370.523438 L 173.613281 370.890625 L 173.160156 371.253906 L 172.707031 371.613281 L 172.257812 371.976562 L 171.808594 372.335938 L 171.359375 372.691406 L 170.914062 373.046875 L 170.472656 373.402344 L 170.027344 373.757812 L 169.589844 374.109375 L 169.148438 374.460938 L 168.714844 374.808594 L 168.277344 375.15625 L 167.84375 375.503906 L 167.410156 375.847656 L 166.980469 376.191406 L 166.554688 376.535156 L 166.125 376.878906 L 165.699219 377.21875 L 165.277344 377.558594 L 164.433594 378.230469 L 163.597656 378.902344 L 163.179688 379.234375 L 162.765625 379.566406 L 162.351562 379.894531 L 161.941406 380.226562 L 161.53125 380.554688 L 161.121094 380.878906 L 160.714844 381.207031 L 159.902344 381.855469 L 159.097656 382.496094 L 158.300781 383.136719 L 157.902344 383.453125 L 157.507812 383.769531 L 157.109375 384.085938 L 156.71875 384.402344 L 156.324219 384.714844 L 155.933594 385.027344 L 155.546875 385.335938 L 155.15625 385.648438 L 154.769531 385.957031 L 154.386719 386.265625 L 154 386.574219 L 153.617188 386.878906 L 153.238281 387.183594 L 152.855469 387.488281 L 152.476562 387.789062 L 152.101562 388.09375 L 151.722656 388.394531 L 151.347656 388.695312 L 150.976562 388.992188 L 150.601562 389.292969 L 150.230469 389.589844 L 149.859375 389.882812 L 149.492188 390.179688 L 149.121094 390.472656 L 148.757812 390.765625 L 148.390625 391.058594 L 148.027344 391.351562 L 147.300781 391.929688 L 146.941406 392.21875 L 146.578125 392.507812 L 146.222656 392.792969 L 145.863281 393.082031 L 145.507812 393.367188 L 145.152344 393.648438 L 144.796875 393.933594 L 143.390625 395.058594 L 142 396.167969 L 141.65625 396.445312 L 140.96875 396.992188 L 140.289062 397.539062 L 139.949219 397.808594 L 139.609375 398.082031 L 138.9375 398.621094 L 138.601562 398.886719 L 138.265625 399.15625 L 136.9375 400.21875 L 136.609375 400.480469 L 136.277344 400.746094 L 135.949219 401.007812 L 135.625 401.269531 L 135.296875 401.527344 L 134.972656 401.789062 L 134.648438 402.046875 L 134.324219 402.308594 L 134.003906 402.566406 L 133.683594 402.820312 L 133.363281 403.078125 L 133.042969 403.332031 L 132.722656 403.589844 L 132.089844 404.097656 L 131.773438 404.347656 L 131.457031 404.601562 L 131.144531 404.851562 L 130.828125 405.101562 L 130.203125 405.601562 L 129.894531 405.851562 L 129.582031 406.097656 L 129.273438 406.347656 L 128.964844 406.59375 L 128.660156 406.839844 L 128.351562 407.082031 L 127.742188 407.574219 L 127.132812 408.058594 L 126.832031 408.300781 L 126.527344 408.542969 L 126.226562 408.78125 L 125.925781 409.023438 L 125.628906 409.261719 L 125.328125 409.5 L 124.4375 410.214844 L 124.140625 410.449219 L 123.847656 410.6875 L 123.554688 410.921875 L 123.257812 411.15625 L 122.96875 411.390625 L 122.675781 411.625 L 122.382812 411.855469 L 122.09375 412.089844 L 120.9375 413.011719 L 120.652344 413.242188 L 120.367188 413.46875 L 120.082031 413.699219 L 119.511719 414.152344 L 119.230469 414.378906 L 118.945312 414.605469 L 118.664062 414.828125 L 118.382812 415.054688 L 118.105469 415.277344 "/>
<path style="fill:none;stroke-width:0.75;stroke-linecap:round;stroke-linejoin:round;stroke:rgb(0%,0%,0%);stroke-opacity:1;stroke-miterlimit:10;" d="M 92.160156 446.398438 L 488.160156 446.398438 "/>
<path style="fill:none;stroke-width:0.75;stroke-linecap:round;stroke-linejoin:round;stroke:rgb(0%,0%,0%);stroke-opacity:1;stroke-miterlimit:10;" d="M 92.160156 446.398438 L 92.160156 453.601562 "/>
<path style="fill:none;stroke-width:0.75;stroke-linecap:round;stroke-linejoin:round;stroke:rgb(0%,0%,0%);stroke-opacity:1;stroke-miterlimit:10;" d="M 171.359375 446.398438 L 171.359375 453.601562 "/>
<path style="fill:none;stroke-width:0.75;stroke-linecap:round;stroke-linejoin:round;stroke:rgb(0%,0%,0%);stroke-opacity:1;stroke-miterlimit:10;" d="M 250.558594 446.398438 L 250.558594 453.601562 "/>
<path style="fill:none;stroke-width:0.75;stroke-linecap:round;stroke-linejoin:round;stroke:rgb(0%,0%,0%);stroke-opacity:1;stroke-miterlimit:10;" d="M 329.761719 446.398438 L 329.761719 453.601562 "/>
<path style="fill:none;stroke-width:0.75;stroke-linecap:round;stroke-linejoin:round;stroke:rgb(0%,0%,0%);stroke-opacity:1;stroke-miterlimit:10;" d="M 408.960938 446.398438 L 408.960938 453.601562 "/>
<path style="fill:none;stroke-width:0.75;stroke-linecap:round;stroke-linejoin:round;stroke:rgb(0%,0%,0%);stroke-opacity:1;stroke-miterlimit:10;" d="M 488.160156 446.398438 L 488.160156 453.601562 "/>
<g style="fill:rgb(0%,0%,0%);fill-opacity:1;">
  <use xlink:href="#glyph7-1" x="82.660156" y="471.739258"/>
  <use xlink:href="#glyph7-2" x="89.455078" y="471.739258"/>
</g>
<g style="fill:rgb(0%,0%,0%);fill-opacity:1;">
  <use xlink:href="#glyph7-1" x="161.859375" y="471.739258"/>
  <use xlink:href="#glyph7-3" x="168.654297" y="471.739258"/>
</g>
<g style="fill:rgb(0%,0%,0%);fill-opacity:1;">
  <use xlink:href="#glyph7-1" x="241.058594" y="471.739258"/>
  <use xlink:href="#glyph7-4" x="247.853516" y="471.739258"/>
</g>
<g style="fill:rgb(0%,0%,0%);fill-opacity:1;">
  <use xlink:href="#glyph7-1" x="320.261719" y="471.739258"/>
  <use xlink:href="#glyph7-5" x="327.056641" y="471.739258"/>
</g>
<g style="fill:rgb(0%,0%,0%);fill-opacity:1;">
  <use xlink:href="#glyph7-1" x="399.460938" y="471.739258"/>
  <use xlink:href="#glyph7-6" x="406.255859" y="471.739258"/>
</g>
<g style="fill:rgb(0%,0%,0%);fill-opacity:1;">
  <use xlink:href="#glyph7-1" x="478.660156" y="471.739258"/>
  <use xlink:href="#glyph7-7" x="485.455078" y="471.739258"/>
</g>
<path style="fill:none;stroke-width:0.75;stroke-linecap:round;stroke-linejoin:round;stroke:rgb(0%,0%,0%);stroke-opacity:1;stroke-miterlimit:10;" d="M 76.320312 431.199219 L 76.320312 51.199219 "/>
<path style="fill:none;stroke-width:0.75;stroke-linecap:round;stroke-linejoin:round;stroke:rgb(0%,0%,0%);stroke-opacity:1;stroke-miterlimit:10;" d="M 76.320312 431.199219 L 69.121094 431.199219 "/>
<path style="fill:none;stroke-width:0.75;stroke-linecap:round;stroke-linejoin:round;stroke:rgb(0%,0%,0%);stroke-opacity:1;stroke-miterlimit:10;" d="M 76.320312 399.535156 L 69.121094 399.535156 "/>
<path style="fill:none;stroke-width:0.75;stroke-linecap:round;stroke-linejoin:round;stroke:rgb(0%,0%,0%);stroke-opacity:1;stroke-miterlimit:10;" d="M 76.320312 367.867188 L 69.121094 367.867188 "/>
<path style="fill:none;stroke-width:0.75;stroke-linecap:round;stroke-linejoin:round;stroke:rgb(0%,0%,0%);stroke-opacity:1;stroke-miterlimit:10;" d="M 76.320312 336.199219 L 69.121094 336.199219 "/>
<path style="fill:none;stroke-width:0.75;stroke-linecap:round;stroke-linejoin:round;stroke:rgb(0%,0%,0%);stroke-opacity:1;stroke-miterlimit:10;" d="M 76.320312 304.535156 L 69.121094 304.535156 "/>
<path style="fill:none;stroke-width:0.75;stroke-linecap:round;stroke-linejoin:round;stroke:rgb(0%,0%,0%);stroke-opacity:1;stroke-miterlimit:10;" d="M 76.320312 272.867188 L 69.121094 272.867188 "/>
<path style="fill:none;stroke-width:0.75;stroke-linecap:round;stroke-linejoin:round;stroke:rgb(0%,0%,0%);stroke-opacity:1;stroke-miterlimit:10;" d="M 76.320312 241.199219 L 69.121094 241.199219 "/>
<path style="fill:none;stroke-width:0.75;stroke-linecap:round;stroke-linejoin:round;stroke:rgb(0%,0%,0%);stroke-opacity:1;stroke-miterlimit:10;" d="M 76.320312 209.535156 L 69.121094 209.535156 "/>
<path style="fill:none;stroke-width:0.75;stroke-linecap:round;stroke-linejoin:round;stroke:rgb(0%,0%,0%);stroke-opacity:1;stroke-miterlimit:10;" d="M 76.320312 177.867188 L 69.121094 177.867188 "/>
<path style="fill:none;stroke-width:0.75;stroke-linecap:round;stroke-linejoin:round;stroke:rgb(0%,0%,0%);stroke-opacity:1;stroke-miterlimit:10;" d="M 76.320312 146.199219 L 69.121094 146.199219 "/>
<path style="fill:none;stroke-width:0.75;stroke-linecap:round;stroke-linejoin:round;stroke:rgb(0%,0%,0%);stroke-opacity:1;stroke-miterlimit:10;" d="M 76.320312 114.535156 L 69.121094 114.535156 "/>
<path style="fill:none;stroke-width:0.75;stroke-linecap:round;stroke-linejoin:round;stroke:rgb(0%,0%,0%);stroke-opacity:1;stroke-miterlimit:10;" d="M 76.320312 82.867188 L 69.121094 82.867188 "/>
<path style="fill:none;stroke-width:0.75;stroke-linecap:round;stroke-linejoin:round;stroke:rgb(0%,0%,0%);stroke-opacity:1;stroke-miterlimit:10;" d="M 76.320312 51.199219 L 69.121094 51.199219 "/>
<g style="fill:rgb(0%,0%,0%);fill-opacity:1;">
  <use xlink:href="#glyph8-1" x="58.458008" y="446.199219"/>
  <use xlink:href="#glyph8-2" x="58.458008" y="439.404297"/>
  <use xlink:href="#glyph8-3" x="58.458008" y="428.058594"/>
</g>
<g style="fill:rgb(0%,0%,0%);fill-opacity:1;">
  <use xlink:href="#glyph8-1" x="58.458008" y="382.867188"/>
  <use xlink:href="#glyph8-4" x="58.458008" y="376.072266"/>
  <use xlink:href="#glyph8-5" x="58.458008" y="364.726562"/>
</g>
<g style="fill:rgb(0%,0%,0%);fill-opacity:1;">
  <use xlink:href="#glyph8-1" x="58.458008" y="319.535156"/>
  <use xlink:href="#glyph8-4" x="58.458008" y="312.740234"/>
  <use xlink:href="#glyph8-6" x="58.458008" y="301.394531"/>
</g>
<g style="fill:rgb(0%,0%,0%);fill-opacity:1;">
  <use xlink:href="#glyph8-1" x="58.458008" y="256.199219"/>
  <use xlink:href="#glyph8-4" x="58.458008" y="249.404297"/>
  <use xlink:href="#glyph8-7" x="58.458008" y="238.058594"/>
</g>
<g style="fill:rgb(0%,0%,0%);fill-opacity:1;">
  <use xlink:href="#glyph8-1" x="58.458008" y="192.867188"/>
  <use xlink:href="#glyph8-4" x="58.458008" y="186.072266"/>
  <use xlink:href="#glyph8-2" x="58.458008" y="174.726562"/>
</g>
<g style="fill:rgb(0%,0%,0%);fill-opacity:1;">
  <use xlink:href="#glyph8-1" x="58.458008" y="129.535156"/>
  <use xlink:href="#glyph8-4" x="58.458008" y="122.740234"/>
  <use xlink:href="#glyph8-3" x="58.458008" y="111.394531"/>
</g>
<g style="fill:rgb(0%,0%,0%);fill-opacity:1;">
  <use xlink:href="#glyph8-1" x="58.458008" y="60.699219"/>
  <use xlink:href="#glyph8-5" x="58.458008" y="53.904297"/>
</g>
<path style="fill-rule:nonzero;fill:rgb(100%,100%,100%);fill-opacity:1;stroke-width:0.75;stroke-linecap:round;stroke-linejoin:round;stroke:rgb(0%,0%,0%);stroke-opacity:1;stroke-miterlimit:10;" d="M 221.535156 339.480469 L 482.613281 339.480469 L 482.613281 425.878906 L 221.535156 425.878906 Z M 221.535156 339.480469 "/>
<path style="fill:none;stroke-width:2.25;stroke-linecap:round;stroke-linejoin:round;stroke:rgb(0%,0%,100%);stroke-opacity:1;stroke-miterlimit:10;" d="M 228.015625 368.28125 L 271.214844 368.28125 "/>
<path style="fill:none;stroke-width:2.25;stroke-linecap:round;stroke-linejoin:round;stroke:rgb(100%,0%,0%);stroke-opacity:1;stroke-miterlimit:10;" d="M 228.015625 397.078125 L 271.214844 397.078125 "/>
<g style="fill:rgb(0%,0%,0%);fill-opacity:1;">
  <use xlink:href="#glyph0-5" x="292.816406" y="376.833008"/>
  <use xlink:href="#glyph0-6" x="306.160156" y="376.833008"/>
  <use xlink:href="#glyph0-7" x="319.503906" y="376.833008"/>
  <use xlink:href="#glyph0-8" x="326.175781" y="376.833008"/>
  <use xlink:href="#glyph0-9" x="339.519531" y="376.833008"/>
  <use xlink:href="#glyph0-9" x="347.511719" y="376.833008"/>
  <use xlink:href="#glyph0-2" x="355.383789" y="376.833008"/>
  <use xlink:href="#glyph0-9" x="368.727539" y="376.833008"/>
</g>
<g style="fill:rgb(0%,0%,0%);fill-opacity:1;">
  <use xlink:href="#glyph0-9" x="292.816406" y="405.629883"/>
  <use xlink:href="#glyph0-8" x="300.568359" y="405.629883"/>
  <use xlink:href="#glyph0-10" x="313.912109" y="405.629883"/>
  <use xlink:href="#glyph0-11" x="320.583984" y="405.629883"/>
  <use xlink:href="#glyph0-7" x="327.255859" y="405.629883"/>
  <use xlink:href="#glyph0-1" x="333.927734" y="405.629883"/>
  <use xlink:href="#glyph0-12" x="339.255859" y="405.629883"/>
  <use xlink:href="#glyph0-13" x="344.583984" y="405.629883"/>
  <use xlink:href="#glyph0-8" x="357.927734" y="405.629883"/>
  <use xlink:href="#glyph0-7" x="371.271484" y="405.629883"/>
  <use xlink:href="#glyph0-14" x="377.943359" y="405.629883"/>
  <use xlink:href="#glyph0-15" x="385.935547" y="405.629883"/>
  <use xlink:href="#glyph0-1" x="397.935547" y="405.629883"/>
  <use xlink:href="#glyph0-2" x="403.263672" y="405.629883"/>
  <use xlink:href="#glyph0-16" x="416.607422" y="405.629883"/>
  <use xlink:href="#glyph0-8" x="429.951172" y="405.629883"/>
  <use xlink:href="#glyph0-7" x="443.294922" y="405.629883"/>
  <use xlink:href="#glyph0-6" x="449.966797" y="405.629883"/>
  <use xlink:href="#glyph0-17" x="463.310547" y="405.629883"/>
</g>
</g>
</svg>
