<?xml version="1.0" encoding="UTF-8" standalone="no"?>
<!-- Created with Inkscape (http://www.inkscape.org/) -->

<svg
   xmlns:dc="http://purl.org/dc/elements/1.1/"
   xmlns:cc="http://creativecommons.org/ns#"
   xmlns:rdf="http://www.w3.org/1999/02/22-rdf-syntax-ns#"
   xmlns:svg="http://www.w3.org/2000/svg"
   xmlns="http://www.w3.org/2000/svg"
   xmlns:sodipodi="http://sodipodi.sourceforge.net/DTD/sodipodi-0.dtd"
   xmlns:inkscape="http://www.inkscape.org/namespaces/inkscape"
   width="210mm"
   height="297mm"
   viewBox="0 0 744.09448819 1052.3622047"
   id="svg2"
   version="1.1"
   inkscape:version="0.91 r13725"
   sodipodi:docname="psi_transformation.svg">
  <defs
     id="defs4">
    <inkscape:path-effect
       effect="spiro"
       id="path-effect4552"
       is_visible="true" />
    <inkscape:path-effect
       effect="spiro"
       id="path-effect4548"
       is_visible="true" />
    <marker
       inkscape:stockid="Arrow1Lstart"
       orient="auto"
       refY="0.0"
       refX="0.0"
       id="Arrow1Lstart"
       style="overflow:visible"
       inkscape:isstock="true">
      <path
         id="path4220"
         d="M 0.0,0.0 L 5.0,-5.0 L -12.5,0.0 L 5.0,5.0 L 0.0,0.0 z "
         style="fill-rule:evenodd;stroke:#000000;stroke-width:1.0pt"
         transform="scale(0.8) translate(12.5,0)" />
    </marker>
  </defs>
  <sodipodi:namedview
     id="base"
     pagecolor="#ffffff"
     bordercolor="#666666"
     borderopacity="1.0"
     inkscape:pageopacity="0.0"
     inkscape:pageshadow="2"
     inkscape:zoom="0.7"
     inkscape:cx="294.19623"
     inkscape:cy="209.0507"
     inkscape:document-units="px"
     inkscape:current-layer="layer1"
     showgrid="false"
     inkscape:snap-bbox="true"
     inkscape:snap-global="true"
     inkscape:window-width="1920"
     inkscape:window-height="983"
     inkscape:window-x="1366"
     inkscape:window-y="27"
     inkscape:window-maximized="1" />
  <metadata
     id="metadata7">
    <rdf:RDF>
      <cc:Work
         rdf:about="">
        <dc:format>image/svg+xml</dc:format>
        <dc:type
           rdf:resource="http://purl.org/dc/dcmitype/StillImage" />
        <dc:title></dc:title>
      </cc:Work>
    </rdf:RDF>
  </metadata>
  <g
     inkscape:label="Layer 1"
     inkscape:groupmode="layer"
     id="layer1">
    <rect
       style="fill:#bdbdcf;fill-opacity:1;fill-rule:evenodd;stroke:#000000;stroke-width:1.71221054;stroke-linecap:butt;stroke-linejoin:miter;stroke-miterlimit:4;stroke-dasharray:none;stroke-opacity:1"
       id="rect3355"
       width="483.60757"
       height="113.1781"
       x="1167.1781"
       y="1291.8018"
       transform="matrix(1,0,-0.7658762,0.64298806,0,0)" />
    <ellipse
       style="fill:#ffffff;fill-opacity:1;stroke:#000000;stroke-width:1.18920708;stroke-miterlimit:4;stroke-dasharray:none;stroke-opacity:1"
       id="path4159"
       cx="1093.5259"
       cy="1226.1221"
       rx="17.425131"
       ry="32.857143"
       transform="matrix(1,0,-0.70710678,0.70710678,0,0)" />
    <ellipse
       style="fill:#ffffff;fill-opacity:1;stroke:#000000;stroke-width:1.18920708;stroke-miterlimit:4;stroke-dasharray:none;stroke-opacity:1"
       id="path4159-3"
       cx="1373.5106"
       cy="1225.9525"
       rx="17.425131"
       ry="32.857143"
       transform="matrix(1,0,-0.70710678,0.70710678,0,0)" />
    <ellipse
       style="fill:#ffffff;fill-opacity:1;stroke:#000000;stroke-width:1;stroke-miterlimit:4;stroke-dasharray:none;stroke-opacity:1"
       id="path4197"
       cx="145.20702"
       cy="685.9906"
       rx="21.785715"
       ry="46.785713" />
    <rect
       style="fill:#ffffff;fill-opacity:1;stroke:#000000;stroke-width:0.99234426;stroke-miterlimit:4;stroke-dasharray:none;stroke-dashoffset:0;stroke-opacity:1"
       id="rect4214"
       width="467.15067"
       height="93.557655"
       x="145.71037"
       y="639.22937" />
    <ellipse
       style="fill:#ffffff;fill-opacity:1;stroke:#000000;stroke-width:1;stroke-miterlimit:4;stroke-dasharray:none;stroke-opacity:1"
       id="path4197-6"
       cx="613.51459"
       cy="685.93365"
       rx="21.785715"
       ry="46.785713" />
    <rect
       style="fill:#ffffff;fill-opacity:1;stroke:#ffffff;stroke-width:1.36249912;stroke-miterlimit:4;stroke-dasharray:none;stroke-dashoffset:0;stroke-opacity:1"
       id="rect4484"
       width="2.407573"
       height="91.19825"
       x="144.44637"
       y="640.40521" />
    <ellipse
       style="fill:#ffffff;fill-opacity:1;stroke:#000000;stroke-width:0.51680553;stroke-miterlimit:4;stroke-dasharray:none;stroke-opacity:1"
       id="path4197-6-7"
       cx="234.59979"
       cy="529.6604"
       rx="24.741598"
       ry="11.003013" />
    <ellipse
       style="fill:#ffffff;fill-opacity:1;stroke:#000000;stroke-width:0.51680553;stroke-miterlimit:4;stroke-dasharray:none;stroke-opacity:1"
       id="path4197-6-7-5"
       cx="505"
       cy="528.50507"
       rx="24.741598"
       ry="11.003013" />
    <path
       style="fill:none;fill-rule:evenodd;stroke:#000000;stroke-width:1;stroke-linecap:butt;stroke-linejoin:miter;stroke-miterlimit:4;stroke-dasharray:none;stroke-dashoffset:0;stroke-opacity:1"
       d="m 259.375,530.75506 c 0,0 5.71429,25.80357 58.39286,25.625"
       id="path4554"
       inkscape:connector-curvature="0"
       sodipodi:nodetypes="cc" />
    <path
       style="fill:none;fill-rule:evenodd;stroke:#000000;stroke-width:1;stroke-linecap:butt;stroke-linejoin:miter;stroke-miterlimit:4;stroke-dasharray:none;stroke-dashoffset:0;stroke-opacity:1"
       d="m 529.61824,527.56758 c 0,0 5.71429,25.80357 58.39286,25.625"
       id="path4554-3"
       inkscape:connector-curvature="0"
       sodipodi:nodetypes="cc" />
    <path
       style="fill:none;fill-rule:evenodd;stroke:#000000;stroke-width:1;stroke-linecap:butt;stroke-linejoin:miter;stroke-miterlimit:4;stroke-dasharray:none;stroke-dashoffset:0;stroke-opacity:1"
       d="m 209.73891,529.53187 c 0,0 -5.71429,25.80357 -58.39287,25.625"
       id="path4554-5"
       inkscape:connector-curvature="0"
       sodipodi:nodetypes="cc" />
    <path
       style="fill:none;fill-rule:evenodd;stroke:#000000;stroke-width:1;stroke-linecap:butt;stroke-linejoin:miter;stroke-miterlimit:4;stroke-dasharray:none;stroke-dashoffset:0;stroke-opacity:1"
       d="m 479.48123,527.20596 c 0,0 -5.71429,25.80357 -58.39287,25.625"
       id="path4554-5-6"
       inkscape:connector-curvature="0"
       sodipodi:nodetypes="cc" />
    <path
       style="fill:none;fill-rule:evenodd;stroke:#000000;stroke-width:1px;stroke-linecap:butt;stroke-linejoin:miter;stroke-opacity:1"
       d="M 367.14286,675.21935 Z"
       id="path4607"
       inkscape:connector-curvature="0" />
    <path
       style="fill:none;fill-rule:evenodd;stroke:#000000;stroke-width:1px;stroke-linecap:butt;stroke-linejoin:miter;stroke-opacity:1"
       d="m 209.77353,639.46235 c 0,0 -16.03617,12.50064 0.63135,34.21892 16.66751,21.71828 44.0679,-11.61676 46.46702,-22.60216 2.39911,-10.98541 1.26269,-12.2481 1.26269,-12.2481"
       id="path4619"
       inkscape:connector-curvature="0"
       sodipodi:nodetypes="cssc" />
    <path
       style="fill:none;fill-rule:evenodd;stroke:#000000;stroke-width:1px;stroke-linecap:butt;stroke-linejoin:miter;stroke-opacity:1"
       d="m 485.58198,640.31677 c 0,0 -16.03617,12.50064 0.63135,34.21892 16.66751,21.71828 44.0679,-11.61676 46.46702,-22.60216 2.39911,-10.98541 1.26269,-12.2481 1.26269,-12.2481"
       id="path4619-2"
       inkscape:connector-curvature="0"
       sodipodi:nodetypes="cssc" />
    <rect
       style="fill:#ffffff;fill-opacity:1;stroke:#da2121;stroke-width:1.00591648;stroke-miterlimit:4;stroke-dasharray:none;stroke-dashoffset:0;stroke-opacity:0"
       id="rect4636"
       width="47.768284"
       height="4.2797976"
       x="210.08591"
       y="636.47229" />
    <path
       style="fill:none;fill-rule:evenodd;stroke:#000000;stroke-width:1px;stroke-linecap:butt;stroke-linejoin:miter;stroke-opacity:1"
       d="m 209.91072,639.2372 c 0,0 7.76786,-0.98214 12.05357,2.94643 4.28571,3.92857 4.6108,9.02013 12.94643,8.83929 9.64285,-0.20921 7.47318,-0.42323 13.03572,-5.80357 3.12369,-3.02137 6.33927,-6.42857 10.62499,-6.07143"
       id="path4660"
       inkscape:connector-curvature="0"
       sodipodi:nodetypes="csssc" />
    <rect
       style="fill:#ffffff;fill-opacity:1;stroke:#da2121;stroke-width:1.00591648;stroke-miterlimit:4;stroke-dasharray:none;stroke-dashoffset:0;stroke-opacity:0"
       id="rect4636-9"
       width="47.768284"
       height="4.2797976"
       x="485.70224"
       y="636.15753" />
    <path
       style="fill:none;fill-rule:evenodd;stroke:#000000;stroke-width:1px;stroke-linecap:butt;stroke-linejoin:miter;stroke-opacity:1"
       d="m 485.52706,638.92246 c 0,0 7.76786,-0.98214 12.05357,2.94643 4.28571,3.92857 4.6108,9.02013 12.94643,8.83929 9.64285,-0.20921 7.47318,-0.42323 13.03572,-5.80357 3.12369,-3.02137 6.33927,-6.42857 10.62499,-6.07143"
       id="path4660-1"
       inkscape:connector-curvature="0"
       sodipodi:nodetypes="csssc" />
  </g>
</svg>
