<?xml version="1.0" encoding="UTF-8"?>
<svg xmlns="http://www.w3.org/2000/svg" xmlns:xlink="http://www.w3.org/1999/xlink" width="504pt" height="504pt" viewBox="0 0 504 504" version="1.1">
<defs>
<g>
<symbol overflow="visible" id="glyph0-0">
<path style="stroke:none;" d=""/>
</symbol>
<symbol overflow="visible" id="glyph0-1">
<path style="stroke:none;" d="M 10.421875 -6.984375 C 10.421875 -12 8.75 -14.515625 5.609375 -14.515625 C 2.484375 -14.515625 0.78125 -11.953125 0.78125 -7.09375 C 0.78125 -2.21875 2.515625 0.3125 5.609375 0.3125 C 8.671875 0.3125 10.421875 -2.21875 10.421875 -6.984375 Z M 8.40625 -7.140625 C 8.40625 -3.046875 7.578125 -1.21875 5.578125 -1.21875 C 3.671875 -1.21875 2.796875 -3.125 2.796875 -7.078125 C 2.796875 -11.046875 3.671875 -12.875 5.609375 -12.875 C 7.546875 -12.875 8.40625 -11.015625 8.40625 -7.140625 Z M 8.40625 -7.140625 "/>
</symbol>
<symbol overflow="visible" id="glyph0-2">
<path style="stroke:none;" d="M 3.984375 -0.015625 L 3.984375 -2.15625 L 1.671875 -2.15625 L 1.671875 0 L 3.984375 0 Z M 3.984375 -0.015625 "/>
</symbol>
<symbol overflow="visible" id="glyph0-3">
<path style="stroke:none;" d="M 10.515625 -10.25 C 10.515625 -12.6875 8.53125 -14.515625 5.796875 -14.515625 C 2.84375 -14.515625 1.015625 -12.984375 0.921875 -9.453125 L 2.890625 -9.453125 C 3.046875 -11.890625 3.953125 -12.890625 5.734375 -12.890625 C 7.359375 -12.890625 8.484375 -11.75 8.484375 -10.203125 C 8.484375 -9.0625 7.84375 -8.09375 6.546875 -7.359375 L 4.671875 -6.3125 C 1.65625 -4.59375 0.75 -3.203125 0.59375 0 L 10.40625 0 L 10.40625 -1.8125 L 2.8125 -1.8125 C 2.984375 -2.984375 3.609375 -3.71875 5.390625 -4.75 L 7.421875 -5.859375 C 9.453125 -6.9375 10.515625 -8.46875 10.515625 -10.25 Z M 10.515625 -10.25 "/>
</symbol>
<symbol overflow="visible" id="glyph0-4">
<path style="stroke:none;" d="M 10.6875 -3.484375 L 10.6875 -5.125 L 8.546875 -5.125 L 8.546875 -14.515625 L 7.0625 -14.515625 L 0.46875 -5.359375 L 0.46875 -3.46875 L 6.578125 -3.46875 L 6.578125 0 L 8.546875 0 L 8.546875 -3.46875 L 10.6875 -3.46875 Z M 6.671875 -5.125 L 2.25 -5.125 L 6.734375 -11.40625 L 6.578125 -11.421875 L 6.578125 -5.125 Z M 6.671875 -5.125 "/>
</symbol>
<symbol overflow="visible" id="glyph0-5">
<path style="stroke:none;" d="M 10.546875 -4.515625 C 10.546875 -7.203125 8.625 -9.046875 6.046875 -9.046875 C 4.609375 -9.046875 3.40625 -8.484375 2.625 -7.421875 L 2.796875 -7.40625 C 2.8125 -10.9375 3.875 -12.875 5.9375 -12.875 C 7.203125 -12.875 7.984375 -12.09375 8.265625 -10.6875 L 10.265625 -10.6875 C 9.890625 -13.078125 8.265625 -14.515625 6.0625 -14.515625 C 2.6875 -14.515625 0.78125 -11.65625 0.78125 -6.609375 C 0.78125 -2.109375 2.421875 0.3125 5.734375 0.3125 C 8.484375 0.3125 10.546875 -1.671875 10.546875 -4.515625 Z M 8.53125 -4.359375 C 8.53125 -2.546875 7.40625 -1.328125 5.75 -1.328125 C 4.078125 -1.328125 2.890625 -2.609375 2.890625 -4.46875 C 2.890625 -6.265625 4.046875 -7.40625 5.8125 -7.40625 C 7.546875 -7.40625 8.53125 -6.3125 8.53125 -4.359375 Z M 8.53125 -4.359375 "/>
</symbol>
<symbol overflow="visible" id="glyph0-6">
<path style="stroke:none;" d="M 10.546875 -4.109375 C 10.546875 -5.71875 9.65625 -6.859375 8.0625 -7.609375 C 9.53125 -8.515625 10.046875 -9.265625 10.046875 -10.625 C 10.046875 -12.890625 8.1875 -14.515625 5.609375 -14.515625 C 3.0625 -14.515625 1.15625 -12.890625 1.15625 -10.625 C 1.15625 -9.28125 1.671875 -8.53125 3.125 -7.609375 C 1.578125 -6.859375 0.65625 -5.71875 0.65625 -4.125 C 0.65625 -1.46875 2.75 0.3125 5.609375 0.3125 C 8.46875 0.3125 10.546875 -1.46875 10.546875 -4.109375 Z M 8.015625 -10.59375 C 8.015625 -9.25 7.125 -8.359375 5.609375 -8.359375 C 4.109375 -8.359375 3.1875 -9.25 3.1875 -10.609375 C 3.1875 -12 4.109375 -12.875 5.609375 -12.875 C 7.140625 -12.875 8.015625 -12 8.015625 -10.59375 Z M 8.53125 -4.078125 C 8.53125 -2.359375 7.40625 -1.328125 5.578125 -1.328125 C 3.8125 -1.328125 2.671875 -2.390625 2.671875 -4.078125 C 2.671875 -5.78125 3.8125 -6.8125 5.609375 -6.8125 C 7.40625 -6.8125 8.53125 -5.78125 8.53125 -4.078125 Z M 8.53125 -4.078125 "/>
</symbol>
<symbol overflow="visible" id="glyph0-7">
<path style="stroke:none;" d="M 7.15625 -0.015625 L 7.15625 -14.515625 L 5.796875 -14.515625 C 5.15625 -12.265625 4.859375 -11.984375 1.984375 -11.625 L 1.984375 -10.3125 L 5.1875 -10.3125 L 5.1875 0 L 7.15625 0 Z M 7.15625 -0.015625 "/>
</symbol>
<symbol overflow="visible" id="glyph1-0">
<path style="stroke:none;" d=""/>
</symbol>
<symbol overflow="visible" id="glyph1-1">
<path style="stroke:none;" d="M -6.984375 -10.421875 C -12 -10.421875 -14.515625 -8.75 -14.515625 -5.609375 C -14.515625 -2.484375 -11.953125 -0.78125 -7.09375 -0.78125 C -2.21875 -0.78125 0.3125 -2.515625 0.3125 -5.609375 C 0.3125 -8.671875 -2.21875 -10.421875 -6.984375 -10.421875 Z M -7.140625 -8.40625 C -3.046875 -8.40625 -1.21875 -7.578125 -1.21875 -5.578125 C -1.21875 -3.671875 -3.125 -2.796875 -7.078125 -2.796875 C -11.046875 -2.796875 -12.875 -3.671875 -12.875 -5.609375 C -12.875 -7.546875 -11.015625 -8.40625 -7.140625 -8.40625 Z M -7.140625 -8.40625 "/>
</symbol>
<symbol overflow="visible" id="glyph1-2">
<path style="stroke:none;" d="M -0.015625 -3.984375 L -2.15625 -3.984375 L -2.15625 -1.671875 L 0 -1.671875 L 0 -3.984375 Z M -0.015625 -3.984375 "/>
</symbol>
<symbol overflow="visible" id="glyph1-3">
<path style="stroke:none;" d="M -10.25 -10.515625 C -12.6875 -10.515625 -14.515625 -8.53125 -14.515625 -5.796875 C -14.515625 -2.84375 -12.984375 -1.015625 -9.453125 -0.921875 L -9.453125 -2.890625 C -11.890625 -3.046875 -12.890625 -3.953125 -12.890625 -5.734375 C -12.890625 -7.359375 -11.75 -8.484375 -10.203125 -8.484375 C -9.0625 -8.484375 -8.09375 -7.84375 -7.359375 -6.546875 L -6.3125 -4.671875 C -4.59375 -1.65625 -3.203125 -0.75 0 -0.59375 L 0 -10.40625 L -1.8125 -10.40625 L -1.8125 -2.8125 C -2.984375 -2.984375 -3.71875 -3.609375 -4.75 -5.390625 L -5.859375 -7.421875 C -6.9375 -9.453125 -8.46875 -10.515625 -10.25 -10.515625 Z M -10.25 -10.515625 "/>
</symbol>
<symbol overflow="visible" id="glyph1-4">
<path style="stroke:none;" d="M -3.484375 -10.6875 L -5.125 -10.6875 L -5.125 -8.546875 L -14.515625 -8.546875 L -14.515625 -7.0625 L -5.359375 -0.46875 L -3.46875 -0.46875 L -3.46875 -6.578125 L 0 -6.578125 L 0 -8.546875 L -3.46875 -8.546875 L -3.46875 -10.6875 Z M -5.125 -6.671875 L -5.125 -2.25 L -11.40625 -6.734375 L -11.421875 -6.578125 L -5.125 -6.578125 Z M -5.125 -6.671875 "/>
</symbol>
<symbol overflow="visible" id="glyph1-5">
<path style="stroke:none;" d="M -4.515625 -10.546875 C -7.203125 -10.546875 -9.046875 -8.625 -9.046875 -6.046875 C -9.046875 -4.609375 -8.484375 -3.40625 -7.421875 -2.625 L -7.40625 -2.796875 C -10.9375 -2.8125 -12.875 -3.875 -12.875 -5.9375 C -12.875 -7.203125 -12.09375 -7.984375 -10.6875 -8.265625 L -10.6875 -10.265625 C -13.078125 -9.890625 -14.515625 -8.265625 -14.515625 -6.0625 C -14.515625 -2.6875 -11.65625 -0.78125 -6.609375 -0.78125 C -2.109375 -0.78125 0.3125 -2.421875 0.3125 -5.734375 C 0.3125 -8.484375 -1.671875 -10.546875 -4.515625 -10.546875 Z M -4.359375 -8.53125 C -2.546875 -8.53125 -1.328125 -7.40625 -1.328125 -5.75 C -1.328125 -4.078125 -2.609375 -2.890625 -4.46875 -2.890625 C -6.265625 -2.890625 -7.40625 -4.046875 -7.40625 -5.8125 C -7.40625 -7.546875 -6.3125 -8.53125 -4.359375 -8.53125 Z M -4.359375 -8.53125 "/>
</symbol>
<symbol overflow="visible" id="glyph1-6">
<path style="stroke:none;" d="M -4.109375 -10.546875 C -5.71875 -10.546875 -6.859375 -9.65625 -7.609375 -8.0625 C -8.515625 -9.53125 -9.265625 -10.046875 -10.625 -10.046875 C -12.890625 -10.046875 -14.515625 -8.1875 -14.515625 -5.609375 C -14.515625 -3.0625 -12.890625 -1.15625 -10.625 -1.15625 C -9.28125 -1.15625 -8.53125 -1.671875 -7.609375 -3.125 C -6.859375 -1.578125 -5.71875 -0.65625 -4.125 -0.65625 C -1.46875 -0.65625 0.3125 -2.75 0.3125 -5.609375 C 0.3125 -8.46875 -1.46875 -10.546875 -4.109375 -10.546875 Z M -10.59375 -8.015625 C -9.25 -8.015625 -8.359375 -7.125 -8.359375 -5.609375 C -8.359375 -4.109375 -9.25 -3.1875 -10.609375 -3.1875 C -12 -3.1875 -12.875 -4.109375 -12.875 -5.609375 C -12.875 -7.140625 -12 -8.015625 -10.59375 -8.015625 Z M -4.078125 -8.53125 C -2.359375 -8.53125 -1.328125 -7.40625 -1.328125 -5.578125 C -1.328125 -3.8125 -2.390625 -2.671875 -4.078125 -2.671875 C -5.78125 -2.671875 -6.8125 -3.8125 -6.8125 -5.609375 C -6.8125 -7.40625 -5.78125 -8.53125 -4.078125 -8.53125 Z M -4.078125 -8.53125 "/>
</symbol>
<symbol overflow="visible" id="glyph1-7">
<path style="stroke:none;" d="M -0.015625 -7.15625 L -14.515625 -7.15625 L -14.515625 -5.796875 C -12.265625 -5.15625 -11.984375 -4.859375 -11.625 -1.984375 L -10.3125 -1.984375 L -10.3125 -5.1875 L 0 -5.1875 L 0 -7.15625 Z M -0.015625 -7.15625 "/>
</symbol>
<symbol overflow="visible" id="glyph2-0">
<path style="stroke:none;" d=""/>
</symbol>
<symbol overflow="visible" id="glyph2-1">
<path style="stroke:none;" d="M 11.015625 -3.53125 C 11.015625 -5.40625 9.953125 -6.34375 7.46875 -6.9375 L 5.546875 -7.390625 C 3.90625 -7.78125 3.21875 -8.296875 3.21875 -9.1875 C 3.21875 -10.34375 4.25 -11.09375 5.875 -11.09375 C 7.484375 -11.09375 8.328125 -10.390625 8.375 -9.078125 L 10.515625 -9.078125 C 10.484375 -11.546875 8.859375 -12.9375 5.953125 -12.9375 C 3.03125 -12.9375 1.109375 -11.421875 1.109375 -9.09375 C 1.109375 -7.125 2.140625 -6.1875 5.109375 -5.46875 L 6.984375 -5.015625 C 8.375 -4.6875 8.90625 -4.265625 8.90625 -3.359375 C 8.90625 -2.1875 7.75 -1.484375 6 -1.484375 C 4.203125 -1.484375 3.1875 -1.921875 2.921875 -3.84375 L 0.796875 -3.84375 C 0.890625 -0.9375 2.546875 0.359375 5.828125 0.359375 C 9 0.359375 11.015625 -1.109375 11.015625 -3.53125 Z M 11.015625 -3.53125 "/>
</symbol>
<symbol overflow="visible" id="glyph2-2">
<path style="stroke:none;" d="M 3.625 0 L 3.625 -17.5 L 1.609375 -17.5 L 1.609375 0 Z M 3.625 0 "/>
</symbol>
<symbol overflow="visible" id="glyph2-3">
<path style="stroke:none;" d="M 12.234375 -6.1875 C 12.234375 -10.53125 10.15625 -12.9375 6.53125 -12.9375 C 3 -12.9375 0.84375 -10.515625 0.84375 -6.28125 C 0.84375 -2.0625 2.96875 0.359375 6.546875 0.359375 C 10.078125 0.359375 12.234375 -2.0625 12.234375 -6.1875 Z M 10.125 -6.21875 C 10.125 -3.265625 8.765625 -1.484375 6.546875 -1.484375 C 4.3125 -1.484375 2.953125 -3.234375 2.953125 -6.28125 C 2.953125 -9.3125 4.3125 -11.09375 6.546875 -11.09375 C 8.8125 -11.09375 10.125 -9.34375 10.125 -6.21875 Z M 10.125 -6.21875 "/>
</symbol>
<symbol overflow="visible" id="glyph2-4">
<path style="stroke:none;" d="M 12.546875 -6.171875 C 12.546875 -10.390625 10.484375 -12.9375 7.15625 -12.9375 C 5.453125 -12.9375 4.0625 -12.171875 3.125 -10.6875 L 3.140625 -10.6875 L 3.140625 -12.578125 L 1.296875 -12.578125 L 1.296875 5.234375 L 3.3125 5.234375 L 3.3125 -1.515625 L 3.28125 -1.515625 C 4.34375 -0.21875 5.546875 0.359375 7.171875 0.359375 C 10.421875 0.359375 12.546875 -2.15625 12.546875 -6.171875 Z M 10.4375 -6.21875 C 10.4375 -3.359375 9 -1.515625 6.8125 -1.515625 C 4.703125 -1.515625 3.3125 -3.234375 3.3125 -6.1875 C 3.3125 -9.140625 4.703125 -11.0625 6.8125 -11.0625 C 9.03125 -11.0625 10.4375 -9.21875 10.4375 -6.21875 Z M 10.4375 -6.21875 "/>
</symbol>
<symbol overflow="visible" id="glyph2-5">
<path style="stroke:none;" d="M 12.3125 -5.71875 C 12.3125 -7.53125 12.171875 -8.6875 11.8125 -9.625 C 10.984375 -11.6875 9.078125 -12.9375 6.71875 -12.9375 C 3.21875 -12.9375 0.9375 -10.34375 0.9375 -6.21875 C 0.9375 -2.09375 3.140625 0.359375 6.671875 0.359375 C 9.546875 0.359375 11.546875 -1.265625 12.046875 -3.8125 L 10.015625 -3.8125 C 9.453125 -2.15625 8.359375 -1.484375 6.75 -1.484375 C 4.65625 -1.484375 3.09375 -2.828125 3.046875 -5.71875 Z M 10.171875 -7.484375 C 10.171875 -7.484375 10.15625 -7.390625 10.125 -7.34375 L 3.09375 -7.34375 C 3.265625 -9.578125 4.6875 -11.09375 6.703125 -11.09375 C 8.65625 -11.09375 10.15625 -9.453125 10.15625 -7.484375 Z M 10.171875 -7.484375 "/>
</symbol>
<symbol overflow="visible" id="glyph2-6">
<path style="stroke:none;" d=""/>
</symbol>
<symbol overflow="visible" id="glyph2-7">
<path style="stroke:none;" d="M 11.875 5.234375 L 11.875 -12.578125 L 10.078125 -12.578125 L 10.078125 -10.890625 L 10.109375 -10.890625 C 9.171875 -12.21875 7.75 -12.9375 6.09375 -12.9375 C 2.78125 -12.9375 0.59375 -10.3125 0.59375 -6.140625 C 0.59375 -2.0625 2.6875 0.359375 6 0.359375 C 7.75 0.359375 8.953125 -0.265625 9.890625 -1.625 L 9.859375 -1.625 L 9.859375 5.234375 Z M 9.859375 -6.21875 C 9.859375 -3.34375 8.5 -1.515625 6.390625 -1.515625 C 4.171875 -1.515625 2.71875 -3.359375 2.71875 -6.28125 C 2.71875 -9.1875 4.171875 -11.0625 6.390625 -11.0625 C 8.515625 -11.0625 9.859375 -9.140625 9.859375 -6.21875 Z M 9.859375 -6.21875 "/>
</symbol>
<symbol overflow="visible" id="glyph2-8">
<path style="stroke:none;" d="M 11.5625 0 L 11.5625 -12.578125 L 9.546875 -12.578125 L 9.546875 -5.640625 C 9.546875 -3.078125 8.234375 -1.390625 6.140625 -1.390625 C 4.5625 -1.390625 3.546875 -2.359375 3.546875 -3.859375 L 3.546875 -12.578125 L 1.53125 -12.578125 L 1.53125 -3.078125 C 1.53125 -0.984375 3.125 0.359375 5.5625 0.359375 C 7.421875 0.359375 8.59375 -0.28125 9.765625 -1.9375 L 9.75 -1.9375 L 9.75 0 Z M 11.5625 0 "/>
</symbol>
<symbol overflow="visible" id="glyph2-9">
<path style="stroke:none;" d="M 12.84375 -0.046875 L 12.84375 -1.5625 C 12.625 -1.515625 12.53125 -1.515625 12.40625 -1.515625 C 11.71875 -1.515625 11.328125 -1.875 11.328125 -2.5 L 11.328125 -9.5 C 11.328125 -11.734375 9.703125 -12.9375 6.59375 -12.9375 C 3.546875 -12.9375 1.65625 -11.765625 1.53125 -8.859375 L 3.578125 -8.859375 C 3.75 -10.390625 4.65625 -11.09375 6.53125 -11.09375 C 8.328125 -11.09375 9.3125 -10.421875 9.3125 -9.21875 L 9.3125 -8.6875 C 9.3125 -7.84375 8.828125 -7.484375 7.25 -7.296875 C 4.421875 -6.9375 3.984375 -6.84375 3.21875 -6.53125 C 1.75 -5.921875 0.984375 -4.796875 0.984375 -3.265625 C 0.984375 -0.984375 2.59375 0.359375 5.140625 0.359375 C 6.75 0.359375 8.296875 -0.3125 9.390625 -1.4375 C 9.59375 -0.53125 10.484375 0.171875 11.46875 0.171875 C 11.875 0.171875 12.1875 0.125 12.84375 -0.046875 Z M 9.3125 -4.34375 C 9.3125 -2.546875 7.515625 -1.390625 5.5625 -1.390625 C 4.015625 -1.390625 3.09375 -1.9375 3.09375 -3.3125 C 3.09375 -4.625 3.984375 -5.203125 6.125 -5.515625 C 8.234375 -5.8125 8.65625 -5.90625 9.3125 -6.1875 Z M 9.3125 -4.34375 "/>
</symbol>
<symbol overflow="visible" id="glyph2-10">
<path style="stroke:none;" d="M 11.875 0 L 11.875 -17.5 L 9.859375 -17.5 L 9.859375 -10.984375 L 9.890625 -10.984375 C 9.046875 -12.265625 7.703125 -12.9375 6.03125 -12.9375 C 2.765625 -12.9375 0.59375 -10.421875 0.59375 -6.40625 C 0.59375 -2.15625 2.71875 0.359375 6.09375 0.359375 C 7.828125 0.359375 9.03125 -0.28125 10.109375 -1.84375 L 10.078125 -1.84375 L 10.078125 0 Z M 9.859375 -6.234375 C 9.859375 -3.34375 8.5 -1.515625 6.390625 -1.515625 C 4.171875 -1.515625 2.71875 -3.359375 2.71875 -6.28125 C 2.71875 -9.21875 4.171875 -11.0625 6.359375 -11.0625 C 8.515625 -11.0625 9.859375 -9.140625 9.859375 -6.234375 Z M 9.859375 -6.234375 "/>
</symbol>
<symbol overflow="visible" id="glyph2-11">
<path style="stroke:none;" d="M 7.703125 -10.828125 L 7.703125 -12.84375 C 7.375 -12.90625 7.203125 -12.9375 6.9375 -12.9375 C 5.640625 -12.9375 4.625 -12.171875 3.484375 -10.296875 L 3.5 -10.296875 L 3.5 -12.578125 L 1.65625 -12.578125 L 1.65625 0 L 3.671875 0 L 3.671875 -6.53125 C 3.671875 -9.359375 4.609375 -10.78125 7.703125 -10.828125 Z M 7.703125 -10.828125 "/>
</symbol>
<symbol overflow="visible" id="glyph2-12">
<path style="stroke:none;" d="M 6.09375 0 L 6.09375 -1.6875 C 5.828125 -1.609375 5.515625 -1.578125 5.140625 -1.578125 C 4.265625 -1.578125 4.03125 -1.828125 4.03125 -2.71875 L 4.03125 -10.9375 L 6.09375 -10.9375 L 6.09375 -12.578125 L 4.03125 -12.578125 L 4.03125 -16.03125 L 2.015625 -16.03125 L 2.015625 -12.578125 L 0.3125 -12.578125 L 0.3125 -10.9375 L 2.015625 -10.9375 L 2.015625 -1.828125 C 2.015625 -0.546875 2.90625 0.171875 4.46875 0.171875 C 4.9375 0.171875 5.421875 0.125 6.09375 0 Z M 6.09375 0 "/>
</symbol>
<symbol overflow="visible" id="glyph2-13">
<path style="stroke:none;" d="M 11.6875 0 L 11.6875 -9.5 C 11.6875 -11.59375 10.125 -12.9375 7.703125 -12.9375 C 5.828125 -12.9375 4.609375 -12.21875 3.5 -10.46875 L 3.53125 -10.46875 L 3.53125 -12.578125 L 1.65625 -12.578125 L 1.65625 0 L 3.671875 0 L 3.671875 -6.9375 C 3.671875 -9.5 5.0625 -11.1875 7.109375 -11.1875 C 8.6875 -11.1875 9.671875 -10.21875 9.671875 -8.71875 L 9.671875 0 Z M 11.6875 0 "/>
</symbol>
<symbol overflow="visible" id="glyph2-14">
<path style="stroke:none;" d="M 11.734375 -2.0625 L 11.734375 -12.578125 L 9.859375 -12.578125 L 9.859375 -10.75 L 9.890625 -10.75 C 8.875 -12.234375 7.65625 -12.9375 6.046875 -12.9375 C 2.859375 -12.9375 0.671875 -10.25 0.671875 -6.171875 C 0.671875 -2.203125 2.921875 0.359375 5.875 0.359375 C 7.46875 0.359375 8.5625 -0.3125 9.890625 -1.890625 L 9.859375 -1.890625 L 9.859375 -1.0625 C 9.859375 2.28125 8.515625 3.546875 6.1875 3.546875 C 4.609375 3.546875 3.390625 2.96875 3.140625 1.4375 L 1.078125 1.4375 C 1.296875 3.8125 3.171875 5.234375 6.125 5.234375 C 10.0625 5.234375 11.734375 3.484375 11.734375 -2.0625 Z M 9.671875 -6.21875 C 9.671875 -3.21875 8.40625 -1.484375 6.28125 -1.484375 C 4.109375 -1.484375 2.78125 -3.234375 2.78125 -6.28125 C 2.78125 -9.3125 4.125 -11.09375 6.265625 -11.09375 C 8.421875 -11.09375 9.671875 -9.265625 9.671875 -6.21875 Z M 9.671875 -6.21875 "/>
</symbol>
<symbol overflow="visible" id="glyph2-15">
<path style="stroke:none;" d="M 11.46875 -12.578125 L 9.28125 -12.578125 L 5.8125 -2.78125 L 5.828125 -2.78125 L 2.609375 -12.578125 L 0.453125 -12.578125 L 4.703125 0.046875 L 3.9375 2.046875 C 3.59375 2.921875 3.21875 3.265625 2.359375 3.265625 C 2.0625 3.265625 1.734375 3.21875 1.265625 3.125 L 1.265625 4.921875 C 1.6875 5.140625 2.109375 5.234375 2.640625 5.234375 C 4.0625 5.234375 5.203125 4.4375 5.875 2.640625 Z M 11.46875 -12.578125 "/>
</symbol>
<symbol overflow="visible" id="glyph2-16">
<path style="stroke:none;" d="M 12.546875 -6.4375 C 12.546875 -10.515625 10.484375 -12.9375 7.171875 -12.9375 C 5.453125 -12.9375 4.203125 -12.28125 3.265625 -10.875 L 3.28125 -10.875 L 3.28125 -17.5 L 1.265625 -17.5 L 1.265625 0 L 3.09375 0 L 3.09375 -1.796875 L 3.078125 -1.796875 C 4.03125 -0.34375 5.328125 0.359375 7.078125 0.359375 C 10.390625 0.359375 12.546875 -2.359375 12.546875 -6.4375 Z M 10.4375 -6.3125 C 10.4375 -3.453125 8.96875 -1.515625 6.796875 -1.515625 C 4.6875 -1.515625 3.28125 -3.4375 3.28125 -6.28125 C 3.28125 -9.234375 4.6875 -11.15625 6.796875 -11.0625 C 9.03125 -11.0625 10.4375 -9.125 10.4375 -6.3125 Z M 10.4375 -6.3125 "/>
</symbol>
<symbol overflow="visible" id="glyph2-17">
<path style="stroke:none;" d="M 3.671875 0 L 3.671875 -12.578125 L 1.65625 -12.578125 L 1.65625 0 Z M 3.9375 -14.46875 L 3.9375 -16.96875 L 1.421875 -16.96875 L 1.421875 -14.46875 Z M 3.9375 -14.46875 "/>
</symbol>
<symbol overflow="visible" id="glyph3-0">
<path style="stroke:none;" d=""/>
</symbol>
<symbol overflow="visible" id="glyph3-1">
<path style="stroke:none;" d="M -10.9375 -6.1875 L -12.578125 -6.1875 L -12.578125 -4.109375 L -14.546875 -4.109375 C -15.390625 -4.109375 -15.8125 -4.578125 -15.8125 -5.5 C -15.8125 -5.65625 -15.8125 -5.734375 -15.765625 -6.1875 L -17.421875 -6.1875 C -17.546875 -5.734375 -17.5625 -5.46875 -17.5625 -5.0625 C -17.5625 -3.21875 -16.515625 -2.09375 -14.71875 -2.09375 L -12.578125 -2.09375 L -12.578125 -0.40625 L -10.9375 -0.40625 L -10.9375 -2.09375 L 0 -2.09375 L 0 -4.109375 L -10.9375 -4.109375 Z M -10.9375 -6.1875 "/>
</symbol>
<symbol overflow="visible" id="glyph3-2">
<path style="stroke:none;" d="M -10.828125 -7.703125 L -12.84375 -7.703125 C -12.90625 -7.375 -12.9375 -7.203125 -12.9375 -6.9375 C -12.9375 -5.640625 -12.171875 -4.625 -10.296875 -3.484375 L -10.296875 -3.5 L -12.578125 -3.5 L -12.578125 -1.65625 L 0 -1.65625 L 0 -3.671875 L -6.53125 -3.671875 C -9.359375 -3.671875 -10.78125 -4.609375 -10.828125 -7.703125 Z M -10.828125 -7.703125 "/>
</symbol>
<symbol overflow="visible" id="glyph3-3">
<path style="stroke:none;" d="M -5.71875 -12.3125 C -7.53125 -12.3125 -8.6875 -12.171875 -9.625 -11.8125 C -11.6875 -10.984375 -12.9375 -9.078125 -12.9375 -6.71875 C -12.9375 -3.21875 -10.34375 -0.9375 -6.21875 -0.9375 C -2.09375 -0.9375 0.359375 -3.140625 0.359375 -6.671875 C 0.359375 -9.546875 -1.265625 -11.546875 -3.8125 -12.046875 L -3.8125 -10.015625 C -2.15625 -9.453125 -1.484375 -8.359375 -1.484375 -6.75 C -1.484375 -4.65625 -2.828125 -3.09375 -5.71875 -3.046875 Z M -7.484375 -10.171875 C -7.484375 -10.171875 -7.390625 -10.15625 -7.34375 -10.125 L -7.34375 -3.09375 C -9.578125 -3.265625 -11.09375 -4.6875 -11.09375 -6.703125 C -11.09375 -8.65625 -9.453125 -10.15625 -7.484375 -10.15625 Z M -7.484375 -10.171875 "/>
</symbol>
<symbol overflow="visible" id="glyph3-4">
<path style="stroke:none;" d="M 0 -11.6875 L -9.5 -11.6875 C -11.59375 -11.6875 -12.9375 -10.125 -12.9375 -7.703125 C -12.9375 -5.828125 -12.21875 -4.609375 -10.46875 -3.5 L -10.46875 -3.53125 L -12.578125 -3.53125 L -12.578125 -1.65625 L 0 -1.65625 L 0 -3.671875 L -6.9375 -3.671875 C -9.5 -3.671875 -11.1875 -5.0625 -11.1875 -7.109375 C -11.1875 -8.6875 -10.21875 -9.671875 -8.71875 -9.671875 L 0 -9.671875 Z M 0 -11.6875 "/>
</symbol>
<symbol overflow="visible" id="glyph3-5">
<path style="stroke:none;" d="M -2.0625 -11.734375 L -12.578125 -11.734375 L -12.578125 -9.859375 L -10.75 -9.859375 L -10.75 -9.890625 C -12.234375 -8.875 -12.9375 -7.65625 -12.9375 -6.046875 C -12.9375 -2.859375 -10.25 -0.671875 -6.171875 -0.671875 C -2.203125 -0.671875 0.359375 -2.921875 0.359375 -5.875 C 0.359375 -7.46875 -0.3125 -8.5625 -1.890625 -9.890625 L -1.890625 -9.859375 L -1.0625 -9.859375 C 2.28125 -9.859375 3.546875 -8.515625 3.546875 -6.1875 C 3.546875 -4.609375 2.96875 -3.390625 1.4375 -3.140625 L 1.4375 -1.078125 C 3.8125 -1.296875 5.234375 -3.171875 5.234375 -6.125 C 5.234375 -10.0625 3.484375 -11.734375 -2.0625 -11.734375 Z M -6.21875 -9.671875 C -3.21875 -9.671875 -1.484375 -8.40625 -1.484375 -6.28125 C -1.484375 -4.109375 -3.234375 -2.78125 -6.28125 -2.78125 C -9.3125 -2.78125 -11.09375 -4.125 -11.09375 -6.265625 C -11.09375 -8.421875 -9.265625 -9.671875 -6.21875 -9.671875 Z M -6.21875 -9.671875 "/>
</symbol>
<symbol overflow="visible" id="glyph3-6">
<path style="stroke:none;" d="M -12.578125 -11.46875 L -12.578125 -9.28125 L -2.78125 -5.8125 L -2.78125 -5.828125 L -12.578125 -2.609375 L -12.578125 -0.453125 L 0.046875 -4.703125 L 2.046875 -3.9375 C 2.921875 -3.59375 3.265625 -3.21875 3.265625 -2.359375 C 3.265625 -2.0625 3.21875 -1.734375 3.125 -1.265625 L 4.921875 -1.265625 C 5.140625 -1.6875 5.234375 -2.109375 5.234375 -2.640625 C 5.234375 -4.0625 4.4375 -5.203125 2.640625 -5.875 Z M -12.578125 -11.46875 "/>
</symbol>
<symbol overflow="visible" id="glyph3-7">
<path style="stroke:none;" d="M 0 -11.875 L -17.5 -11.875 L -17.5 -9.859375 L -10.984375 -9.859375 L -10.984375 -9.890625 C -12.265625 -9.046875 -12.9375 -7.703125 -12.9375 -6.03125 C -12.9375 -2.765625 -10.421875 -0.59375 -6.40625 -0.59375 C -2.15625 -0.59375 0.359375 -2.71875 0.359375 -6.09375 C 0.359375 -7.828125 -0.28125 -9.03125 -1.84375 -10.109375 L -1.84375 -10.078125 L 0 -10.078125 Z M -6.234375 -9.859375 C -3.34375 -9.859375 -1.515625 -8.5 -1.515625 -6.390625 C -1.515625 -4.171875 -3.359375 -2.71875 -6.28125 -2.71875 C -9.21875 -2.71875 -11.0625 -4.171875 -11.0625 -6.359375 C -11.0625 -8.515625 -9.140625 -9.859375 -6.234375 -9.859375 Z M -6.234375 -9.859375 "/>
</symbol>
<symbol overflow="visible" id="glyph3-8">
<path style="stroke:none;" d="M 0 -3.671875 L -12.578125 -3.671875 L -12.578125 -1.65625 L 0 -1.65625 Z M -14.46875 -3.9375 L -16.96875 -3.9375 L -16.96875 -1.421875 L -14.46875 -1.421875 Z M -14.46875 -3.9375 "/>
</symbol>
<symbol overflow="visible" id="glyph3-9">
<path style="stroke:none;" d="M -4.3125 -11.453125 L -4.3125 -9.40625 C -2.296875 -9.078125 -1.484375 -8.0625 -1.484375 -6.359375 C -1.484375 -4.15625 -3.1875 -2.828125 -6.171875 -2.828125 C -9.3125 -2.828125 -11.09375 -4.125 -11.09375 -6.3125 C -11.09375 -7.984375 -10.109375 -9.03125 -8.359375 -9.265625 L -8.359375 -11.296875 C -11.421875 -11.0625 -12.9375 -9.140625 -12.9375 -6.34375 C -12.9375 -2.953125 -10.34375 -0.71875 -6.171875 -0.71875 C -2.109375 -0.71875 0.359375 -2.90625 0.359375 -6.3125 C 0.359375 -9.3125 -1.4375 -11.203125 -4.3125 -11.453125 Z M -4.3125 -11.453125 "/>
</symbol>
<symbol overflow="visible" id="glyph3-10">
<path style="stroke:none;" d="M -15.53125 -13.890625 L -17.5 -13.890625 L -17.5 -2.140625 L 0 -2.140625 L 0 -4.390625 L -7.96875 -4.390625 L -7.96875 -12.75 L -9.9375 -12.75 L -9.9375 -4.390625 L -15.53125 -4.390625 Z M -15.53125 -13.890625 "/>
</symbol>
<symbol overflow="visible" id="glyph3-11">
<path style="stroke:none;" d="M -3.53125 -11.015625 C -5.40625 -11.015625 -6.34375 -9.953125 -6.9375 -7.46875 L -7.390625 -5.546875 C -7.78125 -3.90625 -8.296875 -3.21875 -9.1875 -3.21875 C -10.34375 -3.21875 -11.09375 -4.25 -11.09375 -5.875 C -11.09375 -7.484375 -10.390625 -8.328125 -9.078125 -8.375 L -9.078125 -10.515625 C -11.546875 -10.484375 -12.9375 -8.859375 -12.9375 -5.953125 C -12.9375 -3.03125 -11.421875 -1.109375 -9.09375 -1.109375 C -7.125 -1.109375 -6.1875 -2.140625 -5.46875 -5.109375 L -5.015625 -6.984375 C -4.6875 -8.375 -4.265625 -8.90625 -3.359375 -8.90625 C -2.1875 -8.90625 -1.484375 -7.75 -1.484375 -6 C -1.484375 -4.203125 -1.921875 -3.1875 -3.84375 -2.921875 L -3.84375 -0.796875 C -0.9375 -0.890625 0.359375 -2.546875 0.359375 -5.828125 C 0.359375 -9 -1.109375 -11.015625 -3.53125 -11.015625 Z M -3.53125 -11.015625 "/>
</symbol>
<symbol overflow="visible" id="glyph4-0">
<path style="stroke:none;" d=""/>
</symbol>
<symbol overflow="visible" id="glyph4-1">
<path style="stroke:none;" d=""/>
</symbol>
<symbol overflow="visible" id="glyph4-2">
<path style="stroke:none;" d="M 0 -0.140625 L 0 -14.59375 L -16.515625 -7.84375 Z M -1.21875 -1.84375 L -12.21875 -6.953125 L -1.21875 -11.5 Z M -1.21875 -1.84375 "/>
</symbol>
<symbol overflow="visible" id="glyph5-0">
<path style="stroke:none;" d=""/>
</symbol>
<symbol overflow="visible" id="glyph5-1">
<path style="stroke:none;" d="M 4.65625 -9 C 3.953125 -7.984375 3.515625 -7.5 2.734375 -6.90625 C 0.5625 -5.28125 -3.1875 -4.34375 -7.625 -4.34375 C -11.671875 -4.34375 -15.265625 -5.125 -17.4375 -6.515625 C -18.453125 -7.171875 -19.015625 -7.734375 -19.890625 -9 L -20.40625 -8.609375 C -19.6875 -7.234375 -19.265625 -6.625 -18.546875 -5.84375 C -16.046875 -3.15625 -12 -1.59375 -7.625 -1.59375 C -3.515625 -1.59375 0.265625 -2.9375 2.796875 -5.375 C 3.78125 -6.265625 4.296875 -6.984375 5.15625 -8.609375 Z M 4.65625 -9 "/>
</symbol>
<symbol overflow="visible" id="glyph5-2">
<path style="stroke:none;" d="M 5.15625 -1.296875 C 4.40625 -2.671875 4.015625 -3.265625 3.296875 -4.046875 C 0.8125 -6.71875 -3.234375 -8.3125 -7.625 -8.3125 C -11.734375 -8.3125 -15.515625 -6.9375 -18.0625 -4.53125 C -19.015625 -3.625 -19.5625 -2.90625 -20.40625 -1.296875 L -19.890625 -0.90625 C -19.171875 -1.953125 -18.75 -2.40625 -17.96875 -3 C -15.8125 -4.625 -12.0625 -5.546875 -7.625 -5.546875 C -3.5625 -5.546875 0 -4.765625 2.15625 -3.390625 C 3.203125 -2.703125 3.8125 -2.125 4.65625 -0.90625 Z M 5.15625 -1.296875 "/>
</symbol>
</g>
</defs>
<g id="surface1">
<rect x="0" y="0" width="504" height="504" style="fill:rgb(100%,100%,100%);fill-opacity:1;stroke:none;"/>
<path style="fill:none;stroke-width:3.75;stroke-linecap:round;stroke-linejoin:round;stroke:rgb(0%,0%,0%);stroke-opacity:1;stroke-dasharray:3.75,11.25;stroke-miterlimit:10;" d="M 88 427.09375 L 88.445312 426.941406 L 88.890625 426.792969 L 89.332031 426.640625 L 89.777344 426.488281 L 90.222656 426.332031 L 90.667969 426.179688 L 91.109375 426.023438 L 92.445312 425.554688 L 92.890625 425.394531 L 93.332031 425.238281 L 94.222656 424.917969 L 94.667969 424.753906 L 95.109375 424.59375 L 95.554688 424.429688 L 96 424.269531 L 96.445312 424.105469 L 96.890625 423.9375 L 97.332031 423.773438 L 97.777344 423.609375 L 98.667969 423.273438 L 99.109375 423.105469 L 99.554688 422.933594 L 100 422.765625 L 100.445312 422.59375 L 100.890625 422.425781 L 101.332031 422.25 L 101.777344 422.078125 L 102.222656 421.902344 L 102.667969 421.730469 L 103.109375 421.558594 L 104 421.207031 L 104.445312 421.027344 L 104.890625 420.851562 L 105.332031 420.671875 L 105.777344 420.496094 L 106.222656 420.316406 L 106.667969 420.132812 L 107.109375 419.953125 L 107.554688 419.773438 L 108.890625 419.222656 L 109.332031 419.039062 L 109.777344 418.855469 L 110.667969 418.480469 L 111.109375 418.292969 L 112.445312 417.730469 L 112.890625 417.539062 L 113.332031 417.347656 L 114.667969 416.773438 L 115.109375 416.582031 L 116.890625 415.800781 L 117.332031 415.605469 L 117.777344 415.40625 L 118.222656 415.210938 L 118.667969 415.011719 L 119.109375 414.8125 L 120 414.414062 L 120.890625 414.007812 L 121.332031 413.796875 L 121.777344 413.59375 L 122.222656 413.402344 L 122.667969 413.195312 L 123.109375 412.992188 L 124.890625 412.164062 L 125.332031 411.957031 L 125.777344 411.746094 L 126.222656 411.539062 L 126.667969 411.328125 L 127.109375 411.117188 L 128 410.695312 L 128.890625 410.265625 L 129.332031 410.050781 L 130.667969 409.40625 L 131.109375 409.1875 L 131.554688 408.972656 L 132.890625 408.316406 L 133.332031 408.09375 L 133.777344 407.875 L 134.667969 407.429688 L 135.109375 407.207031 L 136.445312 406.539062 L 136.890625 406.3125 L 137.332031 406.085938 L 138.667969 405.40625 L 139.109375 405.175781 L 139.554688 404.949219 L 140.890625 404.257812 L 141.332031 404.023438 L 141.777344 403.792969 L 142.222656 403.558594 L 142.667969 403.328125 L 143.109375 403.09375 L 143.554688 402.855469 L 144.445312 402.386719 L 144.890625 402.148438 L 145.332031 401.910156 L 146.667969 401.195312 L 147.109375 400.957031 L 148.445312 400.230469 L 148.890625 399.984375 L 149.332031 399.738281 L 149.777344 399.496094 L 150.222656 399.25 L 150.667969 399.007812 L 151.109375 398.761719 L 151.554688 398.511719 L 152.445312 398.019531 L 152.890625 397.769531 L 153.332031 397.519531 L 154.667969 396.769531 L 155.109375 396.519531 L 156.890625 395.503906 L 157.332031 395.25 L 157.777344 394.996094 L 158.667969 394.480469 L 159.109375 394.222656 L 160 393.707031 L 160.445312 393.445312 L 160.890625 393.1875 L 161.332031 392.925781 L 162.667969 392.140625 L 163.109375 391.875 L 163.554688 391.613281 L 164.890625 390.816406 L 165.332031 390.550781 L 165.777344 390.285156 L 166.667969 389.746094 L 167.109375 389.476562 L 168 388.9375 L 168.445312 388.664062 L 168.890625 388.394531 L 169.332031 388.121094 L 170.667969 387.300781 L 171.109375 387.023438 L 171.554688 386.75 L 172.890625 385.917969 L 173.332031 385.640625 L 173.777344 385.359375 L 174.222656 385.082031 L 174.667969 384.800781 L 175.109375 384.519531 L 176 383.957031 L 176.445312 383.671875 L 176.890625 383.390625 L 177.332031 383.105469 L 178.667969 382.25 L 179.109375 381.960938 L 179.554688 381.675781 L 180.890625 380.808594 L 181.332031 380.519531 L 182.222656 379.933594 L 182.667969 379.644531 L 183.109375 379.351562 L 183.554688 379.058594 L 184 378.761719 L 184.445312 378.46875 L 184.890625 378.171875 L 185.332031 377.878906 L 186.222656 377.285156 L 186.667969 376.984375 L 187.109375 376.6875 L 187.554688 376.386719 L 188 376.089844 L 188.890625 375.488281 L 189.332031 375.183594 L 189.777344 374.882812 L 190.667969 374.273438 L 191.109375 373.972656 L 191.554688 373.664062 L 192.445312 373.054688 L 192.890625 372.746094 L 193.332031 372.4375 L 194.667969 371.511719 L 195.109375 371.203125 L 196.890625 369.953125 L 197.332031 369.640625 L 197.777344 369.324219 L 198.222656 369.011719 L 198.667969 368.695312 L 199.109375 368.378906 L 200 367.746094 L 200.445312 367.425781 L 200.890625 367.109375 L 201.332031 366.789062 L 202.222656 366.148438 L 202.667969 365.824219 L 203.109375 365.503906 L 204.890625 364.207031 L 205.332031 363.882812 L 205.777344 363.554688 L 206.222656 363.230469 L 206.667969 362.902344 L 207.109375 362.574219 L 207.554688 362.246094 L 208 361.914062 L 208.445312 361.585938 L 208.890625 361.253906 L 209.332031 360.921875 L 210.667969 359.925781 L 211.109375 359.589844 L 211.554688 359.257812 L 212.890625 358.25 L 213.332031 357.910156 L 213.777344 357.574219 L 214.667969 356.894531 L 215.109375 356.554688 L 216 355.875 L 216.890625 355.1875 L 217.332031 354.84375 L 218.667969 353.8125 L 219.109375 353.464844 L 220.890625 352.074219 L 221.332031 351.726562 L 222.667969 350.671875 L 223.109375 350.320312 L 223.554688 349.96875 L 224 349.613281 L 224.445312 349.261719 L 224.890625 348.90625 L 225.332031 348.550781 L 226.222656 347.839844 L 226.667969 347.480469 L 227.109375 347.121094 L 227.554688 346.765625 L 228 346.40625 L 228.445312 346.042969 L 228.890625 345.683594 L 229.332031 345.324219 L 230.667969 344.234375 L 231.109375 343.871094 L 231.554688 343.507812 L 232.890625 342.40625 L 233.332031 342.039062 L 234.222656 341.304688 L 234.667969 340.933594 L 235.109375 340.5625 L 236.890625 339.078125 L 237.332031 338.703125 L 238.667969 337.578125 L 239.109375 337.203125 L 239.554688 336.824219 L 240 336.449219 L 240.890625 335.691406 L 241.332031 335.3125 L 241.777344 334.929688 L 242.222656 334.550781 L 242.667969 334.167969 L 243.109375 333.785156 L 244.445312 332.636719 L 244.890625 332.25 L 245.332031 331.863281 L 245.777344 331.480469 L 246.222656 331.09375 L 246.667969 330.703125 L 247.109375 330.316406 L 248 329.535156 L 248.445312 329.148438 L 248.890625 328.753906 L 249.332031 328.363281 L 249.777344 327.972656 L 250.667969 327.183594 L 251.109375 326.789062 L 252 326 L 252.890625 325.203125 L 253.332031 324.808594 L 253.777344 324.410156 L 254.222656 324.007812 L 254.667969 323.609375 L 255.109375 323.207031 L 255.554688 322.808594 L 256.445312 322.003906 L 256.890625 321.597656 L 257.332031 321.195312 L 257.777344 320.789062 L 258.222656 320.386719 L 258.667969 319.980469 L 259.109375 319.570312 L 260 318.757812 L 260.890625 317.9375 L 261.332031 317.527344 L 262.222656 316.707031 L 262.667969 316.292969 L 263.109375 315.878906 L 264.890625 314.222656 L 265.332031 313.804688 L 266.667969 312.550781 L 267.109375 312.132812 L 267.554688 311.710938 L 268 311.292969 L 268.890625 310.449219 L 269.332031 310.027344 L 269.777344 309.601562 L 270.222656 309.179688 L 270.667969 308.753906 L 271.109375 308.328125 L 272 307.476562 L 272.445312 307.046875 L 272.890625 306.621094 L 273.332031 306.191406 L 274.222656 305.332031 L 274.667969 304.898438 L 275.109375 304.46875 L 276.890625 302.734375 L 277.332031 302.300781 L 278.222656 301.425781 L 278.667969 300.992188 L 279.109375 300.550781 L 280 299.675781 L 280.890625 298.792969 L 281.332031 298.351562 L 282.222656 297.46875 L 284 295.691406 L 284.445312 295.242188 L 284.890625 294.796875 L 285.332031 294.347656 L 285.777344 293.902344 L 286.222656 293.453125 L 286.667969 293 L 287.109375 292.550781 L 287.554688 292.101562 L 288.890625 290.742188 L 289.332031 290.289062 L 289.777344 289.835938 L 290.667969 288.921875 L 291.109375 288.464844 L 292.445312 287.09375 L 292.890625 286.632812 L 293.332031 286.171875 L 294.667969 284.789062 L 295.109375 284.324219 L 296.890625 282.464844 L 297.332031 282 L 298.667969 280.59375 L 299.109375 280.125 L 299.554688 279.65625 L 300 279.183594 L 300.445312 278.714844 L 300.890625 278.242188 L 301.332031 277.769531 L 301.777344 277.292969 L 302.222656 276.820312 L 302.667969 276.34375 L 303.109375 275.871094 L 304 274.917969 L 304.445312 274.4375 L 304.890625 273.960938 L 305.332031 273.480469 L 306.667969 272.039062 L 307.109375 271.558594 L 308.890625 269.621094 L 309.332031 269.136719 L 309.777344 268.652344 L 310.667969 267.675781 L 311.109375 267.1875 L 312 266.210938 L 312.890625 265.226562 L 313.332031 264.734375 L 314.667969 263.257812 L 315.109375 262.761719 L 316.890625 260.777344 L 317.332031 260.277344 L 318.667969 258.777344 L 319.109375 258.277344 L 319.554688 257.777344 L 320.890625 256.265625 L 321.332031 255.761719 L 321.777344 255.257812 L 322.667969 254.242188 L 323.109375 253.738281 L 323.554688 253.230469 L 324 252.71875 L 324.445312 252.210938 L 324.890625 251.699219 L 325.332031 251.1875 L 326.667969 249.652344 L 327.109375 249.136719 L 327.554688 248.625 L 328.890625 247.078125 L 329.332031 246.558594 L 329.777344 246.042969 L 330.667969 245.003906 L 331.109375 244.484375 L 331.554688 243.960938 L 332 243.441406 L 332.890625 242.394531 L 333.332031 241.871094 L 334.222656 240.824219 L 334.667969 240.296875 L 335.109375 239.769531 L 336.445312 238.1875 L 336.890625 237.65625 L 337.332031 237.128906 L 338.667969 235.535156 L 339.109375 235 L 339.554688 234.46875 L 340.890625 232.863281 L 341.332031 232.328125 L 342.667969 230.710938 L 343.109375 230.171875 L 344 229.09375 L 344.445312 228.550781 L 344.890625 228.011719 L 345.332031 227.46875 L 345.777344 226.921875 L 346.667969 225.835938 L 347.109375 225.289062 L 348.890625 223.101562 L 349.332031 222.550781 L 350.667969 220.898438 L 351.109375 220.347656 L 351.554688 219.792969 L 352 219.242188 L 352.890625 218.132812 L 353.332031 217.578125 L 353.777344 217.019531 L 354.222656 216.464844 L 354.667969 215.90625 L 355.109375 215.347656 L 356 214.230469 L 356.445312 213.667969 L 356.890625 213.109375 L 357.332031 212.546875 L 358.222656 211.421875 L 358.667969 210.855469 L 359.109375 210.292969 L 360.890625 208.027344 L 361.332031 207.457031 L 361.777344 206.886719 L 362.222656 206.320312 L 362.667969 205.75 L 363.109375 205.175781 L 363.554688 204.605469 L 364 204.03125 L 364.445312 203.460938 L 364.890625 202.886719 L 365.332031 202.3125 L 365.777344 201.734375 L 366.222656 201.160156 L 366.667969 200.582031 L 367.109375 200.003906 L 368.445312 198.269531 L 368.890625 197.6875 L 369.332031 197.109375 L 370.222656 195.945312 L 370.667969 195.359375 L 371.109375 194.777344 L 372.890625 192.433594 L 373.332031 191.847656 L 374.222656 190.667969 L 374.667969 190.082031 L 375.109375 189.488281 L 376 188.308594 L 376.890625 187.121094 L 377.332031 186.527344 L 378.222656 185.339844 L 378.667969 184.742188 L 379.109375 184.144531 L 380.890625 181.753906 L 381.332031 181.152344 L 382.667969 179.347656 L 383.109375 178.746094 L 384.890625 176.324219 L 385.332031 175.71875 L 385.777344 175.109375 L 386.222656 174.503906 L 386.667969 173.894531 L 387.109375 173.285156 L 387.554688 172.675781 L 388 172.0625 L 388.445312 171.453125 L 388.890625 170.839844 L 389.332031 170.226562 L 390.222656 169 L 390.667969 168.382812 L 391.109375 167.769531 L 392.445312 165.917969 L 392.890625 165.296875 L 393.332031 164.679688 L 394.667969 162.816406 L 395.109375 162.195312 L 395.554688 161.570312 L 396 160.949219 L 396.890625 159.699219 L 397.332031 159.070312 L 398.222656 157.820312 L 398.667969 157.191406 L 399.109375 156.5625 L 399.554688 155.933594 L 400 155.300781 L 400.445312 154.671875 L 400.890625 154.039062 L 401.332031 153.40625 L 402.667969 151.507812 L 403.109375 150.871094 L 403.554688 150.238281 L 404 149.601562 L 404.445312 148.960938 L 404.890625 148.324219 L 405.332031 147.6875 L 406.667969 145.765625 L 407.109375 145.125 L 407.554688 144.480469 L 408 143.839844 L 408.890625 142.550781 L 409.332031 141.90625 L 409.777344 141.261719 L 410.222656 140.613281 L 410.667969 139.96875 L 411.109375 139.320312 L 411.554688 138.671875 L 412 138.019531 L 412.445312 137.371094 L 412.890625 136.71875 L 413.332031 136.070312 L 414.222656 134.765625 L 414.667969 134.109375 L 415.109375 133.457031 L 416.890625 130.832031 L 417.332031 130.171875 L 417.777344 129.515625 L 418.667969 128.195312 L 419.109375 127.535156 L 419.554688 126.875 L 420.890625 124.882812 L 421.332031 124.21875 L 422.222656 122.890625 L 422.667969 122.222656 L 423.109375 121.554688 L 424.445312 119.550781 L 424.890625 118.878906 L 425.332031 118.210938 L 426.222656 116.867188 L 426.667969 116.191406 L 427.109375 115.519531 L 428.890625 112.816406 L 429.332031 112.140625 L 429.777344 111.460938 L 430.222656 110.785156 L 430.667969 110.105469 L 431.109375 109.421875 L 432 108.0625 L 432.890625 106.695312 L 433.332031 106.011719 L 434.222656 104.644531 L 434.667969 103.957031 L 435.109375 103.269531 L 436.445312 101.207031 L 436.890625 100.515625 L 437.332031 99.828125 L 438.667969 97.753906 L 439.109375 97.058594 L 439.554688 96.367188 L 440.890625 94.28125 L 441.332031 93.582031 L 441.777344 92.886719 L 442.667969 91.488281 L 443.109375 90.789062 L 444 89.390625 L 444.890625 87.984375 L 445.332031 87.28125 L 446.222656 85.875 L 446.667969 85.167969 L 447.109375 84.460938 L 448.890625 81.632812 L 449.332031 80.921875 L 450.667969 78.789062 L 451.109375 78.078125 L 452.890625 75.21875 L 453.332031 74.503906 L 453.777344 73.785156 L 454.222656 73.070312 L 454.667969 72.351562 L 455.109375 71.632812 L 455.554688 70.914062 L 456 70.191406 L 456.445312 69.472656 L 456.890625 68.75 L 457.332031 68.027344 L 457.777344 67.304688 L 458.222656 66.578125 L 458.667969 65.855469 L 459.109375 65.128906 L 460.445312 62.949219 L 460.890625 62.21875 L 461.332031 61.492188 L 462.667969 59.300781 L 463.109375 58.566406 L 463.554688 57.835938 L 464.890625 55.632812 L 465.332031 54.898438 L 465.777344 54.160156 L 466.222656 53.425781 L 466.667969 52.6875 L 467.109375 51.949219 L 467.554688 51.210938 L 468 50.46875 L 468.445312 49.730469 L 468.890625 48.988281 L 469.332031 48.246094 L 469.777344 47.503906 L 470.222656 46.757812 L 470.667969 46.015625 L 471.109375 45.269531 L 472.445312 43.03125 L 472.890625 42.28125 L 473.332031 41.535156 L 474.667969 39.285156 L 475.109375 38.535156 L 476.890625 35.519531 L 477.332031 34.765625 L 477.777344 34.007812 L 478.222656 33.253906 L 478.667969 32.496094 L 479.109375 31.738281 L 479.554688 30.980469 L 480 30.21875 L 480.445312 29.460938 L 480.890625 28.699219 L 481.332031 27.9375 L 481.777344 27.175781 L 482.222656 26.410156 L 482.667969 25.648438 L 483.109375 24.882812 L 484.890625 21.820312 L 485.332031 21.050781 L 486.667969 18.742188 L 487.109375 17.972656 L 488 16.425781 "/>
<path style="fill:none;stroke-width:0.75;stroke-linecap:round;stroke-linejoin:round;stroke:rgb(0%,0%,0%);stroke-opacity:1;stroke-miterlimit:10;" d="M 132.445312 443.519531 L 488 443.519531 "/>
<path style="fill:none;stroke-width:0.75;stroke-linecap:round;stroke-linejoin:round;stroke:rgb(0%,0%,0%);stroke-opacity:1;stroke-miterlimit:10;" d="M 132.445312 443.519531 L 132.445312 450.71875 "/>
<path style="fill:none;stroke-width:0.75;stroke-linecap:round;stroke-linejoin:round;stroke:rgb(0%,0%,0%);stroke-opacity:1;stroke-miterlimit:10;" d="M 221.332031 443.519531 L 221.332031 450.71875 "/>
<path style="fill:none;stroke-width:0.75;stroke-linecap:round;stroke-linejoin:round;stroke:rgb(0%,0%,0%);stroke-opacity:1;stroke-miterlimit:10;" d="M 310.222656 443.519531 L 310.222656 450.71875 "/>
<path style="fill:none;stroke-width:0.75;stroke-linecap:round;stroke-linejoin:round;stroke:rgb(0%,0%,0%);stroke-opacity:1;stroke-miterlimit:10;" d="M 399.109375 443.519531 L 399.109375 450.71875 "/>
<path style="fill:none;stroke-width:0.75;stroke-linecap:round;stroke-linejoin:round;stroke:rgb(0%,0%,0%);stroke-opacity:1;stroke-miterlimit:10;" d="M 488 443.519531 L 488 450.71875 "/>
<g style="fill:rgb(0%,0%,0%);fill-opacity:1;">
  <use xlink:href="#glyph0-1" x="117.945312" y="468.860352"/>
  <use xlink:href="#glyph0-2" x="129.291016" y="468.860352"/>
  <use xlink:href="#glyph0-3" x="134.963867" y="468.860352"/>
</g>
<g style="fill:rgb(0%,0%,0%);fill-opacity:1;">
  <use xlink:href="#glyph0-1" x="206.832031" y="468.860352"/>
  <use xlink:href="#glyph0-2" x="218.177734" y="468.860352"/>
  <use xlink:href="#glyph0-4" x="223.850586" y="468.860352"/>
</g>
<g style="fill:rgb(0%,0%,0%);fill-opacity:1;">
  <use xlink:href="#glyph0-1" x="295.722656" y="468.860352"/>
  <use xlink:href="#glyph0-2" x="307.068359" y="468.860352"/>
  <use xlink:href="#glyph0-5" x="312.741211" y="468.860352"/>
</g>
<g style="fill:rgb(0%,0%,0%);fill-opacity:1;">
  <use xlink:href="#glyph0-1" x="384.609375" y="468.860352"/>
  <use xlink:href="#glyph0-2" x="395.955078" y="468.860352"/>
  <use xlink:href="#glyph0-6" x="401.62793" y="468.860352"/>
</g>
<g style="fill:rgb(0%,0%,0%);fill-opacity:1;">
  <use xlink:href="#glyph0-7" x="473.5" y="468.860352"/>
  <use xlink:href="#glyph0-2" x="484.845703" y="468.860352"/>
  <use xlink:href="#glyph0-1" x="490.518555" y="468.860352"/>
</g>
<path style="fill:none;stroke-width:0.75;stroke-linecap:round;stroke-linejoin:round;stroke:rgb(0%,0%,0%);stroke-opacity:1;stroke-miterlimit:10;" d="M 72 427.09375 L 72 34.375 "/>
<path style="fill:none;stroke-width:0.75;stroke-linecap:round;stroke-linejoin:round;stroke:rgb(0%,0%,0%);stroke-opacity:1;stroke-miterlimit:10;" d="M 72 427.09375 L 64.800781 427.09375 "/>
<path style="fill:none;stroke-width:0.75;stroke-linecap:round;stroke-linejoin:round;stroke:rgb(0%,0%,0%);stroke-opacity:1;stroke-miterlimit:10;" d="M 72 361.640625 L 64.800781 361.640625 "/>
<path style="fill:none;stroke-width:0.75;stroke-linecap:round;stroke-linejoin:round;stroke:rgb(0%,0%,0%);stroke-opacity:1;stroke-miterlimit:10;" d="M 72 296.1875 L 64.800781 296.1875 "/>
<path style="fill:none;stroke-width:0.75;stroke-linecap:round;stroke-linejoin:round;stroke:rgb(0%,0%,0%);stroke-opacity:1;stroke-miterlimit:10;" d="M 72 230.734375 L 64.800781 230.734375 "/>
<path style="fill:none;stroke-width:0.75;stroke-linecap:round;stroke-linejoin:round;stroke:rgb(0%,0%,0%);stroke-opacity:1;stroke-miterlimit:10;" d="M 72 165.28125 L 64.800781 165.28125 "/>
<path style="fill:none;stroke-width:0.75;stroke-linecap:round;stroke-linejoin:round;stroke:rgb(0%,0%,0%);stroke-opacity:1;stroke-miterlimit:10;" d="M 72 99.828125 L 64.800781 99.828125 "/>
<path style="fill:none;stroke-width:0.75;stroke-linecap:round;stroke-linejoin:round;stroke:rgb(0%,0%,0%);stroke-opacity:1;stroke-miterlimit:10;" d="M 72 34.375 L 64.800781 34.375 "/>
<g style="fill:rgb(0%,0%,0%);fill-opacity:1;">
  <use xlink:href="#glyph1-1" x="54.137695" y="441.59375"/>
  <use xlink:href="#glyph1-2" x="54.137695" y="430.248047"/>
  <use xlink:href="#glyph1-1" x="54.137695" y="424.575195"/>
</g>
<g style="fill:rgb(0%,0%,0%);fill-opacity:1;">
  <use xlink:href="#glyph1-1" x="54.137695" y="376.140625"/>
  <use xlink:href="#glyph1-2" x="54.137695" y="364.794922"/>
  <use xlink:href="#glyph1-3" x="54.137695" y="359.12207"/>
</g>
<g style="fill:rgb(0%,0%,0%);fill-opacity:1;">
  <use xlink:href="#glyph1-1" x="54.137695" y="310.6875"/>
  <use xlink:href="#glyph1-2" x="54.137695" y="299.341797"/>
  <use xlink:href="#glyph1-4" x="54.137695" y="293.668945"/>
</g>
<g style="fill:rgb(0%,0%,0%);fill-opacity:1;">
  <use xlink:href="#glyph1-1" x="54.137695" y="245.234375"/>
  <use xlink:href="#glyph1-2" x="54.137695" y="233.888672"/>
  <use xlink:href="#glyph1-5" x="54.137695" y="228.21582"/>
</g>
<g style="fill:rgb(0%,0%,0%);fill-opacity:1;">
  <use xlink:href="#glyph1-1" x="54.137695" y="179.78125"/>
  <use xlink:href="#glyph1-2" x="54.137695" y="168.435547"/>
  <use xlink:href="#glyph1-6" x="54.137695" y="162.762695"/>
</g>
<g style="fill:rgb(0%,0%,0%);fill-opacity:1;">
  <use xlink:href="#glyph1-7" x="54.137695" y="114.328125"/>
  <use xlink:href="#glyph1-2" x="54.137695" y="102.982422"/>
  <use xlink:href="#glyph1-1" x="54.137695" y="97.30957"/>
</g>
<g style="fill:rgb(0%,0%,0%);fill-opacity:1;">
  <use xlink:href="#glyph1-7" x="54.137695" y="48.875"/>
  <use xlink:href="#glyph1-2" x="54.137695" y="37.529297"/>
  <use xlink:href="#glyph1-3" x="54.137695" y="31.856445"/>
</g>
<g style="fill:rgb(0%,0%,0%);fill-opacity:1;">
  <use xlink:href="#glyph2-1" x="249.5" y="497.790039"/>
  <use xlink:href="#glyph2-2" x="261.5" y="497.790039"/>
  <use xlink:href="#glyph2-3" x="266.828125" y="497.790039"/>
  <use xlink:href="#glyph2-4" x="280.171875" y="497.790039"/>
  <use xlink:href="#glyph2-5" x="293.515625" y="497.790039"/>
  <use xlink:href="#glyph2-6" x="306.859375" y="497.790039"/>
  <use xlink:href="#glyph2-1" x="313.53125" y="497.790039"/>
</g>
<g style="fill:rgb(0%,0%,0%);fill-opacity:1;">
  <use xlink:href="#glyph3-1" x="19.473633" y="382.261719"/>
</g>
<g style="fill:rgb(0%,0%,0%);fill-opacity:1;">
  <use xlink:href="#glyph3-2" x="19.473633" y="375.261719"/>
</g>
<g style="fill:rgb(0%,0%,0%);fill-opacity:1;">
  <use xlink:href="#glyph3-3" x="19.473633" y="367.261719"/>
</g>
<g style="fill:rgb(0%,0%,0%);fill-opacity:1;">
  <use xlink:href="#glyph3-3" x="19.473633" y="353.261719"/>
</g>
<g style="fill:rgb(0%,0%,0%);fill-opacity:1;">
  <use xlink:href="#glyph4-1" x="19.162109" y="339.261719"/>
</g>
<g style="fill:rgb(0%,0%,0%);fill-opacity:1;">
  <use xlink:href="#glyph3-3" x="19.473633" y="333.261719"/>
</g>
<g style="fill:rgb(0%,0%,0%);fill-opacity:1;">
  <use xlink:href="#glyph3-4" x="19.473633" y="319.261719"/>
</g>
<g style="fill:rgb(0%,0%,0%);fill-opacity:1;">
  <use xlink:href="#glyph3-3" x="19.473633" y="305.261719"/>
</g>
<g style="fill:rgb(0%,0%,0%);fill-opacity:1;">
  <use xlink:href="#glyph3-2" x="19.473633" y="291.261719"/>
</g>
<g style="fill:rgb(0%,0%,0%);fill-opacity:1;">
  <use xlink:href="#glyph3-5" x="19.473633" y="283.261719"/>
</g>
<g style="fill:rgb(0%,0%,0%);fill-opacity:1;">
  <use xlink:href="#glyph3-6" x="19.473633" y="269.261719"/>
</g>
<g style="fill:rgb(0%,0%,0%);fill-opacity:1;">
  <use xlink:href="#glyph4-1" x="19.162109" y="257.261719"/>
</g>
<g style="fill:rgb(0%,0%,0%);fill-opacity:1;">
  <use xlink:href="#glyph3-7" x="19.473633" y="251.261719"/>
</g>
<g style="fill:rgb(0%,0%,0%);fill-opacity:1;">
  <use xlink:href="#glyph3-8" x="19.473633" y="237.261719"/>
</g>
<g style="fill:rgb(0%,0%,0%);fill-opacity:1;">
  <use xlink:href="#glyph3-1" x="19.473633" y="231.261719"/>
</g>
<g style="fill:rgb(0%,0%,0%);fill-opacity:1;">
  <use xlink:href="#glyph3-1" x="19.473633" y="224.261719"/>
</g>
<g style="fill:rgb(0%,0%,0%);fill-opacity:1;">
  <use xlink:href="#glyph3-3" x="19.473633" y="217.261719"/>
</g>
<g style="fill:rgb(0%,0%,0%);fill-opacity:1;">
  <use xlink:href="#glyph3-2" x="19.473633" y="203.261719"/>
</g>
<g style="fill:rgb(0%,0%,0%);fill-opacity:1;">
  <use xlink:href="#glyph3-3" x="19.473633" y="195.261719"/>
</g>
<g style="fill:rgb(0%,0%,0%);fill-opacity:1;">
  <use xlink:href="#glyph3-4" x="19.473633" y="181.261719"/>
</g>
<g style="fill:rgb(0%,0%,0%);fill-opacity:1;">
  <use xlink:href="#glyph3-9" x="19.473633" y="167.261719"/>
</g>
<g style="fill:rgb(0%,0%,0%);fill-opacity:1;">
  <use xlink:href="#glyph3-3" x="19.473633" y="155.261719"/>
</g>
<g style="fill:rgb(0%,0%,0%);fill-opacity:1;">
  <use xlink:href="#glyph4-1" x="19.162109" y="141.261719"/>
</g>
<g style="fill:rgb(0%,0%,0%);fill-opacity:1;">
  <use xlink:href="#glyph4-1" x="19.162109" y="135.261719"/>
</g>
<g style="fill:rgb(0%,0%,0%);fill-opacity:1;">
  <use xlink:href="#glyph4-2" x="19.162109" y="129.261719"/>
</g>
<g style="fill:rgb(0%,0%,0%);fill-opacity:1;">
  <use xlink:href="#glyph4-1" x="19.162109" y="114.261719"/>
</g>
<g style="fill:rgb(0%,0%,0%);fill-opacity:1;">
  <use xlink:href="#glyph3-10" x="19.473633" y="108.261719"/>
</g>
<g style="fill:rgb(0%,0%,0%);fill-opacity:1;">
  <use xlink:href="#glyph5-1" x="19.22168" y="93.261719"/>
</g>
<g style="fill:rgb(0%,0%,0%);fill-opacity:1;">
  <use xlink:href="#glyph3-11" x="19.473633" y="83.261719"/>
</g>
<g style="fill:rgb(0%,0%,0%);fill-opacity:1;">
  <use xlink:href="#glyph5-2" x="19.22168" y="71.261719"/>
</g>
<path style=" stroke:none;fill-rule:nonzero;fill:rgb(100%,100%,0%);fill-opacity:1;" d="M 88 427.09375 L 88.890625 426.976562 L 89.332031 426.917969 L 89.777344 426.855469 L 90.222656 426.796875 L 90.667969 426.734375 L 91.109375 426.671875 L 91.554688 426.605469 L 92 426.542969 L 92.890625 426.410156 L 93.332031 426.34375 L 93.777344 426.273438 L 94.222656 426.207031 L 94.667969 426.136719 L 95.109375 426.066406 L 95.554688 425.996094 L 96 425.921875 L 96.445312 425.851562 L 96.890625 425.777344 L 97.332031 425.703125 L 97.777344 425.625 L 98.222656 425.550781 L 98.667969 425.472656 L 99.109375 425.394531 L 99.554688 425.316406 L 100 425.234375 L 100.445312 425.15625 L 100.890625 425.074219 L 101.332031 424.992188 L 101.777344 424.90625 L 102.222656 424.824219 L 102.667969 424.738281 L 103.109375 424.652344 L 103.554688 424.566406 L 104.445312 424.386719 L 104.890625 424.300781 L 105.332031 424.207031 L 106.222656 424.027344 L 106.667969 423.933594 L 107.109375 423.839844 L 107.554688 423.746094 L 108.445312 423.550781 L 108.890625 423.457031 L 109.332031 423.355469 L 109.777344 423.257812 L 110.222656 423.15625 L 110.667969 423.058594 L 111.109375 422.957031 L 111.554688 422.851562 L 112 422.75 L 112.890625 422.539062 L 113.332031 422.433594 L 113.777344 422.328125 L 114.667969 422.109375 L 115.109375 422 L 116 421.78125 L 116.890625 421.554688 L 117.332031 421.441406 L 117.777344 421.328125 L 118.667969 421.09375 L 119.109375 420.976562 L 119.554688 420.859375 L 120 420.738281 L 120.445312 420.621094 L 120.890625 420.5 L 121.332031 420.378906 L 121.777344 420.253906 L 122.222656 420.132812 L 122.667969 420.007812 L 123.109375 419.882812 L 123.554688 419.757812 L 124.890625 419.371094 L 125.332031 419.242188 L 125.777344 419.113281 L 126.222656 418.980469 L 126.667969 418.851562 L 127.109375 418.71875 L 127.554688 418.582031 L 128 418.449219 L 128.890625 418.175781 L 129.332031 418.039062 L 129.777344 417.902344 L 130.667969 417.621094 L 131.109375 417.480469 L 132 417.199219 L 132.890625 416.910156 L 133.332031 416.765625 L 133.777344 416.621094 L 134.222656 416.472656 L 134.667969 416.328125 L 135.109375 416.179688 L 135.554688 416.027344 L 136 415.878906 L 136.445312 415.726562 L 136.890625 415.578125 L 137.332031 415.425781 L 137.777344 415.269531 L 138.222656 415.117188 L 138.667969 414.960938 L 139.109375 414.804688 L 140 414.492188 L 140.890625 414.171875 L 141.332031 414.011719 L 142.222656 413.691406 L 142.667969 413.527344 L 143.109375 413.363281 L 144 413.035156 L 144.445312 412.867188 L 144.890625 412.703125 L 145.332031 412.535156 L 145.777344 412.367188 L 146.222656 412.195312 L 146.667969 412.027344 L 147.109375 411.855469 L 148 411.511719 L 148.445312 411.335938 L 148.890625 411.164062 L 149.332031 410.988281 L 149.777344 410.8125 L 150.222656 410.632812 L 150.667969 410.457031 L 151.109375 410.277344 L 152.445312 409.738281 L 152.890625 409.554688 L 153.332031 409.375 L 154.222656 409.007812 L 154.667969 408.820312 L 155.109375 408.636719 L 156.445312 408.074219 L 156.890625 407.882812 L 157.332031 407.695312 L 158.222656 407.3125 L 158.667969 407.117188 L 159.109375 406.925781 L 160.890625 406.144531 L 161.332031 405.949219 L 162.667969 405.351562 L 163.109375 405.152344 L 164.890625 404.339844 L 165.332031 404.136719 L 165.777344 403.929688 L 166.222656 403.726562 L 166.667969 403.519531 L 167.109375 403.308594 L 167.554688 403.101562 L 168 402.890625 L 168.445312 402.683594 L 168.890625 402.472656 L 169.332031 402.257812 L 170.222656 401.835938 L 170.667969 401.621094 L 171.109375 401.40625 L 171.554688 401.1875 L 172 400.972656 L 172.445312 400.753906 L 172.890625 400.539062 L 173.332031 400.320312 L 173.777344 400.097656 L 174.222656 399.878906 L 174.667969 399.65625 L 175.109375 399.4375 L 175.554688 399.214844 L 176 398.988281 L 176.445312 398.765625 L 176.890625 398.539062 L 177.332031 398.3125 L 178.667969 397.632812 L 179.109375 397.402344 L 180.445312 396.710938 L 180.890625 396.476562 L 181.332031 396.246094 L 182.667969 395.542969 L 183.109375 395.304688 L 183.554688 395.070312 L 184.445312 394.59375 L 184.890625 394.351562 L 185.332031 394.113281 L 186.667969 393.386719 L 187.109375 393.144531 L 187.554688 392.902344 L 188.890625 392.164062 L 189.332031 391.917969 L 189.777344 391.667969 L 190.222656 391.421875 L 190.667969 391.171875 L 191.109375 390.921875 L 191.554688 390.671875 L 192 390.417969 L 192.445312 390.167969 L 192.890625 389.914062 L 193.332031 389.660156 L 193.777344 389.402344 L 194.222656 389.148438 L 194.667969 388.890625 L 195.109375 388.636719 L 195.554688 388.378906 L 196 388.117188 L 196.445312 387.859375 L 196.890625 387.597656 L 197.332031 387.335938 L 198.667969 386.550781 L 199.109375 386.285156 L 200.890625 385.222656 L 201.332031 384.953125 L 202.667969 384.144531 L 203.109375 383.875 L 204.890625 382.78125 L 205.332031 382.507812 L 206.667969 381.675781 L 207.109375 381.398438 L 207.554688 381.121094 L 208.890625 380.277344 L 209.332031 379.996094 L 209.777344 379.714844 L 210.667969 379.144531 L 211.109375 378.859375 L 212 378.289062 L 212.445312 378 L 212.890625 377.714844 L 213.332031 377.425781 L 213.777344 377.132812 L 214.667969 376.554688 L 215.109375 376.261719 L 216 375.675781 L 216.445312 375.378906 L 216.890625 375.085938 L 217.332031 374.789062 L 218.667969 373.898438 L 219.109375 373.597656 L 220.890625 372.394531 L 221.332031 372.089844 L 221.777344 371.789062 L 222.667969 371.179688 L 223.109375 370.871094 L 223.554688 370.566406 L 224.890625 369.640625 L 225.332031 369.332031 L 225.777344 369.019531 L 226.222656 368.710938 L 226.667969 368.398438 L 227.109375 368.085938 L 227.554688 367.769531 L 228 367.457031 L 228.890625 366.824219 L 229.332031 366.507812 L 230.222656 365.875 L 230.667969 365.554688 L 231.109375 365.234375 L 232 364.59375 L 232.445312 364.269531 L 232.890625 363.949219 L 233.332031 363.625 L 234.222656 362.976562 L 234.667969 362.648438 L 235.109375 362.320312 L 235.554688 361.996094 L 236 361.667969 L 236.445312 361.335938 L 236.890625 361.007812 L 237.332031 360.675781 L 237.777344 360.347656 L 238.222656 360.011719 L 238.667969 359.679688 L 239.109375 359.347656 L 240.890625 358.003906 L 241.332031 357.667969 L 242.667969 356.648438 L 243.109375 356.308594 L 243.554688 355.96875 L 244 355.625 L 244.445312 355.285156 L 244.890625 354.941406 L 245.332031 354.59375 L 245.777344 354.25 L 246.222656 353.902344 L 246.667969 353.558594 L 247.109375 353.210938 L 247.554688 352.863281 L 248 352.511719 L 248.445312 352.164062 L 248.890625 351.8125 L 249.332031 351.460938 L 249.777344 351.109375 L 250.222656 350.753906 L 250.667969 350.402344 L 251.109375 350.046875 L 252.445312 348.980469 L 252.890625 348.621094 L 253.332031 348.265625 L 254.222656 347.546875 L 254.667969 347.183594 L 255.109375 346.824219 L 256.890625 345.371094 L 257.332031 345.003906 L 257.777344 344.640625 L 258.667969 343.90625 L 259.109375 343.535156 L 259.554688 343.167969 L 260.890625 342.054688 L 261.332031 341.683594 L 261.777344 341.3125 L 262.667969 340.5625 L 263.109375 340.1875 L 263.554688 339.8125 L 264 339.433594 L 264.445312 339.058594 L 264.890625 338.679688 L 265.332031 338.300781 L 265.777344 337.921875 L 266.222656 337.539062 L 266.667969 337.160156 L 267.109375 336.777344 L 268 336.011719 L 268.445312 335.625 L 268.890625 335.242188 L 269.332031 334.855469 L 270.222656 334.082031 L 270.667969 333.691406 L 271.109375 333.304688 L 272.445312 332.132812 L 272.890625 331.738281 L 273.332031 331.347656 L 274.667969 330.164062 L 275.109375 329.769531 L 276.890625 328.175781 L 277.332031 327.777344 L 277.777344 327.375 L 278.222656 326.976562 L 278.667969 326.574219 L 279.109375 326.171875 L 279.554688 325.765625 L 280 325.363281 L 280.890625 324.550781 L 281.332031 324.144531 L 281.777344 323.738281 L 282.222656 323.328125 L 282.667969 322.921875 L 283.109375 322.511719 L 283.554688 322.101562 L 284 321.6875 L 284.445312 321.277344 L 284.890625 320.863281 L 285.332031 320.449219 L 286.667969 319.207031 L 287.109375 318.789062 L 288.890625 317.117188 L 289.332031 316.695312 L 290.667969 315.429688 L 291.109375 315.007812 L 292.890625 313.304688 L 293.332031 312.878906 L 294.667969 311.589844 L 295.109375 311.160156 L 295.554688 310.730469 L 296 310.296875 L 296.445312 309.867188 L 296.890625 309.433594 L 297.332031 308.996094 L 298.222656 308.128906 L 298.667969 307.691406 L 299.109375 307.253906 L 300 306.378906 L 300.890625 305.496094 L 301.332031 305.054688 L 302.667969 303.730469 L 303.109375 303.285156 L 304.445312 301.949219 L 304.890625 301.5 L 305.332031 301.054688 L 306.222656 300.15625 L 306.667969 299.703125 L 307.109375 299.253906 L 307.554688 298.800781 L 308 298.351562 L 308.445312 297.898438 L 308.890625 297.441406 L 309.332031 296.988281 L 309.777344 296.53125 L 310.222656 296.078125 L 310.667969 295.621094 L 311.109375 295.160156 L 311.554688 294.703125 L 312 294.242188 L 312.445312 293.785156 L 312.890625 293.324219 L 313.332031 292.863281 L 313.777344 292.398438 L 314.222656 291.9375 L 314.667969 291.472656 L 315.109375 291.007812 L 316 290.078125 L 316.890625 289.140625 L 317.332031 288.671875 L 318.222656 287.734375 L 318.667969 287.261719 L 319.109375 286.792969 L 320.445312 285.375 L 320.890625 284.898438 L 321.332031 284.421875 L 321.777344 283.949219 L 322.222656 283.46875 L 322.667969 282.992188 L 323.109375 282.515625 L 324.890625 280.59375 L 325.332031 280.113281 L 326.667969 278.660156 L 327.109375 278.175781 L 327.554688 277.691406 L 328.890625 276.226562 L 329.332031 275.738281 L 329.777344 275.25 L 330.222656 274.757812 L 330.667969 274.269531 L 331.109375 273.777344 L 331.554688 273.28125 L 332.445312 272.296875 L 332.890625 271.800781 L 333.332031 271.304688 L 334.222656 270.3125 L 334.667969 269.8125 L 335.109375 269.3125 L 335.554688 268.816406 L 336 268.3125 L 336.890625 267.3125 L 337.332031 266.808594 L 338.667969 265.296875 L 339.109375 264.792969 L 340.890625 262.761719 L 341.332031 262.25 L 341.777344 261.742188 L 342.667969 260.71875 L 343.109375 260.207031 L 343.554688 259.695312 L 344.890625 258.148438 L 345.332031 257.632812 L 345.777344 257.117188 L 346.667969 256.078125 L 347.109375 255.5625 L 347.554688 255.039062 L 348.445312 254 L 348.890625 253.476562 L 349.332031 252.953125 L 350.222656 251.90625 L 350.667969 251.378906 L 351.109375 250.855469 L 352 249.800781 L 352.445312 249.269531 L 352.890625 248.742188 L 353.332031 248.210938 L 354.667969 246.617188 L 355.109375 246.085938 L 356.890625 243.945312 L 357.332031 243.410156 L 357.777344 242.871094 L 358.222656 242.335938 L 358.667969 241.796875 L 359.109375 241.253906 L 360 240.175781 L 360.890625 239.089844 L 361.332031 238.546875 L 361.777344 238 L 362.222656 237.457031 L 362.667969 236.910156 L 363.109375 236.363281 L 364.445312 234.722656 L 364.890625 234.171875 L 365.332031 233.621094 L 366.222656 232.519531 L 366.667969 231.964844 L 367.109375 231.414062 L 368.445312 229.75 L 368.890625 229.191406 L 369.332031 228.636719 L 370.667969 226.960938 L 371.109375 226.398438 L 371.554688 225.839844 L 372.890625 224.152344 L 373.332031 223.589844 L 374.667969 221.890625 L 375.109375 221.324219 L 375.554688 220.757812 L 376 220.1875 L 376.445312 219.621094 L 376.890625 219.050781 L 377.332031 218.480469 L 377.777344 217.910156 L 378.667969 216.761719 L 379.109375 216.191406 L 379.554688 215.617188 L 380 215.039062 L 380.445312 214.464844 L 380.890625 213.886719 L 381.332031 213.308594 L 382.667969 211.574219 L 383.109375 210.992188 L 384.890625 208.664062 L 385.332031 208.078125 L 385.777344 207.496094 L 386.667969 206.324219 L 387.109375 205.734375 L 387.554688 205.148438 L 388.890625 203.378906 L 389.332031 202.789062 L 389.777344 202.195312 L 390.222656 201.605469 L 390.667969 201.011719 L 391.109375 200.417969 L 391.554688 199.820312 L 392 199.226562 L 392.445312 198.628906 L 392.890625 198.035156 L 393.332031 197.4375 L 393.777344 196.835938 L 394.222656 196.238281 L 394.667969 195.636719 L 395.109375 195.039062 L 395.554688 194.4375 L 396 193.832031 L 396.445312 193.230469 L 396.890625 192.625 L 397.332031 192.023438 L 398.222656 190.8125 L 398.667969 190.203125 L 399.109375 189.597656 L 400.890625 187.160156 L 401.332031 186.546875 L 401.777344 185.9375 L 402.667969 184.710938 L 403.109375 184.09375 L 403.554688 183.480469 L 404.890625 181.628906 L 405.332031 181.011719 L 405.777344 180.394531 L 406.667969 179.152344 L 407.109375 178.53125 L 408 177.289062 L 408.890625 176.039062 L 409.332031 175.414062 L 410.222656 174.164062 L 410.667969 173.535156 L 411.109375 172.910156 L 412 171.652344 L 412.445312 171.019531 L 412.890625 170.390625 L 413.332031 169.757812 L 414.667969 167.859375 L 415.109375 167.226562 L 416.890625 164.679688 L 417.332031 164.039062 L 417.777344 163.402344 L 418.667969 162.121094 L 419.109375 161.480469 L 419.554688 160.835938 L 420 160.195312 L 420.890625 158.90625 L 421.332031 158.261719 L 421.777344 157.617188 L 422.667969 156.320312 L 423.109375 155.671875 L 424 154.375 L 424.445312 153.722656 L 424.890625 153.074219 L 425.332031 152.421875 L 426.222656 151.117188 L 426.667969 150.460938 L 427.109375 149.804688 L 427.554688 149.152344 L 428 148.496094 L 428.445312 147.835938 L 428.890625 147.179688 L 429.332031 146.519531 L 430.667969 144.539062 L 431.109375 143.878906 L 431.554688 143.214844 L 432 142.554688 L 432.445312 141.890625 L 432.890625 141.222656 L 433.332031 140.558594 L 433.777344 139.894531 L 434.667969 138.558594 L 435.109375 137.890625 L 435.554688 137.21875 L 436 136.550781 L 436.890625 135.207031 L 437.332031 134.535156 L 438.222656 133.191406 L 438.667969 132.515625 L 439.109375 131.839844 L 440 130.488281 L 440.445312 129.808594 L 440.890625 129.132812 L 441.332031 128.453125 L 442.222656 127.09375 L 442.667969 126.410156 L 443.109375 125.730469 L 444.890625 122.996094 L 445.332031 122.308594 L 445.777344 121.621094 L 446.222656 120.9375 L 446.667969 120.246094 L 447.109375 119.558594 L 447.554688 118.871094 L 448.890625 116.796875 L 449.332031 116.105469 L 449.777344 115.410156 L 450.222656 114.71875 L 450.667969 114.023438 L 451.109375 113.328125 L 451.554688 112.632812 L 452.445312 111.234375 L 452.890625 110.539062 L 453.332031 109.839844 L 453.777344 109.140625 L 454.222656 108.4375 L 454.667969 107.738281 L 455.109375 107.035156 L 456 105.628906 L 456.445312 104.921875 L 456.890625 104.21875 L 457.332031 103.511719 L 458.667969 101.390625 L 459.109375 100.679688 L 459.554688 99.972656 L 460.890625 97.839844 L 461.332031 97.125 L 461.777344 96.410156 L 462.222656 95.699219 L 462.667969 94.984375 L 463.109375 94.265625 L 463.554688 93.550781 L 464 92.832031 L 464.445312 92.117188 L 464.890625 91.398438 L 465.332031 90.675781 L 466.222656 89.238281 L 466.667969 88.515625 L 467.109375 87.792969 L 467.554688 87.070312 L 468 86.34375 L 468.445312 85.621094 L 468.890625 84.894531 L 469.332031 84.167969 L 470.222656 82.714844 L 470.667969 81.984375 L 471.109375 81.257812 L 472.445312 79.066406 L 472.890625 78.332031 L 473.332031 77.601562 L 474.222656 76.132812 L 474.667969 75.394531 L 475.109375 74.660156 L 475.554688 73.925781 L 476.890625 71.710938 L 477.332031 70.96875 L 477.777344 70.230469 L 478.667969 68.746094 L 479.109375 68.003906 L 479.554688 67.261719 L 480.445312 65.769531 L 480.890625 65.027344 L 481.332031 64.277344 L 482.222656 62.785156 L 482.667969 62.035156 L 483.109375 61.285156 L 484.445312 59.035156 L 484.890625 58.28125 L 485.332031 57.527344 L 486.667969 55.265625 L 487.109375 54.507812 L 488 52.992188 L 488 31.070312 L 487.554688 31.835938 L 487.109375 32.597656 L 486.667969 33.363281 L 485.332031 35.648438 L 484.890625 36.40625 L 484.445312 37.167969 L 483.109375 39.441406 L 482.667969 40.199219 L 481.777344 41.707031 L 481.332031 42.464844 L 480.890625 43.21875 L 480.445312 43.96875 L 480 44.722656 L 479.554688 45.472656 L 479.109375 46.226562 L 478.667969 46.976562 L 478.222656 47.726562 L 477.777344 48.472656 L 477.332031 49.222656 L 476.890625 49.96875 L 475.554688 52.207031 L 475.109375 52.949219 L 474.667969 53.695312 L 473.332031 55.921875 L 472.890625 56.660156 L 472.445312 57.402344 L 471.109375 59.617188 L 470.667969 60.355469 L 470.222656 61.089844 L 469.777344 61.828125 L 469.332031 62.5625 L 468.890625 63.296875 L 468.445312 64.03125 L 468 64.761719 L 467.554688 65.496094 L 467.109375 66.226562 L 466.667969 66.957031 L 465.777344 68.417969 L 465.332031 69.144531 L 464.890625 69.871094 L 464.445312 70.601562 L 464 71.324219 L 463.109375 72.777344 L 462.667969 73.5 L 461.332031 75.667969 L 460.890625 76.390625 L 460.445312 77.109375 L 460 77.832031 L 459.109375 79.269531 L 458.667969 79.984375 L 458.222656 80.703125 L 457.777344 81.417969 L 457.332031 82.136719 L 456.890625 82.847656 L 456 84.277344 L 455.554688 84.988281 L 455.109375 85.703125 L 454.667969 86.414062 L 454.222656 87.125 L 453.777344 87.832031 L 453.332031 88.542969 L 452.890625 89.25 L 451.109375 92.078125 L 450.667969 92.78125 L 449.332031 94.890625 L 448.890625 95.59375 L 448.445312 96.292969 L 448 96.996094 L 447.109375 98.394531 L 446.667969 99.089844 L 446.222656 99.789062 L 445.332031 101.179688 L 444.890625 101.875 L 444 103.265625 L 443.554688 103.957031 L 443.109375 104.652344 L 442.667969 105.34375 L 442.222656 106.035156 L 441.777344 106.722656 L 441.332031 107.414062 L 440.890625 108.101562 L 439.109375 110.851562 L 438.667969 111.535156 L 437.332031 113.585938 L 436.890625 114.269531 L 436.445312 114.953125 L 435.109375 116.992188 L 434.667969 117.671875 L 434.222656 118.347656 L 433.777344 119.027344 L 433.332031 119.703125 L 432.890625 120.378906 L 432.445312 121.054688 L 432 121.726562 L 431.554688 122.402344 L 431.109375 123.074219 L 430.667969 123.746094 L 429.777344 125.089844 L 429.332031 125.757812 L 428.890625 126.429688 L 427.554688 128.433594 L 427.109375 129.097656 L 426.667969 129.765625 L 425.332031 131.757812 L 424.890625 132.421875 L 424.445312 133.082031 L 424 133.746094 L 423.109375 135.066406 L 422.667969 135.726562 L 422.222656 136.382812 L 421.777344 137.042969 L 421.332031 137.699219 L 420.890625 138.355469 L 420 139.667969 L 419.109375 140.972656 L 418.667969 141.625 L 417.332031 143.582031 L 416.890625 144.230469 L 415.109375 146.824219 L 414.667969 147.46875 L 414.222656 148.117188 L 413.332031 149.40625 L 412.890625 150.046875 L 412.445312 150.691406 L 412 151.332031 L 411.554688 151.976562 L 411.109375 152.617188 L 410.667969 153.253906 L 410.222656 153.894531 L 409.777344 154.53125 L 409.332031 155.171875 L 408.890625 155.808594 L 408.445312 156.445312 L 408 157.078125 L 407.554688 157.714844 L 407.109375 158.347656 L 406.667969 158.980469 L 405.332031 160.878906 L 404.890625 161.507812 L 403.109375 164.023438 L 402.667969 164.652344 L 401.332031 166.527344 L 400.890625 167.152344 L 400.445312 167.773438 L 400 168.398438 L 399.109375 169.640625 L 398.667969 170.261719 L 398.222656 170.878906 L 397.777344 171.5 L 397.332031 172.117188 L 396.890625 172.734375 L 395.554688 174.585938 L 395.109375 175.199219 L 394.667969 175.8125 L 393.332031 177.652344 L 392.890625 178.261719 L 391.109375 180.699219 L 390.667969 181.308594 L 389.332031 183.125 L 388.890625 183.730469 L 388.445312 184.332031 L 388 184.9375 L 387.109375 186.140625 L 386.667969 186.742188 L 386.222656 187.34375 L 385.777344 187.941406 L 385.332031 188.542969 L 384.890625 189.140625 L 384 190.335938 L 383.554688 190.929688 L 383.109375 191.527344 L 382.667969 192.121094 L 381.777344 193.308594 L 381.332031 193.898438 L 380.890625 194.492188 L 379.109375 196.851562 L 378.667969 197.4375 L 378.222656 198.027344 L 377.332031 199.199219 L 376.890625 199.785156 L 376.445312 200.371094 L 375.109375 202.117188 L 374.667969 202.699219 L 373.777344 203.863281 L 373.332031 204.441406 L 372.890625 205.019531 L 371.554688 206.753906 L 371.109375 207.328125 L 370.667969 207.902344 L 369.332031 209.625 L 368.890625 210.199219 L 367.109375 212.480469 L 366.667969 213.046875 L 366.222656 213.617188 L 365.332031 214.75 L 364.890625 215.316406 L 364.445312 215.882812 L 363.554688 217.007812 L 363.109375 217.574219 L 362.667969 218.136719 L 362.222656 218.695312 L 361.777344 219.257812 L 361.332031 219.816406 L 360.890625 220.378906 L 360.445312 220.9375 L 360 221.492188 L 359.109375 222.609375 L 358.667969 223.164062 L 357.332031 224.828125 L 356.890625 225.378906 L 356.445312 225.933594 L 355.109375 227.585938 L 354.667969 228.132812 L 354.222656 228.683594 L 353.332031 229.777344 L 352.890625 230.324219 L 352.445312 230.871094 L 352 231.414062 L 351.554688 231.960938 L 351.109375 232.503906 L 350.667969 233.046875 L 350.222656 233.589844 L 349.777344 234.128906 L 349.332031 234.671875 L 348.890625 235.210938 L 347.554688 236.828125 L 347.109375 237.363281 L 346.667969 237.898438 L 346.222656 238.4375 L 345.777344 238.972656 L 345.332031 239.503906 L 344.890625 240.039062 L 344.445312 240.570312 L 344 241.105469 L 343.109375 242.167969 L 342.667969 242.695312 L 342.222656 243.226562 L 341.332031 244.28125 L 340.890625 244.808594 L 340.445312 245.335938 L 340 245.859375 L 339.554688 246.386719 L 339.109375 246.910156 L 338.667969 247.433594 L 337.777344 248.480469 L 337.332031 249 L 336.890625 249.519531 L 336.445312 250.042969 L 336 250.558594 L 335.109375 251.597656 L 334.667969 252.113281 L 333.332031 253.660156 L 332.890625 254.175781 L 332.445312 254.6875 L 332 255.203125 L 331.109375 256.226562 L 330.667969 256.734375 L 330.222656 257.246094 L 329.332031 258.261719 L 328.890625 258.769531 L 328 259.785156 L 327.109375 260.792969 L 326.667969 261.296875 L 325.332031 262.808594 L 324.890625 263.308594 L 323.554688 264.808594 L 323.109375 265.304688 L 322.667969 265.804688 L 321.332031 267.292969 L 320.890625 267.789062 L 320 268.773438 L 319.554688 269.269531 L 319.109375 269.761719 L 318.667969 270.25 L 318.222656 270.742188 L 317.332031 271.71875 L 316.890625 272.210938 L 316.445312 272.695312 L 316 273.183594 L 315.554688 273.667969 L 315.109375 274.15625 L 314.667969 274.640625 L 313.777344 275.609375 L 313.332031 276.089844 L 312.890625 276.570312 L 312.445312 277.054688 L 312 277.535156 L 311.554688 278.011719 L 311.109375 278.492188 L 310.667969 278.972656 L 309.332031 280.402344 L 308.890625 280.878906 L 308 281.824219 L 307.554688 282.300781 L 307.109375 282.773438 L 306.667969 283.242188 L 306.222656 283.714844 L 305.777344 284.183594 L 305.332031 284.65625 L 304.890625 285.125 L 304.445312 285.59375 L 304 286.058594 L 303.554688 286.527344 L 303.109375 286.992188 L 302.667969 287.457031 L 301.332031 288.851562 L 300.890625 289.3125 L 299.109375 291.15625 L 298.667969 291.613281 L 298.222656 292.074219 L 297.332031 292.988281 L 296.890625 293.441406 L 296.445312 293.898438 L 296 294.351562 L 295.554688 294.808594 L 295.109375 295.261719 L 294.667969 295.710938 L 293.777344 296.617188 L 293.332031 297.066406 L 292.890625 297.515625 L 292 298.414062 L 291.109375 299.304688 L 290.667969 299.753906 L 290.222656 300.199219 L 289.777344 300.640625 L 288.445312 301.972656 L 287.554688 302.855469 L 287.109375 303.292969 L 286.667969 303.734375 L 285.332031 305.046875 L 284.890625 305.484375 L 284.445312 305.921875 L 283.109375 307.222656 L 282.667969 307.65625 L 282.222656 308.089844 L 281.777344 308.519531 L 281.332031 308.953125 L 280.890625 309.382812 L 280 310.242188 L 279.554688 310.667969 L 279.109375 311.097656 L 278.667969 311.523438 L 277.777344 312.375 L 277.332031 312.796875 L 276.890625 313.222656 L 275.109375 314.910156 L 274.667969 315.328125 L 274.222656 315.75 L 273.332031 316.585938 L 272.890625 317.003906 L 272.445312 317.417969 L 272 317.835938 L 271.109375 318.664062 L 270.667969 319.078125 L 270.222656 319.492188 L 269.332031 320.3125 L 268.890625 320.726562 L 268.445312 321.132812 L 267.554688 321.953125 L 267.109375 322.359375 L 266.667969 322.765625 L 266.222656 323.175781 L 265.777344 323.578125 L 265.332031 323.984375 L 264.890625 324.386719 L 264.445312 324.792969 L 263.109375 326 L 262.667969 326.398438 L 262.222656 326.796875 L 261.777344 327.199219 L 261.332031 327.597656 L 260.890625 327.992188 L 260 328.789062 L 259.109375 329.578125 L 258.667969 329.972656 L 258.222656 330.363281 L 257.777344 330.757812 L 257.332031 331.148438 L 256.890625 331.539062 L 255.554688 332.710938 L 255.109375 333.097656 L 254.667969 333.484375 L 253.332031 334.644531 L 252.890625 335.027344 L 252.445312 335.414062 L 251.109375 336.5625 L 250.667969 336.941406 L 250.222656 337.320312 L 249.777344 337.703125 L 249.332031 338.082031 L 248.890625 338.457031 L 248.445312 338.835938 L 248 339.210938 L 247.554688 339.589844 L 247.109375 339.964844 L 246.667969 340.339844 L 246.222656 340.710938 L 245.777344 341.085938 L 245.332031 341.457031 L 244.890625 341.828125 L 243.554688 342.941406 L 243.109375 343.308594 L 242.667969 343.675781 L 241.332031 344.777344 L 240.890625 345.140625 L 239.109375 346.59375 L 238.667969 346.957031 L 237.332031 348.035156 L 236.890625 348.394531 L 236.445312 348.75 L 236 349.109375 L 235.109375 349.820312 L 234.667969 350.175781 L 234.222656 350.53125 L 233.332031 351.234375 L 232.890625 351.585938 L 231.554688 352.640625 L 231.109375 352.988281 L 230.667969 353.335938 L 229.777344 354.03125 L 229.332031 354.375 L 228.890625 354.722656 L 227.109375 356.097656 L 226.667969 356.4375 L 225.332031 357.457031 L 224.890625 357.796875 L 224.445312 358.136719 L 223.109375 359.144531 L 222.667969 359.480469 L 222.222656 359.8125 L 221.777344 360.148438 L 221.332031 360.480469 L 220.890625 360.8125 L 220.445312 361.144531 L 220 361.472656 L 219.554688 361.804688 L 219.109375 362.132812 L 218.667969 362.460938 L 217.777344 363.117188 L 217.332031 363.441406 L 216.890625 363.769531 L 215.554688 364.742188 L 215.109375 365.0625 L 214.667969 365.382812 L 214.222656 365.707031 L 213.777344 366.027344 L 213.332031 366.34375 L 212.890625 366.664062 L 212.445312 366.984375 L 211.109375 367.933594 L 210.667969 368.246094 L 210.222656 368.5625 L 209.332031 369.1875 L 208.890625 369.5 L 208.445312 369.8125 L 208 370.121094 L 207.554688 370.433594 L 207.109375 370.742188 L 206.667969 371.050781 L 206.222656 371.359375 L 205.777344 371.664062 L 205.332031 371.972656 L 204.890625 372.277344 L 204 372.886719 L 203.554688 373.1875 L 203.109375 373.492188 L 202.667969 373.792969 L 201.332031 374.695312 L 200.890625 374.992188 L 200.445312 375.292969 L 199.554688 375.886719 L 199.109375 376.179688 L 198.667969 376.476562 L 197.332031 377.355469 L 196.890625 377.648438 L 196.445312 377.941406 L 195.109375 378.808594 L 194.667969 379.097656 L 194.222656 379.386719 L 193.332031 379.957031 L 192.890625 380.242188 L 192 380.8125 L 191.554688 381.09375 L 191.109375 381.378906 L 190.667969 381.660156 L 189.777344 382.222656 L 189.332031 382.5 L 188.890625 382.777344 L 188.445312 383.058594 L 188 383.332031 L 187.109375 383.886719 L 186.667969 384.160156 L 185.332031 384.980469 L 184.890625 385.253906 L 184 385.792969 L 183.554688 386.066406 L 183.109375 386.332031 L 182.667969 386.601562 L 182.222656 386.867188 L 181.777344 387.136719 L 181.332031 387.402344 L 180.890625 387.667969 L 180.445312 387.929688 L 180 388.195312 L 179.109375 388.71875 L 178.667969 388.980469 L 177.777344 389.503906 L 177.332031 389.761719 L 176.890625 390.019531 L 175.554688 390.792969 L 175.109375 391.046875 L 174.667969 391.300781 L 173.332031 392.0625 L 172.890625 392.3125 L 171.109375 393.3125 L 170.667969 393.5625 L 169.332031 394.300781 L 168.890625 394.546875 L 168.445312 394.789062 L 168 395.035156 L 167.109375 395.519531 L 166.667969 395.757812 L 166.222656 396 L 165.777344 396.238281 L 165.332031 396.480469 L 164.890625 396.71875 L 164.445312 396.957031 L 164 397.191406 L 163.554688 397.429688 L 163.109375 397.664062 L 162.667969 397.898438 L 161.777344 398.367188 L 161.332031 398.597656 L 160.890625 398.832031 L 160 399.292969 L 159.554688 399.519531 L 159.109375 399.75 L 158.667969 399.976562 L 158.222656 400.207031 L 157.777344 400.433594 L 157.332031 400.65625 L 156.890625 400.882812 L 156.445312 401.105469 L 156 401.332031 L 155.109375 401.777344 L 154.667969 401.996094 L 154.222656 402.21875 L 153.332031 402.65625 L 152.890625 402.875 L 152 403.3125 L 151.109375 403.742188 L 150.667969 403.957031 L 149.777344 404.386719 L 149.332031 404.597656 L 148.890625 404.8125 L 148 405.234375 L 147.554688 405.441406 L 147.109375 405.652344 L 146.667969 405.859375 L 145.332031 406.480469 L 144.890625 406.6875 L 143.109375 407.5 L 142.667969 407.703125 L 142.222656 407.90625 L 141.332031 408.304688 L 140.890625 408.503906 L 140.445312 408.703125 L 140 408.898438 L 139.554688 409.097656 L 139.109375 409.292969 L 138.667969 409.488281 L 137.777344 409.878906 L 137.332031 410.070312 L 136.890625 410.261719 L 136.445312 410.457031 L 136 410.648438 L 135.554688 410.835938 L 135.109375 411.027344 L 134.667969 411.214844 L 134.222656 411.40625 L 133.777344 411.59375 L 133.332031 411.777344 L 132.890625 411.964844 L 132.445312 412.152344 L 131.109375 412.703125 L 130.667969 412.886719 L 130.222656 413.066406 L 129.777344 413.25 L 129.332031 413.429688 L 128.890625 413.609375 L 128 413.96875 L 127.109375 414.320312 L 126.667969 414.496094 L 125.332031 415.023438 L 124.890625 415.195312 L 123.109375 415.882812 L 122.667969 416.050781 L 122.222656 416.222656 L 121.332031 416.558594 L 120.890625 416.726562 L 120.445312 416.890625 L 120 417.058594 L 119.109375 417.386719 L 118.667969 417.550781 L 118.222656 417.710938 L 117.777344 417.875 L 117.332031 418.035156 L 116.890625 418.195312 L 115.554688 418.675781 L 115.109375 418.832031 L 114.667969 418.988281 L 114.222656 419.148438 L 113.777344 419.300781 L 113.332031 419.457031 L 112.890625 419.613281 L 111.109375 420.222656 L 110.667969 420.371094 L 110.222656 420.523438 L 109.332031 420.820312 L 108.890625 420.96875 L 108.445312 421.117188 L 107.554688 421.40625 L 107.109375 421.554688 L 106.667969 421.699219 L 106.222656 421.839844 L 105.777344 421.984375 L 105.332031 422.125 L 104.890625 422.269531 L 104.445312 422.410156 L 104 422.546875 L 103.109375 422.828125 L 102.667969 422.964844 L 101.332031 423.375 L 100.890625 423.507812 L 100.445312 423.640625 L 100 423.777344 L 99.554688 423.910156 L 99.109375 424.039062 L 98.667969 424.171875 L 98.222656 424.300781 L 97.777344 424.433594 L 97.332031 424.5625 L 96.890625 424.691406 L 96.445312 424.816406 L 96 424.945312 L 95.109375 425.195312 L 94.667969 425.320312 L 94.222656 425.441406 L 93.777344 425.566406 L 93.332031 425.6875 L 92.890625 425.808594 L 92 426.050781 L 91.554688 426.167969 L 91.109375 426.289062 L 90.667969 426.40625 L 90.222656 426.523438 L 89.777344 426.636719 L 89.332031 426.753906 L 88.890625 426.867188 Z M 88 427.09375 "/>
<path style="fill:none;stroke-width:3.75;stroke-linecap:round;stroke-linejoin:round;stroke:rgb(0%,0%,0%);stroke-opacity:1;stroke-miterlimit:10;" d="M 88 427.09375 L 88.890625 426.921875 L 89.332031 426.835938 L 89.777344 426.746094 L 90.222656 426.660156 L 90.667969 426.570312 L 91.109375 426.480469 L 91.554688 426.386719 L 92 426.296875 L 92.890625 426.109375 L 93.332031 426.015625 L 93.777344 425.921875 L 94.667969 425.726562 L 95.109375 425.628906 L 96 425.433594 L 96.445312 425.332031 L 96.890625 425.234375 L 97.332031 425.132812 L 97.777344 425.027344 L 98.222656 424.925781 L 98.667969 424.820312 L 99.109375 424.71875 L 99.554688 424.613281 L 100 424.503906 L 100.445312 424.398438 L 100.890625 424.289062 L 101.332031 424.183594 L 101.777344 424.074219 L 102.222656 423.960938 L 102.667969 423.851562 L 103.109375 423.738281 L 104.890625 423.285156 L 105.332031 423.167969 L 106.667969 422.816406 L 107.109375 422.695312 L 107.554688 422.578125 L 108.445312 422.335938 L 108.890625 422.210938 L 109.332031 422.089844 L 110.667969 421.714844 L 111.109375 421.589844 L 112 421.332031 L 112.445312 421.207031 L 112.890625 421.074219 L 113.332031 420.945312 L 113.777344 420.816406 L 114.667969 420.550781 L 115.109375 420.417969 L 115.554688 420.28125 L 116 420.148438 L 116.890625 419.875 L 117.332031 419.738281 L 117.777344 419.601562 L 118.667969 419.320312 L 119.109375 419.183594 L 119.554688 419.039062 L 120 418.898438 L 120.445312 418.753906 L 120.890625 418.613281 L 121.332031 418.46875 L 121.777344 418.324219 L 122.222656 418.175781 L 122.667969 418.03125 L 123.109375 417.882812 L 124 417.585938 L 124.445312 417.433594 L 124.890625 417.285156 L 125.332031 417.132812 L 126.222656 416.828125 L 126.667969 416.671875 L 127.109375 416.519531 L 128.890625 415.894531 L 129.332031 415.734375 L 130.667969 415.253906 L 131.109375 415.09375 L 132.890625 414.4375 L 133.332031 414.273438 L 134.667969 413.769531 L 135.109375 413.601562 L 135.554688 413.433594 L 136 413.261719 L 136.445312 413.09375 L 136.890625 412.921875 L 137.332031 412.746094 L 137.777344 412.574219 L 138.222656 412.398438 L 138.667969 412.226562 L 139.109375 412.050781 L 139.554688 411.871094 L 140 411.695312 L 140.445312 411.515625 L 140.890625 411.339844 L 141.332031 411.160156 L 141.777344 410.980469 L 142.222656 410.796875 L 142.667969 410.617188 L 143.109375 410.433594 L 144 410.066406 L 144.445312 409.878906 L 144.890625 409.695312 L 145.332031 409.507812 L 146.222656 409.132812 L 146.667969 408.941406 L 147.109375 408.753906 L 148.890625 407.988281 L 149.332031 407.792969 L 150.667969 407.207031 L 151.109375 407.011719 L 152 406.613281 L 152.445312 406.417969 L 152.890625 406.214844 L 153.332031 406.015625 L 153.777344 405.8125 L 154.222656 405.613281 L 154.667969 405.410156 L 155.109375 405.207031 L 155.554688 405 L 156 404.796875 L 156.890625 404.382812 L 157.332031 404.175781 L 157.777344 403.96875 L 158.667969 403.546875 L 159.109375 403.335938 L 160.445312 402.703125 L 160.890625 402.488281 L 161.332031 402.273438 L 161.777344 402.058594 L 162.222656 401.839844 L 162.667969 401.625 L 163.109375 401.40625 L 164.445312 400.75 L 164.890625 400.527344 L 165.332031 400.308594 L 166.667969 399.640625 L 167.109375 399.414062 L 168.890625 398.507812 L 169.332031 398.28125 L 170.667969 397.589844 L 171.109375 397.359375 L 171.554688 397.125 L 172 396.894531 L 172.890625 396.425781 L 173.332031 396.191406 L 173.777344 395.953125 L 174.222656 395.71875 L 174.667969 395.480469 L 175.109375 395.242188 L 175.554688 395.003906 L 176 394.761719 L 176.445312 394.523438 L 176.890625 394.28125 L 177.332031 394.039062 L 177.777344 393.792969 L 178.667969 393.308594 L 179.109375 393.0625 L 180 392.570312 L 180.445312 392.320312 L 180.890625 392.074219 L 181.332031 391.824219 L 182.222656 391.324219 L 182.667969 391.070312 L 183.109375 390.820312 L 184.890625 389.804688 L 185.332031 389.546875 L 186.667969 388.773438 L 187.109375 388.515625 L 187.554688 388.253906 L 188 387.996094 L 188.890625 387.472656 L 189.332031 387.207031 L 189.777344 386.945312 L 190.667969 386.414062 L 191.109375 386.148438 L 192 385.617188 L 192.890625 385.078125 L 193.332031 384.808594 L 193.777344 384.539062 L 194.222656 384.265625 L 194.667969 383.996094 L 195.109375 383.722656 L 196 383.175781 L 196.445312 382.898438 L 196.890625 382.625 L 197.332031 382.347656 L 198.222656 381.792969 L 198.667969 381.511719 L 199.109375 381.234375 L 200.445312 380.390625 L 200.890625 380.105469 L 201.332031 379.824219 L 202.667969 378.96875 L 203.109375 378.683594 L 204 378.105469 L 204.445312 377.820312 L 204.890625 377.527344 L 205.332031 377.238281 L 205.777344 376.949219 L 206.667969 376.363281 L 207.109375 376.070312 L 207.554688 375.777344 L 208 375.480469 L 208.445312 375.1875 L 208.890625 374.890625 L 209.332031 374.59375 L 209.777344 374.292969 L 210.222656 373.996094 L 210.667969 373.695312 L 211.109375 373.398438 L 211.554688 373.097656 L 212 372.792969 L 212.445312 372.492188 L 212.890625 372.1875 L 213.332031 371.886719 L 213.777344 371.582031 L 214.222656 371.273438 L 214.667969 370.96875 L 215.109375 370.660156 L 215.554688 370.355469 L 216.445312 369.738281 L 216.890625 369.425781 L 217.332031 369.117188 L 218.667969 368.179688 L 219.109375 367.867188 L 220 367.234375 L 220.445312 366.921875 L 220.890625 366.601562 L 221.332031 366.285156 L 221.777344 365.96875 L 222.667969 365.328125 L 223.109375 365.007812 L 224 364.367188 L 224.890625 363.71875 L 225.332031 363.394531 L 226.222656 362.746094 L 226.667969 362.417969 L 227.109375 362.089844 L 228.445312 361.105469 L 228.890625 360.773438 L 229.332031 360.441406 L 230.667969 359.445312 L 231.109375 359.109375 L 231.554688 358.777344 L 232.890625 357.769531 L 233.332031 357.429688 L 233.777344 357.089844 L 234.222656 356.753906 L 234.667969 356.410156 L 235.109375 356.070312 L 235.554688 355.730469 L 236.890625 354.699219 L 237.332031 354.355469 L 237.777344 354.011719 L 238.667969 353.316406 L 239.109375 352.96875 L 240 352.273438 L 240.445312 351.921875 L 240.890625 351.574219 L 241.332031 351.222656 L 241.777344 350.871094 L 242.222656 350.515625 L 242.667969 350.164062 L 243.109375 349.808594 L 244.445312 348.742188 L 244.890625 348.382812 L 245.332031 348.027344 L 246.667969 346.949219 L 247.109375 346.585938 L 247.554688 346.226562 L 248.890625 345.136719 L 249.332031 344.769531 L 249.777344 344.40625 L 250.667969 343.671875 L 251.109375 343.304688 L 251.554688 342.9375 L 252.890625 341.824219 L 253.332031 341.453125 L 254.222656 340.710938 L 254.667969 340.335938 L 255.109375 339.960938 L 256 339.210938 L 256.445312 338.832031 L 256.890625 338.457031 L 257.332031 338.078125 L 258.222656 337.320312 L 258.667969 336.9375 L 259.109375 336.558594 L 260.445312 335.410156 L 260.890625 335.023438 L 261.332031 334.640625 L 262.667969 333.480469 L 263.109375 333.09375 L 263.554688 332.703125 L 264 332.316406 L 264.890625 331.535156 L 265.332031 331.140625 L 265.777344 330.75 L 266.222656 330.355469 L 266.667969 329.964844 L 267.109375 329.570312 L 267.554688 329.171875 L 268 328.777344 L 268.445312 328.378906 L 268.890625 327.984375 L 269.332031 327.585938 L 269.777344 327.183594 L 270.667969 326.386719 L 271.109375 325.984375 L 272 325.179688 L 272.445312 324.773438 L 272.890625 324.371094 L 273.332031 323.964844 L 274.667969 322.746094 L 275.109375 322.339844 L 276.890625 320.699219 L 277.332031 320.289062 L 278.667969 319.046875 L 279.109375 318.632812 L 279.554688 318.21875 L 280.445312 317.382812 L 280.890625 316.96875 L 281.332031 316.546875 L 282.222656 315.710938 L 282.667969 315.289062 L 283.109375 314.867188 L 284 314.023438 L 284.445312 313.597656 L 284.890625 313.175781 L 285.332031 312.75 L 286.222656 311.898438 L 286.667969 311.46875 L 287.109375 311.042969 L 288.890625 309.324219 L 289.332031 308.890625 L 290.667969 307.589844 L 291.109375 307.15625 L 291.554688 306.722656 L 292.890625 305.410156 L 293.332031 304.972656 L 293.777344 304.53125 L 294.222656 304.09375 L 294.667969 303.652344 L 295.109375 303.210938 L 295.554688 302.769531 L 296 302.324219 L 296.445312 301.882812 L 296.890625 301.4375 L 297.332031 300.992188 L 298.222656 300.101562 L 298.667969 299.652344 L 299.109375 299.203125 L 300.890625 297.40625 L 301.332031 296.953125 L 302.667969 295.59375 L 303.109375 295.140625 L 304.890625 293.3125 L 305.332031 292.855469 L 306.667969 291.472656 L 307.109375 291.011719 L 308 290.089844 L 308.890625 289.160156 L 309.332031 288.695312 L 309.777344 288.230469 L 310.222656 287.761719 L 310.667969 287.296875 L 311.109375 286.828125 L 312 285.890625 L 312.445312 285.417969 L 312.890625 284.949219 L 313.332031 284.476562 L 314.222656 283.53125 L 314.667969 283.054688 L 315.109375 282.582031 L 316.890625 280.675781 L 317.332031 280.195312 L 317.777344 279.71875 L 318.667969 278.757812 L 319.109375 278.277344 L 319.554688 277.792969 L 320 277.3125 L 320.890625 276.34375 L 321.332031 275.859375 L 321.777344 275.371094 L 322.222656 274.886719 L 322.667969 274.398438 L 323.109375 273.910156 L 324 272.933594 L 324.445312 272.441406 L 324.890625 271.953125 L 325.332031 271.460938 L 325.777344 270.96875 L 326.222656 270.472656 L 326.667969 269.980469 L 327.109375 269.484375 L 328.890625 267.5 L 329.332031 267 L 329.777344 266.503906 L 330.222656 266.003906 L 330.667969 265.5 L 331.109375 265 L 331.554688 264.5 L 332.890625 262.988281 L 333.332031 262.484375 L 334.222656 261.46875 L 334.667969 260.964844 L 335.109375 260.457031 L 335.554688 259.945312 L 336 259.4375 L 336.445312 258.925781 L 336.890625 258.417969 L 337.332031 257.90625 L 337.777344 257.390625 L 338.667969 256.367188 L 339.109375 255.851562 L 340 254.820312 L 340.445312 254.300781 L 340.890625 253.785156 L 341.332031 253.265625 L 342.667969 251.707031 L 343.109375 251.1875 L 344.890625 249.09375 L 345.332031 248.570312 L 346.667969 246.988281 L 347.109375 246.460938 L 348 245.40625 L 348.890625 244.34375 L 349.332031 243.8125 L 349.777344 243.28125 L 350.222656 242.746094 L 350.667969 242.214844 L 351.109375 241.679688 L 351.554688 241.144531 L 352 240.605469 L 352.445312 240.070312 L 352.890625 239.53125 L 353.332031 238.996094 L 354.222656 237.917969 L 354.667969 237.375 L 355.109375 236.835938 L 356.890625 234.664062 L 357.332031 234.117188 L 357.777344 233.574219 L 358.667969 232.480469 L 359.109375 231.933594 L 360 230.832031 L 360.445312 230.285156 L 360.890625 229.734375 L 361.332031 229.183594 L 361.777344 228.628906 L 362.222656 228.078125 L 362.667969 227.523438 L 363.109375 226.96875 L 364 225.859375 L 364.890625 224.742188 L 365.332031 224.1875 L 365.777344 223.628906 L 366.222656 223.066406 L 366.667969 222.507812 L 367.109375 221.945312 L 368.890625 219.695312 L 369.332031 219.128906 L 369.777344 218.566406 L 370.222656 218 L 370.667969 217.429688 L 371.109375 216.863281 L 371.554688 216.296875 L 372.890625 214.585938 L 373.332031 214.015625 L 373.777344 213.441406 L 374.222656 212.871094 L 374.667969 212.296875 L 375.109375 211.722656 L 375.554688 211.148438 L 376 210.570312 L 376.445312 209.996094 L 376.890625 209.417969 L 377.332031 208.839844 L 377.777344 208.261719 L 378.222656 207.679688 L 378.667969 207.101562 L 379.109375 206.519531 L 380.890625 204.191406 L 381.332031 203.605469 L 382.667969 201.847656 L 383.109375 201.257812 L 383.554688 200.671875 L 384.890625 198.902344 L 385.332031 198.3125 L 386.667969 196.53125 L 387.109375 195.9375 L 387.554688 195.34375 L 388 194.746094 L 388.445312 194.152344 L 388.890625 193.554688 L 389.332031 192.957031 L 389.777344 192.359375 L 390.222656 191.757812 L 390.667969 191.160156 L 391.109375 190.558594 L 392 189.355469 L 392.445312 188.75 L 392.890625 188.148438 L 393.332031 187.542969 L 394.667969 185.726562 L 395.109375 185.117188 L 395.554688 184.511719 L 396.445312 183.292969 L 396.890625 182.679688 L 397.332031 182.070312 L 397.777344 181.457031 L 398.222656 180.847656 L 398.667969 180.234375 L 399.109375 179.617188 L 399.554688 179.003906 L 400 178.386719 L 400.445312 177.773438 L 400.890625 177.15625 L 401.332031 176.539062 L 401.777344 175.917969 L 402.222656 175.300781 L 402.667969 174.679688 L 403.109375 174.058594 L 404 172.816406 L 404.445312 172.191406 L 404.890625 171.570312 L 405.332031 170.945312 L 406.222656 169.695312 L 406.667969 169.066406 L 407.109375 168.441406 L 408.890625 165.925781 L 409.332031 165.292969 L 410.667969 163.394531 L 411.109375 162.761719 L 411.554688 162.128906 L 412.890625 160.21875 L 413.332031 159.582031 L 413.777344 158.945312 L 414.667969 157.664062 L 415.109375 157.023438 L 416 155.742188 L 416.890625 154.453125 L 417.332031 153.8125 L 417.777344 153.164062 L 418.667969 151.875 L 419.109375 151.226562 L 420.890625 148.632812 L 421.332031 147.980469 L 422.667969 146.023438 L 423.109375 145.371094 L 424.890625 142.746094 L 425.332031 142.089844 L 425.777344 141.433594 L 426.667969 140.113281 L 427.109375 139.453125 L 427.554688 138.792969 L 428 138.128906 L 428.445312 137.46875 L 428.890625 136.804688 L 429.332031 136.140625 L 429.777344 135.476562 L 430.222656 134.808594 L 430.667969 134.144531 L 431.109375 133.476562 L 432.445312 131.472656 L 432.890625 130.800781 L 433.332031 130.128906 L 433.777344 129.460938 L 434.222656 128.789062 L 434.667969 128.113281 L 435.109375 127.441406 L 436.890625 124.738281 L 437.332031 124.0625 L 437.777344 123.382812 L 438.222656 122.707031 L 438.667969 122.027344 L 439.109375 121.34375 L 440 119.984375 L 440.890625 118.617188 L 441.332031 117.933594 L 441.777344 117.25 L 442.222656 116.5625 L 442.667969 115.878906 L 443.109375 115.191406 L 444 113.816406 L 444.445312 113.125 L 444.890625 112.4375 L 445.332031 111.746094 L 446.222656 110.363281 L 446.667969 109.667969 L 447.109375 108.976562 L 448.890625 106.195312 L 449.332031 105.496094 L 449.777344 104.800781 L 450.667969 103.402344 L 451.109375 102.703125 L 451.554688 102 L 452 101.300781 L 452.890625 99.894531 L 453.332031 99.191406 L 453.777344 98.484375 L 454.222656 97.78125 L 454.667969 97.074219 L 455.109375 96.367188 L 456 94.953125 L 456.445312 94.242188 L 456.890625 93.535156 L 457.332031 92.824219 L 458.222656 91.402344 L 458.667969 90.6875 L 459.109375 89.976562 L 460.445312 87.832031 L 460.890625 87.113281 L 461.332031 86.398438 L 462.667969 84.242188 L 463.109375 83.523438 L 464 82.078125 L 464.445312 81.359375 L 464.890625 80.636719 L 465.332031 79.910156 L 465.777344 79.1875 L 466.667969 77.734375 L 467.109375 77.007812 L 468 75.554688 L 468.445312 74.824219 L 468.890625 74.097656 L 469.332031 73.367188 L 469.777344 72.632812 L 470.667969 71.171875 L 471.109375 70.4375 L 472.445312 68.234375 L 472.890625 67.496094 L 473.332031 66.761719 L 474.667969 64.546875 L 475.109375 63.804688 L 475.554688 63.066406 L 476.890625 60.839844 L 477.332031 60.09375 L 477.777344 59.351562 L 478.667969 57.859375 L 479.109375 57.113281 L 480 55.621094 L 480.890625 54.121094 L 481.332031 53.371094 L 481.777344 52.621094 L 482.222656 51.867188 L 482.667969 51.117188 L 483.109375 50.363281 L 484.445312 48.101562 L 484.890625 47.34375 L 485.332031 46.585938 L 486.667969 44.3125 L 487.109375 43.554688 L 488 42.03125 "/>
<path style="fill-rule:nonzero;fill:rgb(100%,100%,100%);fill-opacity:1;stroke-width:0.75;stroke-linecap:round;stroke-linejoin:round;stroke:rgb(0%,0%,0%);stroke-opacity:1;stroke-miterlimit:10;" d="M 93.601562 22.175781 L 384.679688 22.175781 L 384.679688 108.574219 L 93.601562 108.574219 Z M 93.601562 22.175781 "/>
<path style="fill:none;stroke-width:3.75;stroke-linecap:round;stroke-linejoin:round;stroke:rgb(0%,0%,0%);stroke-opacity:1;stroke-dasharray:3.75,11.25;stroke-miterlimit:10;" d="M 100.078125 50.976562 L 143.28125 50.976562 "/>
<path style="fill:none;stroke-width:3.75;stroke-linecap:round;stroke-linejoin:round;stroke:rgb(0%,0%,0%);stroke-opacity:1;stroke-miterlimit:10;" d="M 100.078125 79.777344 L 143.28125 79.777344 "/>
<g style="fill:rgb(0%,0%,0%);fill-opacity:1;">
  <use xlink:href="#glyph2-7" x="164.878906" y="59.52832"/>
  <use xlink:href="#glyph2-8" x="178.341797" y="59.52832"/>
  <use xlink:href="#glyph2-9" x="191.685547" y="59.52832"/>
  <use xlink:href="#glyph2-10" x="205.029297" y="59.52832"/>
  <use xlink:href="#glyph2-11" x="218.373047" y="59.52832"/>
  <use xlink:href="#glyph2-9" x="226.246094" y="59.52832"/>
  <use xlink:href="#glyph2-12" x="239.589844" y="59.52832"/>
  <use xlink:href="#glyph2-8" x="246.261719" y="59.52832"/>
  <use xlink:href="#glyph2-11" x="259.605469" y="59.52832"/>
  <use xlink:href="#glyph2-5" x="267.358398" y="59.52832"/>
</g>
<g style="fill:rgb(0%,0%,0%);fill-opacity:1;">
  <use xlink:href="#glyph2-5" x="164.878906" y="88.329102"/>
  <use xlink:href="#glyph2-13" x="178.222656" y="88.329102"/>
  <use xlink:href="#glyph2-5" x="191.566406" y="88.329102"/>
  <use xlink:href="#glyph2-11" x="204.910156" y="88.329102"/>
  <use xlink:href="#glyph2-14" x="212.783203" y="88.329102"/>
  <use xlink:href="#glyph2-15" x="226.126953" y="88.329102"/>
  <use xlink:href="#glyph2-6" x="238.126953" y="88.329102"/>
  <use xlink:href="#glyph2-4" x="244.798828" y="88.329102"/>
  <use xlink:href="#glyph2-5" x="258.142578" y="88.329102"/>
  <use xlink:href="#glyph2-11" x="271.486328" y="88.329102"/>
  <use xlink:href="#glyph2-12" x="280.198242" y="88.329102"/>
  <use xlink:href="#glyph2-8" x="286.870117" y="88.329102"/>
  <use xlink:href="#glyph2-11" x="300.213867" y="88.329102"/>
  <use xlink:href="#glyph2-16" x="308.206055" y="88.329102"/>
  <use xlink:href="#glyph2-9" x="321.549805" y="88.329102"/>
  <use xlink:href="#glyph2-12" x="334.893555" y="88.329102"/>
  <use xlink:href="#glyph2-17" x="341.56543" y="88.329102"/>
  <use xlink:href="#glyph2-3" x="346.893555" y="88.329102"/>
  <use xlink:href="#glyph2-13" x="360.237305" y="88.329102"/>
</g>
</g>
</svg>
