0.000000	0.026910	-0.046880	-0.000200	-0.012970	0.026070	-0.066560	0.085730	-0.029330
0.000020	0.027120	-0.036740	-0.011250	-0.008230	0.025790	-0.053810	0.076440	-0.013240
0.000040	0.026680	0.000630	-0.059310	0.004820	0.016170	0.002750	0.055650	0.036110
0.000060	0.014990	0.059770	-0.122310	0.011420	-0.005220	0.081340	0.028110	0.092980
0.000080	-0.018410	0.085180	-0.115850	-0.001520	-0.009180	0.093370	0.009530	0.084180
0.000100	-0.053370	0.062290	-0.065570	0.007590	0.012280	0.059880	-0.009220	0.046680
0.000120	-0.022060	0.050230	-0.064940	0.036830	0.001340	0.064920	-0.029240	0.058940
0.000140	0.083400	0.060700	-0.069820	0.007630	-0.025460	0.073250	-0.035510	0.065980
0.000160	0.066280	0.049290	-0.041950	-0.032900	-0.009610	0.062360	-0.055620	0.039550
0.000180	-0.122350	0.023870	-0.040930	-0.001990	-0.005810	0.056810	-0.075190	0.036150
0.000200	-0.138220	0.024970	-0.046240	0.025810	-0.033510	0.053290	-0.058210	0.042210
0.000220	0.077380	0.037320	-0.033650	0.012450	-0.015470	0.057060	-0.049800	0.025300
0.000240	0.110830	0.048490	-0.029980	0.017800	0.016210	0.047520	-0.061770	0.015430
0.000260	-0.069360	0.048980	-0.013060	0.006620	-0.004540	0.022400	-0.067890	0.022970
0.000280	-0.118860	-0.018490	0.008660	-0.031000	-0.024880	0.025470	-0.072130	0.014160
0.000300	0.012050	-0.066900	-0.007830	-0.012000	-0.015730	0.046130	-0.061870	0.003220
0.000320	0.108310	0.032400	-0.029920	0.012460	-0.010360	0.041110	-0.047350	0.007290
0.000340	0.019850	0.092470	-0.016580	-0.006220	-0.006310	0.025580	-0.055890	-0.000510
0.000360	-0.141340	-0.016990	0.030540	0.011840	-0.016450	0.018840	-0.060920	-0.017420
0.000380	-0.087040	-0.037060	0.062250	0.025500	-0.037200	0.009170	-0.047620	-0.029620
0.000400	0.097960	0.070300	-0.007110	-0.017130	-0.016340	0.014710	-0.040050	-0.030240
0.000420	0.057260	0.030830	-0.063690	-0.029730	0.012120	0.023300	-0.032740	-0.017390
0.000440	-0.112670	-0.068850	0.037530	-0.008320	0.002630	0.014800	-0.021520	-0.012030
0.000460	-0.054730	-0.020060	0.110970	0.000130	-0.002150	0.012560	-0.027220	-0.018840
0.000480	0.119670	0.046410	0.035200	0.016850	0.000890	0.001410	-0.031940	-0.029870
0.000500	0.063790	0.042760	-0.018430	0.005250	-0.024350	-0.012820	-0.011680	-0.045360
0.000520	-0.124730	-0.001550	0.005050	-0.038880	-0.031980	0.002900	0.003780	-0.043620
0.000540	-0.133880	-0.050890	0.039710	-0.012160	0.001410	0.015030	0.009820	-0.021680
0.000560	0.019110	0.004940	0.050130	0.050540	0.003880	0.006510	0.030060	-0.011150
0.000580	0.110570	0.078190	0.014600	0.026780	-0.024530	0.005360	0.035550	-0.025910
0.000600	0.024600	-0.002550	0.002710	-0.034220	-0.030030	0.001070	0.018710	-0.037810
0.000620	-0.103860	-0.080160	0.051340	-0.042020	-0.024350	-0.012940	0.025460	-0.026090
0.000640	-0.048070	-0.010870	0.061930	0.000950	-0.016410	0.001870	0.042080	-0.019040
0.000660	0.071690	0.031330	0.009180	0.045200	-0.025500	0.022250	0.039280	-0.029180
0.000680	0.020580	-0.034990	-0.003690	0.004640	-0.043070	0.004290	0.041450	-0.028760
0.000700	-0.061930	-0.034770	0.047440	-0.066950	-0.010470	-0.006120	0.040260	-0.010270
0.000720	-0.007270	0.047330	0.060730	-0.014450	0.022800	0.006260	0.025960	0.010440
0.000740	0.048300	0.045100	0.036870	0.077690	0.003900	0.018050	0.031100	0.017880
0.000760	0.021980	-0.019840	0.033750	0.032360	0.014000	0.029080	0.036050	0.012160
0.000780	0.000010	-0.033100	0.020730	-0.057890	0.032630	0.011430	0.024370	0.011870
0.000800	0.019700	-0.004190	0.026880	-0.018050	-0.025650	-0.019780	0.031350	0.024440
0.000820	0.060200	0.022830	0.056540	0.074730	-0.052050	-0.000780	0.031110	0.027220
0.000840	0.065710	0.007060	0.025780	0.054890	0.016860	0.031680	0.005520	0.005450
0.000860	-0.009410	-0.024810	0.004970	-0.025680	0.032320	0.014420	0.022020	-0.014520
0.000880	-0.073130	-0.001890	0.053870	-0.036140	-0.026850	-0.010590	0.067730	-0.015990
0.000900	-0.047450	0.007570	0.053210	0.026050	-0.039220	-0.015700	0.054780	-0.013270
0.000920	-0.006470	-0.040830	0.001610	0.061450	0.002170	-0.015530	0.009730	-0.027470
0.000940	0.016240	-0.036900	-0.010480	0.005760	0.036610	0.009270	0.007070	-0.051450
0.000960	0.033140	0.009280	0.005260	-0.038470	0.030090	0.033520	0.022950	-0.054470
0.000980	-0.028340	0.002790	0.036250	0.010510	-0.014840	0.007920	0.013750	-0.032220
0.001000	-0.081430	-0.033080	0.038720	0.021430	-0.029970	-0.014870	-0.012410	-0.001620
0.001020	-0.000000	-0.056630	-0.008040	-0.035860	0.005030	0.007430	-0.023810	0.003930
0.001040	0.063330	-0.041500	-0.013570	-0.025450	0.004070	0.017900	0.000290	-0.022350
0.001060	0.004060	0.012270	0.017160	0.025060	-0.029270	-0.006960	0.018020	-0.032270
0.001080	-0.047810	0.017090	0.000200	0.036580	-0.013940	-0.031610	-0.012430	-0.013020
0.001100	-0.050600	-0.041420	-0.029440	0.018100	0.013730	-0.032210	-0.033020	0.004120
0.001120	-0.036390	-0.058820	-0.010630	-0.027290	-0.000120	-0.007770	-0.013130	0.003730
0.001140	-0.042330	-0.025890	0.007770	-0.028590	-0.021090	0.007620	-0.018260	-0.013470
0.001160	-0.132720	-0.002810	-0.012550	0.032350	-0.021400	-0.012880	-0.037230	-0.023360
0.001180	-0.232730	0.005710	-0.001640	0.026250	0.006820	-0.030430	-0.028320	-0.005130
0.001200	-0.180200	-0.043010	0.040750	-0.049440	0.035940	-0.013660	-0.038870	0.019740
0.001220	-0.029910	-0.159340	0.036120	-0.058380	0.005580	-0.007710	-0.054430	0.024460
0.001240	0.061410	-0.208220	-0.010140	0.003150	-0.050590	-0.026550	-0.028030	-0.001510
0.001260	0.096840	-0.166130	-0.074360	0.035170	-0.042240	-0.036760	-0.019630	-0.009920
0.001280	0.121920	-0.106940	-0.119790	0.010610	0.014150	-0.041240	-0.030400	0.034900
0.001300	0.152460	-0.030110	-0.100980	-0.034100	0.035440	-0.029340	-0.005870	0.050510
0.001320	0.234740	0.039610	-0.080970	-0.046850	0.007730	0.008890	-0.005160	0.015910
0.001340	0.374410	0.070730	-0.090550	-0.007330	-0.019020	0.015740	-0.041460	0.015650
0.001360	0.509870	0.108510	-0.058570	-0.011630	-0.002540	-0.020970	-0.023920	0.030100
0.001380	0.543470	0.209150	-0.017000	-0.093880	0.032180	-0.040840	0.026680	-0.005900
0.001400	0.407400	0.347250	0.005520	-0.122750	0.023770	-0.029590	0.029350	-0.036330
0.001420	0.102210	0.420810	0.065840	-0.082940	-0.025580	-0.007910	0.008390	-0.005260
0.001440	-0.283270	0.418500	0.140480	-0.057310	-0.074720	0.011000	-0.003680	0.012890
0.001460	-0.609220	0.373190	0.203880	-0.000400	-0.102470	-0.004610	-0.017300	-0.017070
0.001480	-0.795240	0.210920	0.299780	0.061460	-0.106960	-0.035720	-0.009280	-0.028920
0.001500	-0.734560	-0.098060	0.387990	0.047520	-0.067030	-0.040650	0.010340	-0.004720
0.001520	-0.354630	-0.413660	0.386340	0.078910	0.001430	-0.063350	0.010970	0.029380
0.001540	0.157720	-0.574330	0.291460	0.209770	0.020490	-0.100230	0.012160	0.030390
0.001560	0.584180	-0.525940	0.106650	0.315610	0.060550	-0.095100	0.003980	-0.016750
0.001580	0.731170	-0.350910	-0.146060	0.356710	0.160960	-0.098830	-0.007750	-0.030550
0.001600	0.391040	-0.141920	-0.374500	0.333380	0.196480	-0.111460	-0.010500	0.009140
0.001620	-0.168590	0.096030	-0.530100	0.216420	0.218710	-0.038890	-0.060320	0.022570
0.001640	-0.494100	0.263120	-0.559050	0.037300	0.278240	0.061760	-0.110480	-0.001630
0.001660	-0.576920	0.239640	-0.382090	-0.164160	0.279850	0.110890	-0.079650	-0.025960
0.001680	-0.437910	0.114090	-0.110110	-0.363440	0.236320	0.166960	-0.029950	-0.044950
0.001700	-0.027470	-0.047480	0.093540	-0.469310	0.156180	0.226520	-0.001060	-0.061400
0.001720	0.351320	-0.225140	0.234450	-0.439200	-0.010390	0.242910	0.042060	-0.069940
0.001740	0.349870	-0.282670	0.268010	-0.327690	-0.196800	0.217360	0.094170	-0.073910
0.001760	-0.003730	-0.171070	0.116370	-0.136690	-0.324570	0.142740	0.156010	-0.076780
0.001780	-0.407830	0.011960	-0.066610	0.119350	-0.373240	0.050250	0.219250	-0.060950
0.001800	-0.543600	0.083030	-0.152380	0.304730	-0.319250	-0.039860	0.242720	-0.009870
0.001820	-0.260340	-0.060760	-0.209370	0.312590	-0.203190	-0.146090	0.225760	0.056440
0.001840	0.289170	-0.228200	-0.183830	0.155510	-0.057800	-0.245770	0.173820	0.124170
0.001860	0.807750	-0.240400	-0.055970	-0.094320	0.131730	-0.311490	0.089130	0.191940
0.001880	1.107100	-0.109780	-0.019420	-0.267290	0.259990	-0.333400	-0.000140	0.230760
0.001900	1.010970	0.151840	-0.101370	-0.216770	0.231790	-0.263580	-0.091470	0.225720
0.001920	0.489830	0.450150	-0.198400	-0.071960	0.109280	-0.090950	-0.201420	0.167240
0.001940	-0.183140	0.645870	-0.275270	-0.034400	-0.029950	0.073830	-0.296260	0.073800
0.001960	-0.805650	0.737300	-0.208660	-0.084060	-0.146490	0.135210	-0.316130	-0.007370
0.001980	-1.244970	0.670310	0.075610	-0.149100	-0.179040	0.126200	-0.262330	-0.101720
0.002000	-1.211500	0.296320	0.424410	-0.208820	-0.125880	0.092310	-0.157190	-0.223570
0.002020	-0.540190	-0.263550	0.691660	-0.215810	-0.096520	0.031070	-0.019420	-0.306070
0.002040	0.414610	-0.663580	0.816070	-0.134560	-0.118360	-0.045270	0.071050	-0.329070
0.002060	0.984000	-0.802260	0.688090	0.063290	-0.112130	-0.133230	0.081640	-0.290000
0.002080	0.962710	-0.688150	0.308280	0.361920	-0.090350	-0.214500	0.083140	-0.187670
0.002100	0.741690	-0.294550	-0.153980	0.640200	-0.041540	-0.203980	0.090430	-0.086560
0.002120	0.415150	0.156500	-0.580890	0.772240	0.102110	-0.124860	0.044190	0.008770
0.002140	-0.368220	0.433190	-0.808360	0.659610	0.266960	-0.109050	-0.056590	0.109190
0.002160	-1.397410	0.527460	-0.622000	0.276750	0.387010	-0.116190	-0.142490	0.150560
0.002180	-1.698280	0.406150	-0.169470	-0.229670	0.492040	-0.034650	-0.171310	0.152410
0.002200	-1.180080	0.050660	0.225910	-0.613290	0.504780	0.081150	-0.171580	0.152130
0.002220	-0.516330	-0.357880	0.423150	-0.694760	0.336790	0.189900	-0.168370	0.077600
0.002240	0.355120	-0.657310	0.351370	-0.470970	0.025330	0.346700	-0.134330	-0.066960
0.002260	1.347350	-0.949060	0.098010	-0.071960	-0.339680	0.468300	-0.065220	-0.160290
0.002280	1.960540	-1.110580	-0.095190	0.299970	-0.581220	0.413500	0.003650	-0.188210
0.002300	1.876380	-0.773090	-0.212570	0.471570	-0.535540	0.214060	0.070330	-0.224890
0.002320	0.930960	-0.051380	-0.340310	0.435670	-0.236230	-0.042160	0.169030	-0.232970
0.002340	-0.210700	0.898200	-0.416070	0.218600	0.140770	-0.292640	0.278620	-0.150200
0.002360	-0.965190	1.781580	-0.532080	-0.077140	0.387540	-0.420210	0.306600	-0.015350
0.002380	-1.280520	2.014140	-0.755620	-0.262830	0.416610	-0.353110	0.212970	0.147730
0.002400	-0.744750	1.498300	-0.722340	-0.329630	0.321230	-0.151350	0.037330	0.324900
0.002420	0.222230	0.380600	-0.224800	-0.317430	0.187680	0.072150	-0.190730	0.446830
0.002440	0.698800	-0.852420	0.636220	-0.260080	-0.022030	0.229100	-0.392760	0.466920
0.002460	0.469200	-1.495260	1.561190	-0.340050	-0.298770	0.292930	-0.446800	0.363150
0.002480	-0.266670	-1.370430	1.761140	-0.514290	-0.481150	0.241110	-0.345790	0.129670
0.002500	-0.981310	-0.512110	1.083250	-0.440880	-0.493910	0.067330	-0.178730	-0.150830
0.002520	-1.265000	0.601630	0.094060	0.020020	-0.379270	-0.098830	-0.031000	-0.344570
0.002540	-0.773400	1.156660	-0.957000	0.684330	-0.164200	-0.147100	0.053590	-0.375040
0.002560	0.448740	0.951970	-1.617110	1.213790	0.050550	-0.163790	0.074420	-0.282960
0.002580	1.506260	0.235200	-1.457170	1.182330	0.163060	-0.200880	0.057340	-0.140490
0.002600	1.832870	-0.669440	-0.641860	0.497460	0.253060	-0.192310	0.035680	0.014780
0.002620	1.434840	-1.271380	0.466600	-0.378460	0.444860	-0.139970	0.029710	0.121190
0.002640	0.405190	-0.947370	1.298740	-1.181520	0.652700	-0.035100	0.036350	0.149850
0.002660	-0.828310	0.265350	1.373160	-1.683430	0.663540	0.158330	0.054610	0.132270
0.002680	-1.766580	1.380890	0.760570	-1.388870	0.408120	0.376670	0.098820	0.097030
0.002700	-2.203490	1.678310	-0.150880	-0.476260	-0.086410	0.530780	0.152950	0.077610
0.002720	-1.918740	1.074860	-0.896780	0.524840	-0.685110	0.537560	0.216320	0.074640
0.002740	-0.872870	-0.227540	-0.950390	1.402140	-1.183730	0.364440	0.357910	0.050700
0.002760	0.319310	-1.593740	-0.115190	1.648330	-1.462930	0.087010	0.559900	0.006590
0.002780	1.195690	-2.315220	1.010920	1.019470	-1.219190	-0.208260	0.703540	-0.042950
0.002800	1.839050	-2.078150	1.477600	0.086940	-0.310990	-0.491450	0.761280	-0.076030
0.002820	2.053800	-0.944570	0.906500	-0.646090	0.794870	-0.707630	0.713910	-0.022780
0.002840	1.643940	0.563410	-0.356150	-0.820220	1.612440	-0.714750	0.494840	0.123970
0.002860	0.853050	1.623240	-1.625550	-0.289600	1.809900	-0.576630	0.179550	0.301430
0.002880	-0.243590	1.870320	-2.217690	0.505570	1.247210	-0.412970	-0.110060	0.477690
0.002900	-1.548490	1.520860	-1.762550	0.877470	0.279210	-0.012990	-0.347390	0.554460
0.002920	-2.472360	0.852410	-0.426820	0.473280	-0.709060	0.576870	-0.481700	0.423970
0.002940	-2.516320	0.114420	1.044640	-0.396050	-1.383150	0.994280	-0.470310	0.141000
0.002960	-1.578570	-0.530450	1.885440	-1.212360	-1.341850	1.112090	-0.391020	-0.210970
0.002980	0.088950	-1.045200	1.857320	-1.503820	-0.684420	0.871330	-0.303900	-0.566140
0.003000	1.789830	-1.381290	1.143940	-0.976960	0.095220	0.276400	-0.154930	-0.755410
0.003020	2.793380	-1.437340	0.218170	0.071450	0.618730	-0.440710	0.027610	-0.689910
0.003040	2.664330	-1.119590	-0.485960	1.118570	0.668900	-0.943060	0.171060	-0.481300
0.003060	1.294450	-0.397020	-0.860990	1.695000	0.223220	-1.067350	0.271990	-0.217020
0.003080	-0.654110	0.699520	-1.009370	1.499480	-0.353870	-0.794430	0.168610	0.044120
0.003100	-2.020450	1.804120	-1.104950	0.756360	-0.555160	-0.135280	-0.247590	0.238390
0.003120	-2.294230	2.291140	-1.078920	-0.090060	-0.234550	0.533850	-0.769430	0.425660
0.003140	-1.658770	1.842600	-0.730240	-0.765270	0.419820	0.828470	-1.181990	0.601110
0.003160	-0.388250	0.548190	-0.089000	-1.144530	1.037460	0.676500	-1.342530	0.690890
0.003180	0.841870	-1.108590	0.755240	-1.198010	1.126910	0.151300	-1.112720	0.658500
0.003200	1.270300	-2.296400	1.565600	-1.037320	0.500750	-0.301450	-0.522960	0.362720
0.003220	0.990660	-2.433100	1.941860	-0.755850	-0.493100	-0.316830	0.164590	-0.186980
0.003240	0.426200	-1.529130	1.629320	-0.215600	-1.333710	-0.005160	0.655130	-0.718200
0.003260	-0.107650	0.054550	0.583460	0.532110	-1.650650	0.426790	0.758280	-1.013220
0.003280	-0.191070	1.564750	-0.861830	1.178590	-1.298570	0.667890	0.449010	-0.942610
0.003300	0.039100	2.065800	-2.040390	1.573300	-0.472530	0.433210	-0.003410	-0.439800
0.003320	0.052170	1.462990	-2.337290	1.522040	0.427310	-0.223300	-0.235900	0.333840
0.003340	-0.141680	0.373510	-1.610450	0.931370	1.115120	-0.951020	-0.115030	1.001460
0.003360	-0.367730	-0.666150	-0.235470	0.016620	1.425050	-1.256290	0.264870	1.264560
0.003380	-0.572460	-1.105620	1.180240	-1.016110	1.304520	-0.917670	0.639490	1.066580
0.003400	-0.463570	-0.802970	1.909420	-1.842300	0.862290	-0.149110	0.672820	0.514220
0.003420	0.008520	-0.243840	1.591820	-1.970640	0.268550	0.691350	0.287120	-0.150390
0.003440	0.374130	0.150640	0.595180	-1.240400	-0.365120	1.244210	-0.267460	-0.612520
0.003460	0.413660	0.175640	-0.474310	0.011450	-0.961120	1.294270	-0.666680	-0.650520
0.003480	0.270220	-0.063300	-1.085850	1.230800	-1.398350	0.901460	-0.639070	-0.321570
0.003500	-0.031290	-0.127820	-0.977670	1.821720	-1.538270	0.244470	-0.143000	-0.003080
0.003520	-0.270290	0.130580	-0.399330	1.486050	-1.252860	-0.420900	0.547410	0.006210
0.003540	-0.156620	0.384230	0.161180	0.518200	-0.472460	-0.835670	1.075030	-0.241870
0.003560	0.111050	0.377170	0.348360	-0.554010	0.649860	-0.971770	1.203590	-0.544670
0.003580	0.335920	0.155490	0.161960	-1.227430	1.715230	-0.880870	0.897690	-0.655160
0.003600	0.492870	-0.173740	-0.043420	-1.148440	2.210170	-0.590420	0.285820	-0.395260
0.003620	0.300620	-0.474280	0.021260	-0.508710	1.764240	-0.186210	-0.356200	0.182860
0.003640	-0.242480	-0.492940	0.255460	0.140320	0.506170	0.294350	-0.730800	0.817370
0.003660	-0.649240	-0.153730	0.348270	0.496490	-0.988800	0.773340	-0.792270	1.149120
0.003680	-0.728650	0.275690	0.168950	0.507760	-2.096710	1.080940	-0.647620	0.963960
0.003700	-0.544710	0.499350	-0.150770	0.299820	-2.324460	1.121260	-0.364000	0.343710
0.003720	-0.051070	0.385170	-0.412190	0.175960	-1.521480	0.786050	-0.011670	-0.451000
0.003740	0.492540	-0.001440	-0.446920	0.160380	-0.132250	0.008900	0.340660	-1.088550
0.003760	0.673010	-0.331380	-0.190360	0.074700	1.136560	-0.963270	0.623580	-1.294260
0.003780	0.482050	-0.378120	0.203360	-0.055870	1.776930	-1.668790	0.773110	-1.040980
0.003800	0.083970	-0.220450	0.458100	-0.212500	1.600920	-1.691980	0.765410	-0.504990
0.003820	-0.332670	0.025370	0.437710	-0.336430	0.842680	-0.894690	0.568780	0.087980
0.003840	-0.465060	0.206850	0.199430	-0.249470	-0.026520	0.335690	0.149780	0.557750
0.003860	-0.242090	0.211350	-0.115980	-0.009840	-0.657960	1.348560	-0.418580	0.845570
0.003880	0.047460	0.078160	-0.313430	0.224000	-0.865190	1.735930	-0.915170	0.932830
0.003900	0.195600	-0.154770	-0.270540	0.371190	-0.675490	1.353710	-1.071900	0.781450
0.003920	0.161760	-0.342350	-0.061600	0.300120	-0.370220	0.377590	-0.723210	0.422200
0.003940	-0.066420	-0.277860	0.144820	0.016070	-0.153110	-0.646460	0.027890	-0.049140
0.003960	-0.278400	-0.027770	0.202050	-0.252710	0.010170	-1.194750	0.799840	-0.532250
0.003980	-0.230020	0.216290	0.051960	-0.333010	0.189050	-1.095370	1.182030	-0.933500
0.004000	0.020460	0.351860	-0.179260	-0.221160	0.370160	-0.539330	0.967410	-1.139370
0.004020	0.266680	0.280770	-0.319990	0.015590	0.480370	0.089950	0.269110	-0.983090
0.004040	0.331300	0.031840	-0.303490	0.264600	0.426240	0.457750	-0.539640	-0.395550
0.004060	0.157710	-0.203250	-0.113240	0.353600	0.202530	0.474880	-1.063420	0.416940
0.004080	-0.149150	-0.288560	0.141710	0.234300	-0.085930	0.305980	-1.082400	1.091310
0.004100	-0.340700	-0.169880	0.281000	0.011270	-0.326470	0.145920	-0.643970	1.322060
0.004120	-0.228260	0.087280	0.253570	-0.227600	-0.379040	0.063050	-0.014500	0.989410
0.004140	0.082650	0.235060	0.070590	-0.361520	-0.173780	0.017460	0.467220	0.236660
0.004160	0.346160	0.148200	-0.157800	-0.309220	0.115760	-0.076700	0.594200	-0.574100
0.004180	0.424260	-0.042440	-0.226290	-0.160740	0.250260	-0.225610	0.411650	-1.053560
0.004200	0.251060	-0.202700	-0.100420	0.018920	0.157370	-0.314080	0.118830	-1.008370
0.004220	-0.094910	-0.197900	0.092100	0.160000	-0.088110	-0.242670	-0.085660	-0.513470
0.004240	-0.299970	0.038960	0.193410	0.143760	-0.301280	-0.028120	-0.154820	0.148600
0.004260	-0.214510	0.311330	0.090950	0.037350	-0.297490	0.218580	-0.184420	0.626780
0.004280	-0.059080	0.397720	-0.146790	-0.025060	-0.082800	0.342670	-0.221310	0.729980
0.004300	0.034210	0.249390	-0.315080	-0.014270	0.200340	0.280380	-0.242160	0.501040
0.004320	0.063470	-0.061230	-0.251380	0.075400	0.405760	0.082420	-0.209650	0.126150
0.004340	-0.046640	-0.286780	0.018210	0.161320	0.394970	-0.186440	-0.085570	-0.162000
0.004360	-0.197670	-0.244730	0.308630	0.128460	0.164730	-0.367650	0.100340	-0.263180
0.004380	-0.176480	-0.081630	0.424700	-0.010340	-0.106750	-0.309140	0.253210	-0.253690
0.004400	-0.017050	0.047260	0.284600	-0.167030	-0.260940	-0.095160	0.313020	-0.207160
0.004420	0.163840	0.135100	0.002310	-0.244080	-0.260990	0.124310	0.248510	-0.141800
0.004440	0.319190	0.093230	-0.237670	-0.175140	-0.125490	0.254300	0.058810	-0.059510
0.004460	0.307270	-0.070170	-0.284600	-0.010610	0.071140	0.221870	-0.135740	0.054980
0.004480	0.084340	-0.126790	-0.085970	0.106930	0.197240	0.068580	-0.195520	0.176930
0.004500	-0.128730	-0.009520	0.162960	0.104420	0.188360	-0.100950	-0.119670	0.237100
0.004520	-0.218060	0.126160	0.243060	0.023900	0.082370	-0.216390	0.032220	0.217280
0.004540	-0.208300	0.184020	0.149190	-0.076030	-0.034550	-0.201700	0.186230	0.129110
0.004560	-0.058340	0.116820	-0.049940	-0.101590	-0.058050	-0.041240	0.234540	-0.020960
0.004580	0.128380	-0.069140	-0.206670	0.031000	0.015200	0.130660	0.146960	-0.148500
0.004600	0.175670	-0.215150	-0.160750	0.211800	0.078500	0.192930	-0.019170	-0.162500
0.004620	0.139530	-0.190690	-0.001900	0.264800	0.076060	0.156010	-0.172280	-0.078290
0.004640	0.069410	-0.057090	0.086330	0.181020	0.007440	0.039770	-0.192720	0.049380
0.004660	-0.094380	0.106700	0.073730	0.022460	-0.106370	-0.111100	-0.070720	0.147590
0.004680	-0.229550	0.221710	-0.030310	-0.144910	-0.161250	-0.186500	0.077020	0.137190
0.004700	-0.202830	0.168180	-0.181040	-0.196620	-0.067020	-0.165570	0.182490	0.014640
0.004720	-0.080450	0.033680	-0.234230	-0.126840	0.131800	-0.095910	0.199620	-0.145480
0.004740	0.071280	-0.032350	-0.107260	-0.063790	0.306860	-0.016630	0.082390	-0.227290
0.004760	0.198180	-0.115290	0.102430	-0.039970	0.325910	0.012630	-0.095740	-0.164010
0.004780	0.234580	-0.210770	0.254960	-0.059310	0.159060	0.013190	-0.197190	-0.012610
0.004800	0.210060	-0.190720	0.280540	-0.128530	-0.077280	0.066750	-0.182780	0.131650
0.004820	0.132800	-0.109590	0.159740	-0.130090	-0.264550	0.174690	-0.097400	0.196130
0.004840	-0.000210	-0.015310	-0.018020	-0.020810	-0.327380	0.269700	-0.012110	0.139780
0.004860	-0.085690	0.113420	-0.146930	0.102210	-0.200700	0.258290	0.005560	-0.000360
0.004880	-0.082640	0.202730	-0.238720	0.197820	0.038250	0.084140	-0.031170	-0.140420
0.004900	-0.079040	0.230280	-0.236050	0.217460	0.173090	-0.176440	-0.057710	-0.214740
0.004920	-0.097100	0.206830	-0.099790	0.096830	0.141630	-0.359960	-0.058330	-0.189880
0.004940	-0.087140	0.084900	0.041760	-0.057870	0.055400	-0.373870	-0.045010	-0.096550
0.004960	-0.032610	-0.067670	0.128960	-0.122520	-0.025000	-0.233090	-0.020520	-0.011890
0.004980	0.064240	-0.151810	0.164210	-0.141340	-0.064520	0.007830	-0.023980	0.017100
0.005000	0.160300	-0.185740	0.128580	-0.128820	-0.025990	0.225400	-0.096260	0.000490
0.005020	0.189400	-0.142960	0.075110	-0.059170	0.044820	0.269600	-0.189540	-0.004180
0.005040	0.163610	0.000440	0.026160	-0.014920	0.088470	0.140220	-0.217570	0.040930
0.005060	0.089640	0.114300	-0.031110	-0.009220	0.074650	-0.040460	-0.144850	0.084900
0.005080	-0.042970	0.141100	-0.049910	0.011720	-0.010010	-0.162200	0.012200	0.082970
0.005100	-0.137600	0.153480	-0.036150	0.014690	-0.090630	-0.158730	0.172070	0.056880
0.005120	-0.111770	0.107850	-0.023530	0.009950	-0.085650	-0.045720	0.243930	-0.001320
0.005140	-0.034520	-0.020690	0.013900	0.036700	-0.046130	0.067360	0.218720	-0.095240
0.005160	0.007670	-0.117250	0.066440	0.029290	-0.009450	0.098860	0.131100	-0.137970
0.005180	0.003370	-0.146760	0.101940	-0.022470	0.057330	0.058240	0.034250	-0.069930
0.005200	-0.028700	-0.130460	0.128460	-0.047530	0.089600	-0.012430	-0.001050	0.041630
0.005220	-0.054870	-0.058410	0.112000	-0.049960	0.047530	-0.055900	0.010850	0.114950
0.005240	-0.053000	0.002980	0.010630	-0.020500	0.005630	-0.025000	0.015260	0.125370
0.005260	-0.057570	-0.000560	-0.100360	0.068560	-0.043720	0.045460	0.020860	0.061210
0.005280	-0.052890	-0.033300	-0.144020	0.140650	-0.116370	0.080280	0.018600	-0.050050
0.005300	-0.003390	-0.086200	-0.141150	0.144730	-0.142050	0.057390	-0.019660	-0.124580
0.005320	0.028260	-0.119730	-0.079560	0.083890	-0.099190	-0.010870	-0.052340	-0.122000
0.005340	0.011770	-0.048930	0.038750	-0.037790	0.008710	-0.087370	-0.031210	-0.070720
0.005360	-0.000860	0.073050	0.114950	-0.132180	0.147200	-0.119790	0.022720	-0.014460
0.005380	0.005080	0.120600	0.107730	-0.132600	0.198300	-0.108610	0.067740	0.012350
0.005400	0.032620	0.083490	0.051800	-0.104500	0.132030	-0.062270	0.070850	0.007070
0.005420	0.061020	-0.015850	-0.035850	-0.054480	0.018890	0.023880	0.028280	-0.008380
0.005440	0.055030	-0.149510	-0.087860	0.065090	-0.122560	0.109360	-0.008790	-0.022540
0.005460	0.077880	-0.209520	-0.027870	0.152480	-0.231230	0.141310	-0.023430	-0.019320
0.005480	0.132620	-0.134180	0.063280	0.111280	-0.197800	0.100270	-0.047700	0.012260
0.005500	0.075820	-0.001660	0.072770	0.009260	-0.074190	0.011040	-0.060690	0.030030
0.005520	-0.041340	0.091270	0.024500	-0.084160	0.026620	-0.070230	-0.040650	-0.009240
0.005540	-0.052800	0.116180	-0.051180	-0.117110	0.101100	-0.107720	-0.023390	-0.069640
0.005560	-0.046810	0.100540	-0.139420	-0.048720	0.127270	-0.097110	-0.033290	-0.096160
0.005580	-0.115210	0.094940	-0.158580	0.038300	0.065510	-0.057260	-0.066950	-0.097730
0.005600	-0.122680	0.083520	-0.074390	0.057120	-0.010610	-0.009110	-0.112160	-0.095360
0.005620	-0.061550	0.028170	0.052780	0.033350	-0.041120	0.031900	-0.143890	-0.067270
0.005640	-0.033730	0.006680	0.150020	-0.028200	-0.065940	0.049270	-0.134210	-0.007530
0.005660	0.022560	0.002240	0.163220	-0.111150	-0.066210	0.043290	-0.095120	0.041690
0.005680	0.095180	-0.099820	0.125950	-0.125940	-0.019420	0.028930	-0.055650	0.049240
0.005700	0.081300	-0.183620	0.119410	-0.080140	0.003780	0.021400	-0.009580	0.024140
0.005720	0.062860	-0.130760	0.102580	-0.019600	-0.012380	0.027140	0.042270	-0.018550
0.005740	0.043530	-0.062160	0.042080	0.069860	-0.031520	0.026790	0.072580	-0.055240
0.005760	-0.078290	-0.008530	0.013480	0.104370	-0.062410	0.005950	0.074720	-0.059990
0.005780	-0.151800	0.078190	-0.003350	0.039370	-0.073960	-0.011040	0.052230	-0.043320
0.005800	-0.087980	0.114650	-0.066200	0.004860	-0.033080	0.002600	0.009590	-0.018690
0.005820	-0.025900	0.067670	-0.110280	0.024300	0.021220	0.029680	-0.039870	0.038470
0.005840	0.036940	-0.000380	-0.079530	0.021950	0.068640	0.037570	-0.092730	0.120760
0.005860	0.107530	-0.085270	-0.021530	0.030100	0.093120	0.016880	-0.131900	0.165800
0.005880	0.082330	-0.122700	0.027020	0.048630	0.038070	-0.018360	-0.109400	0.151440
0.005900	0.011650	-0.048250	0.046980	0.027400	-0.057960	-0.031380	-0.040480	0.113210
0.005920	-0.045830	0.018530	0.014230	0.004260	-0.098790	-0.020640	0.022520	0.052840
0.005940	-0.122230	0.045170	-0.021190	0.005820	-0.071410	-0.027120	0.083060	-0.037100
0.005960	-0.133280	0.113360	-0.028730	0.016200	-0.010840	-0.030050	0.122200	-0.106750
0.005980	-0.045970	0.129000	-0.045600	0.042550	0.034170	-0.019830	0.111690	-0.110670
0.006000	-0.001790	0.025460	-0.025290	0.049330	0.043100	-0.045440	0.076640	-0.058610
0.006020	-0.016590	-0.084020	0.058190	-0.007360	0.044160	-0.059030	0.030770	0.021320
0.006040	-0.003130	-0.133680	0.121510	-0.060030	0.020580	-0.016730	-0.010210	0.106080
0.006060	0.004420	-0.123010	0.137750	-0.066180	-0.026690	0.027720	-0.019030	0.157300
0.006080	0.013640	-0.045040	0.109130	-0.074230	-0.020350	0.070490	-0.030320	0.134010
0.006100	0.078420	0.045070	0.009390	-0.065600	0.036500	0.102710	-0.067320	0.069950
0.006120	0.079600	0.081890	-0.097230	-0.009150	0.048940	0.069010	-0.075980	0.011990
0.006140	-0.015630	0.078950	-0.140880	0.039420	-0.003540	0.012770	-0.052310	-0.046760
0.006160	-0.059670	0.043630	-0.134000	0.074770	-0.075740	-0.011630	-0.038830	-0.080960
0.006180	-0.074410	-0.000460	-0.060370	0.111460	-0.131790	-0.041700	-0.016440	-0.074810
0.006200	-0.122200	0.012620	0.050360	0.097000	-0.133290	-0.052890	0.010910	-0.071130
0.006220	-0.106120	0.038750	0.102460	0.045080	-0.063040	-0.005630	-0.001750	-0.073610
0.006240	-0.059930	0.021200	0.095600	0.012560	0.030700	0.024730	-0.038330	-0.058140
0.006260	-0.039050	0.015830	0.064910	-0.028250	0.102150	0.009570	-0.059960	-0.039360
0.006280	0.047010	0.008940	0.008430	-0.066260	0.137270	-0.009260	-0.063420	-0.024400
0.006300	0.114700	-0.035090	-0.026770	-0.033820	0.100760	-0.032450	-0.058940	0.012350
0.006320	0.050320	-0.031220	-0.009840	0.034870	0.015700	-0.041760	-0.050220	0.074540
0.006340	-0.011760	0.033130	-0.003750	0.065690	-0.038070	-0.007510	-0.027020	0.120900
0.006360	-0.019570	0.067050	-0.041750	0.058970	-0.062120	0.035240	0.013050	0.117540
0.006380	-0.035930	0.087880	-0.079090	0.024760	-0.068200	0.044280	0.044600	0.079250
0.006400	-0.012070	0.107990	-0.099670	-0.022150	-0.019750	0.028990	0.057040	0.038090
0.006420	0.058800	0.061150	-0.090270	-0.039690	0.052740	0.006050	0.066260	0.011810
0.006440	0.081940	0.001760	-0.007890	-0.031700	0.078600	-0.016910	0.074640	0.008980
0.006460	0.048360	-0.014790	0.088060	-0.024790	0.052460	-0.018880	0.077030	0.026600
0.006480	-0.017040	-0.034590	0.103600	-0.019240	-0.003000	-0.000800	0.062980	0.042720
0.006500	-0.099910	-0.016150	0.070600	-0.021810	-0.063630	0.030900	0.023430	0.028260
0.006520	-0.096100	0.052920	0.016270	-0.009150	-0.079330	0.067320	-0.028510	-0.011900
0.006540	0.012470	0.078450	-0.061770	0.029190	-0.044130	0.073480	-0.079960	-0.035540
0.006560	0.063840	0.075010	-0.091010	0.035710	0.003130	0.033740	-0.105270	-0.025070
0.006580	0.023940	0.085750	-0.064130	0.016020	0.044750	-0.035600	-0.074750	0.005320
0.006600	-0.008570	0.069870	-0.037960	0.015810	0.057500	-0.095920	-0.007570	0.024130
0.006620	-0.041850	0.055300	-0.013220	0.001130	0.035490	-0.107520	0.050620	0.005000
0.006640	-0.073980	0.053850	-0.018870	-0.019440	0.012720	-0.074320	0.077640	-0.023360
0.006660	-0.035470	0.025440	-0.045230	0.006580	-0.011080	-0.031490	0.066930	-0.032570
0.006680	0.029590	0.007890	-0.029310	0.026710	-0.031400	0.013330	0.023620	-0.036700
0.006700	0.070010	-0.000110	-0.001560	-0.008230	-0.009820	0.057540	-0.025000	-0.029790
0.006720	0.088540	-0.045780	0.020620	-0.042100	0.010560	0.068230	-0.048540	-0.007300
0.006740	0.025320	-0.069040	0.060860	-0.057150	-0.025730	0.043590	-0.039230	0.014540
0.006760	-0.077750	-0.034250	0.074670	-0.066820	-0.049280	0.012350	-0.002040	0.032140
0.006780	-0.080480	0.002650	0.038210	-0.030760	-0.026730	-0.010820	0.043220	0.008900
0.006800	-0.009760	0.037760	-0.020500	0.034100	-0.012140	-0.024040	0.064280	-0.065290
0.006820	0.029380	0.077450	-0.084180	0.078600	0.026090	-0.026940	0.042430	-0.108460
0.006840	0.028490	0.065400	-0.122030	0.103020	0.091890	-0.025720	0.004990	-0.092270
0.006860	0.010080	0.034760	-0.105570	0.097460	0.093590	-0.044460	-0.005620	-0.052570
0.006880	0.005680	0.034030	-0.066130	0.060110	0.046500	-0.052290	-0.000040	0.004010
0.006900	0.019040	0.021740	-0.032660	0.016960	0.005390	-0.004510	0.002160	0.043760
0.006920	0.009610	0.002400	0.018630	-0.020320	-0.040500	0.036980	0.008740	0.045460
0.006940	-0.009940	-0.010130	0.067230	-0.039250	-0.058910	0.047990	0.008370	0.041100
0.006960	0.020110	-0.034110	0.049680	-0.026720	-0.021260	0.062860	0.003820	0.029010
0.006980	0.070240	-0.039040	-0.003140	-0.020520	0.024190	0.037720	0.017150	0.005720
0.007000	0.051910	-0.010050	-0.035820	-0.053300	0.050970	-0.021820	0.026680	-0.012230
0.007020	-0.033070	0.006850	-0.045520	-0.056130	0.058370	-0.053420	0.030640	-0.024020
0.007040	-0.099380	0.009450	-0.027490	-0.000140	0.035180	-0.065670	0.052030	-0.019240
0.007060	-0.086660	0.035980	-0.009080	0.029650	0.002400	-0.054750	0.047350	0.000710
0.007080	-0.025490	0.047900	-0.021980	0.024990	-0.015080	-0.004600	0.002890	0.018470
0.007100	0.010860	0.024540	-0.031920	0.033550	-0.030770	0.038530	-0.025630	0.035620
0.007120	0.030040	-0.001290	-0.036870	0.034320	-0.037980	0.047720	-0.042500	0.043490
0.007140	0.065260	-0.047950	-0.062950	0.037170	-0.020800	0.035880	-0.058590	0.037210
0.007160	0.092060	-0.073480	-0.062400	0.046390	-0.005930	0.004520	-0.037770	0.029530
0.007180	0.089920	-0.032540	-0.013870	0.010140	-0.006960	-0.035980	0.000180	0.022710
0.007200	0.067790	-0.008030	0.036710	-0.041520	-0.001890	-0.061650	0.017680	0.012010
0.007220	0.022770	-0.007860	0.058030	-0.057790	-0.002680	-0.055800	0.030980	-0.001950
0.007240	-0.030370	0.024020	0.021500	-0.069090	-0.002800	-0.021070	0.039300	-0.016070
0.007260	-0.053210	0.034800	-0.044260	-0.069930	0.024710	0.015150	0.035960	-0.023780
0.007280	-0.039120	0.026220	-0.066010	-0.037630	0.036480	0.031270	0.027020	-0.013630
0.007300	-0.008600	0.072340	-0.047530	-0.003720	0.013590	0.015150	0.007270	0.012110
0.007320	0.016500	0.095990	-0.033220	0.025450	0.001980	-0.014860	0.006840	0.036870
0.007340	0.014940	0.015070	-0.013880	0.037740	-0.016280	-0.027680	0.038640	0.054460
0.007360	0.021320	-0.062040	0.020900	0.000280	-0.053140	-0.023780	0.055450	0.065030
0.007380	0.056670	-0.071320	0.042030	-0.026140	-0.045890	-0.015850	0.057870	0.060380
0.007400	0.085820	-0.065000	0.038070	0.006570	-0.009090	-0.011530	0.067700	0.038830
0.007420	0.092610	-0.037570	0.026920	0.023050	0.012640	0.002890	0.057890	0.012420
0.007440	0.064440	0.004640	0.011870	-0.007620	0.032910	0.018490	0.030690	-0.001220
0.007460	-0.015500	0.020440	-0.010670	-0.016020	0.035570	-0.001580	0.020790	0.005640
0.007480	-0.098670	0.053920	-0.018480	-0.005860	0.014660	-0.017030	0.028180	0.021550
0.007500	-0.127840	0.079080	-0.013170	-0.020890	0.005360	0.013740	0.035590	0.029460
0.007520	-0.093500	0.027800	-0.002380	-0.041790	0.000360	0.035180	0.038370	0.028880
0.007540	-0.015390	-0.013370	0.037540	-0.048530	-0.007150	0.029780	0.033750	0.027790
0.007560	0.061200	-0.028690	0.053500	-0.032280	0.000930	0.026310	0.015890	0.025570
0.007580	0.082770	-0.091260	0.009730	0.015820	0.007930	0.006090	-0.000260	0.019340
0.007600	0.046440	-0.119790	-0.009140	0.048180	-0.001060	-0.011690	0.006240	0.011960
0.007620	-0.001900	-0.085900	-0.005110	0.043110	-0.008240	0.001690	0.018220	0.018320
0.007640	-0.042310	-0.065540	-0.014520	0.064050	-0.028270	-0.008880	0.030900	0.037240
0.007660	-0.062530	-0.037980	-0.010150	0.090590	-0.057690	-0.038140	0.054630	0.034710
0.007680	-0.023860	-0.012060	-0.014540	0.053100	-0.035580	-0.019570	0.046760	0.011540
0.007700	0.017670	-0.037490	-0.029250	0.010390	0.016840	0.013950	0.011780	0.002390
0.007720	-0.002910	-0.067060	-0.015420	-0.012400	0.040550	0.009970	0.008560	-0.012070
0.007740	-0.003160	-0.079550	0.003570	-0.053050	0.062020	-0.006330	0.008690	-0.043060
0.007760	0.034540	-0.087430	0.015100	-0.063410	0.077660	-0.008250	-0.015530	-0.034930
0.007780	0.034350	-0.047390	0.033520	-0.043370	0.049920	-0.001500	-0.028600	0.008640
0.007800	0.033220	0.011010	0.027040	-0.041230	0.012180	0.019770	-0.025280	0.013270
0.007820	0.031850	0.011110	-0.011980	-0.012050	-0.016500	0.047000	-0.018060	-0.021900
0.007840	-0.015920	0.011110	-0.051100	0.052870	-0.056750	0.050970	-0.010640	-0.040390
0.007860	-0.028750	0.042110	-0.076160	0.086190	-0.072780	0.042630	-0.009630	-0.037000
0.007880	-0.017600	0.011380	-0.063420	0.082560	-0.042030	0.032610	-0.017050	-0.031540
0.007900	-0.046270	-0.043280	0.002620	0.052600	-0.009220	0.004770	-0.019050	-0.027480
0.007920	-0.026280	-0.030300	0.065460	-0.007750	0.013260	-0.018680	-0.011980	-0.024220
0.007940	0.037480	-0.035060	0.070500	-0.053210	0.034230	-0.022010	-0.018700	-0.005310
0.007960	0.048170	-0.078740	0.061780	-0.074850	0.042780	-0.020000	-0.037060	0.022080
0.007980	0.040840	-0.054860	0.066730	-0.098780	0.044400	-0.019160	-0.055610	0.017780
0.008000	0.016730	-0.010440	0.038970	-0.091010	0.029090	-0.018060	-0.078400	-0.002010
0.008020	-0.051470	0.001110	-0.001950	-0.038940	-0.002080	0.012020	-0.091220	-0.001910
0.008040	-0.054300	0.033400	-0.008460	0.001520	-0.012950	0.066060	-0.094300	0.003400
0.008060	0.024170	0.037530	-0.007020	0.023070	-0.008170	0.071930	-0.085820	-0.002660
0.008080	0.040980	0.003730	0.000850	0.055070	-0.026010	0.033300	-0.042130	-0.014980
0.008100	0.006040	-0.003100	0.028970	0.054100	-0.052550	0.014560	0.013760	-0.020220
0.008120	0.007570	-0.039110	0.036690	0.018000	-0.045570	0.007390	0.049440	-0.012300
0.008140	0.016340	-0.085090	0.034150	0.004500	-0.004970	-0.021710	0.079980	-0.014610
0.008160	0.016140	-0.051030	0.057490	-0.011670	0.028930	-0.045200	0.088070	-0.030370
0.008180	0.012230	-0.022190	0.070080	-0.028480	0.033510	-0.023370	0.051430	-0.028730
0.008200	-0.028060	-0.039930	0.060220	-0.012550	0.017220	0.015990	0.026020	-0.008480
0.008220	-0.050940	-0.021090	0.028640	-0.022890	-0.003950	0.029720	0.036190	0.001850
0.008240	-0.016910	0.005300	-0.026420	-0.034120	-0.015350	0.033410	0.040240	-0.002990
0.008260	-0.004700	0.002560	-0.034380	0.010270	-0.018150	0.034460	0.035580	-0.005720
0.008280	-0.005050	0.018640	0.008090	0.029430	-0.003670	0.019270	0.038890	-0.015660
0.008300	0.037610	0.018610	0.018820	0.013450	0.031830	-0.000070	0.042700	-0.033560
0.008320	0.034680	-0.021380	0.007460	0.013850	0.034430	-0.023910	0.058330	-0.026770
0.008340	-0.030150	-0.035920	0.006430	-0.007660	0.001400	-0.031890	0.089470	-0.013520
0.008360	-0.039340	-0.024660	-0.003610	-0.024090	0.005000	-0.003140	0.100140	-0.022550
0.008380	-0.006600	-0.014200	0.003340	0.006410	0.014450	0.014990	0.086070	-0.028480
0.008400	-0.005620	0.014900	0.040760	0.019080	-0.017960	0.013670	0.072270	-0.029310
0.008420	-0.009790	0.034840	0.049970	0.002950	-0.033200	0.028450	0.050770	-0.026250
0.008440	-0.020420	0.008670	0.026070	-0.000000	-0.018280	0.037140	0.018370	-0.001530
0.008460	-0.045720	-0.012330	0.010330	-0.013490	-0.003600	0.028910	-0.001830	0.013010
0.008480	-0.030230	-0.006810	0.004270	-0.040390	0.016840	0.020320	-0.011620	-0.009830
0.008500	0.025680	-0.009330	0.003320	-0.040380	0.024540	0.004430	-0.020920	-0.045030
0.008520	0.057340	-0.006490	0.006780	-0.029930	0.015320	-0.013140	-0.018410	-0.068840
0.008540	0.058050	-0.000780	-0.003630	-0.023710	0.016130	-0.016640	-0.005430	-0.076390
0.008560	0.033530	-0.020010	-0.025900	-0.000970	0.007800	-0.010510	0.002410	-0.076620
0.008580	-0.028120	-0.030150	-0.034350	0.008340	-0.015560	0.005040	0.006150	-0.075850
0.008600	-0.069020	-0.012000	-0.040130	-0.000070	-0.026370	0.024770	0.000040	-0.063710
0.008620	-0.038130	0.002080	-0.040370	0.014480	-0.033350	0.025160	-0.014380	-0.039120
0.008640	0.010270	0.005340	-0.001440	0.028950	-0.034110	0.013600	-0.014970	-0.024130
0.008660	0.024200	0.007310	0.051820	0.010920	-0.004800	0.021800	-0.013690	-0.029230
0.008680	0.011870	0.005030	0.070400	-0.007270	0.032860	0.035570	-0.015530	-0.041390
0.008700	0.005930	0.010560	0.059770	-0.009750	0.048090	0.024590	-0.001070	-0.047720
0.008720	0.004730	0.013330	0.033990	-0.016100	0.033740	0.000930	0.014510	-0.054280
0.008740	-0.020970	-0.011500	-0.001480	-0.007460	0.002360	-0.018370	0.013410	-0.056520
0.008760	-0.021550	-0.016570	-0.017900	0.014730	-0.015080	-0.027010	0.001130	-0.045130
0.008780	0.043890	0.024100	-0.016840	0.015280	-0.009610	-0.006620	-0.004020	-0.040490
0.008800	0.056740	0.042180	-0.027280	0.015500	-0.007590	0.031430	0.006900	-0.035310
0.008820	-0.013550	0.026750	-0.037140	0.013740	-0.013190	0.044820	0.006800	-0.003890
0.008840	-0.031290	0.015350	-0.032380	-0.019090	-0.000060	0.026280	-0.011610	0.025180
0.008860	-0.012100	0.007030	-0.017910	-0.038990	0.014770	0.003340	-0.011160	0.025810
0.008880	-0.020970	0.013880	0.003980	-0.024580	0.008010	-0.009330	0.003410	0.019600
0.008900	-0.006040	0.020190	0.019700	-0.021660	0.011810	-0.012940	-0.011200	0.015030
0.008920	0.009300	-0.010080	0.019920	-0.018280	0.025370	-0.018940	-0.031760	0.004050
0.008940	-0.011090	-0.003870	0.016100	0.002710	0.011600	-0.027110	-0.022140	0.003020
0.008960	-0.006140	0.043050	0.003460	0.010670	-0.013150	-0.017800	-0.023350	0.017570
0.008980	0.005660	0.014740	-0.020630	0.008360	-0.030160	-0.003650	-0.042430	0.012800
0.009000	-0.023240	-0.036240	-0.030870	0.016870	-0.043240	-0.010780	-0.038370	-0.004330
0.009020	-0.032960	-0.008030	-0.028940	0.023550	-0.026280	-0.014410	-0.025360	0.001270
0.009040	-0.009120	0.024250	-0.029990	0.021130	0.009610	-0.009790	-0.011280	0.012100
0.009060	-0.003150	0.018990	-0.015450	0.011180	0.012820	-0.018500	0.002190	0.012340
0.009080	0.011790	0.028570	-0.009500	-0.024200	0.008260	-0.013810	-0.013690	0.016310
0.009100	0.029990	0.037360	-0.037220	-0.061000	0.022290	0.011190	-0.025790	0.021670
0.009120	0.003530	0.024610	-0.037210	-0.048520	0.017230	0.012480	-0.004670	0.018670
0.009140	-0.020610	0.020040	0.003660	-0.019570	-0.006580	0.002830	-0.008130	0.008420
0.009160	-0.020610	0.009160	0.013140	-0.018010	-0.017320	0.006160	-0.042250	0.007760
0.009180	-0.047050	0.005320	0.001220	-0.010710	-0.027720	-0.006740	-0.039540	0.014200
0.009200	-0.054140	0.030480	0.002030	0.002220	-0.041950	-0.018250	-0.009080	0.005120
0.009220	0.001450	0.016800	-0.017450	0.012320	-0.034950	-0.012120	0.009190	0.001760
0.009240	0.028960	-0.023340	-0.031110	0.034750	-0.017240	-0.026290	0.020610	0.027400
0.009260	0.005730	-0.013010	-0.010730	0.043510	0.000100	-0.041670	0.018510	0.048920
0.009280	0.011290	0.005080	-0.005440	0.040150	0.022900	-0.030720	0.008580	0.042620
0.009300	0.009610	-0.001960	-0.004620	0.033760	0.025880	-0.017060	0.012400	0.038460
0.009320	-0.022170	0.007980	0.003440	-0.004150	0.011670	-0.002700	0.012070	0.068730
0.009340	-0.019530	0.020350	-0.011930	-0.023500	0.012970	0.011860	0.001360	0.106160
0.009360	0.003340	0.017240	-0.012910	0.009680	0.014620	0.002420	0.000910	0.105000
0.009380	0.006240	0.027860	0.005600	0.024090	0.013140	-0.013150	-0.000270	0.073010
0.009400	0.009330	0.031340	-0.012430	0.003050	0.017760	-0.004910	-0.018990	0.041080
0.009420	-0.005490	0.002180	-0.030990	-0.003830	0.004370	-0.002910	-0.026170	0.026280
0.009440	-0.032740	-0.003920	-0.006060	0.004510	-0.015000	-0.019310	-0.012760	0.030980
0.009460	-0.013390	0.005510	0.001660	0.017720	-0.008270	-0.026080	-0.010120	0.029690
0.009480	0.023810	-0.009580	-0.013770	0.030560	-0.005860	-0.027760	-0.013870	0.017560
0.009500	0.023530	0.000630	-0.006110	0.027880	-0.021580	-0.023370	-0.016730	0.023920
0.009520	0.002230	0.021850	-0.010270	0.020990	-0.011910	-0.013880	-0.035770	0.039590
0.009540	-0.028150	-0.005290	-0.024110	0.026600	0.009670	-0.022170	-0.057640	0.039660
0.009560	-0.044330	-0.010450	-0.016740	0.028230	0.003460	-0.019630	-0.068400	0.032720
0.009580	-0.020330	0.021380	-0.031300	0.019110	-0.002380	0.012920	-0.073060	0.025190
0.009600	0.014060	0.015100	-0.036090	0.009980	0.001900	0.021010	-0.073040	0.023500
0.009620	0.022190	0.005160	0.015280	-0.005860	0.003780	-0.001190	-0.077040	0.032650
0.009640	0.018730	0.021480	0.033380	-0.025060	0.013870	-0.008250	-0.081480	0.024270
0.009660	0.030040	0.027590	-0.004310	-0.018290	0.007600	-0.006130	-0.071340	0.004200
0.009680	0.039910	0.036830	-0.016830	-0.012490	-0.018020	-0.007940	-0.058900	0.016880
0.009700	0.011980	0.043000	-0.013330	-0.031380	-0.015420	-0.010100	-0.055820	0.044670
0.009720	-0.033720	0.024050	-0.019540	-0.012030	0.007200	-0.015560	-0.049350	0.053790
0.009740	-0.035320	0.016220	-0.015540	0.031260	0.004170	-0.013720	-0.033860	0.064370
0.009760	0.013500	0.025700	-0.018380	0.014790	-0.008650	-0.000520	-0.025060	0.081730
0.009780	0.031380	0.022170	-0.025560	-0.028420	-0.014830	0.003410	-0.021280	0.078450
0.009800	0.000250	0.006490	-0.008560	-0.040650	-0.031170	-0.010870	-0.006650	0.065440
0.009820	-0.003340	-0.012160	0.000440	-0.025020	-0.019170	-0.019510	-0.003190	0.076160
0.009840	0.013090	-0.019740	-0.010840	0.018010	0.019260	-0.008880	-0.017550	0.094130
0.009860	0.002410	0.000100	-0.003280	0.050410	0.021760	-0.007120	-0.012300	0.086400
0.009880	-0.004230	0.034920	0.025140	0.038310	0.006220	-0.008130	0.005320	0.061290
0.009900	-0.004830	0.041090	0.043920	0.025800	-0.002670	0.006790	0.009360	0.046640
0.009920	-0.019070	0.034590	0.037220	0.022790	-0.022340	0.002620	0.011880	0.051840
0.009940	-0.016990	0.044710	0.010070	0.004470	-0.022850	-0.017420	0.015990	0.044750
0.009960	-0.009700	0.010160	-0.007610	0.000520	0.004640	-0.015780	0.019690	0.015920
0.009980	-0.015810	-0.040080	0.006860	0.014510	0.015170	-0.006170	0.031600	0.000110
0.010000	-0.000350	-0.016960	0.019020	0.018080	0.008870	-0.000720	0.027530	-0.001050
0.010020	0.026650	0.000200	0.002890	0.021340	0.003360	-0.002040	0.006060	-0.010270
0.010040	0.022610	-0.025570	0.013430	0.011540	-0.013290	-0.008840	0.010370	-0.032600
0.010060	0.001970	-0.019170	0.034790	-0.011800	-0.024480	0.003600	0.015800	-0.057940
0.010080	-0.028940	-0.003980	0.007250	0.004850	-0.012570	0.025720	-0.001940	-0.073470
0.010100	-0.055000	-0.003850	-0.009200	0.044090	-0.004030	0.032130	-0.005150	-0.079220
0.010120	-0.023710	0.008520	0.009870	0.043530	-0.008970	0.025720	-0.004340	-0.083450
0.010140	0.011510	0.013800	0.006380	0.021870	-0.012970	0.006730	-0.011290	-0.092630
0.010160	-0.034090	0.003280	-0.003560	0.011920	-0.014000	-0.012920	-0.002110	-0.095590
0.010180	-0.074080	-0.005410	0.014170	-0.004950	-0.005850	-0.008290	0.004930	-0.086400
0.010200	-0.025600	-0.018730	0.029160	-0.020750	0.010280	0.006650	0.004220	-0.077710
0.010220	0.031690	-0.024510	0.018050	-0.022850	0.006850	0.016300	0.018680	-0.068700