0.000000	0.155010	-0.029080	-0.011910	-0.016790	0.067250	-0.096360	0.141930	0.010470
0.000020	0.123540	-0.021150	-0.003730	-0.015230	0.054530	-0.072520	0.119270	0.005710
0.000040	-0.053730	0.021570	0.018870	-0.011360	0.000700	0.024130	-0.034590	0.005800
0.000060	-0.366940	0.076350	0.048120	-0.009550	-0.085910	0.155380	-0.277410	0.006650
0.000080	-0.494120	0.077140	0.045070	-0.014800	-0.122100	0.163880	-0.337920	-0.002340
0.000100	-0.289030	0.052690	0.017960	-0.008860	-0.087040	0.088070	-0.220470	-0.012320
0.000120	-0.101040	0.061910	0.024120	0.008850	-0.057890	0.097030	-0.199180	-0.001860
0.000140	-0.165070	0.055790	0.039570	0.003320	-0.065080	0.125220	-0.221900	0.010230
0.000160	-0.349480	0.025180	0.022800	-0.014260	-0.070850	0.097200	-0.181010	0.000310
0.000180	-0.367650	0.031030	-0.012380	-0.010260	-0.057180	0.079620	-0.161430	-0.003130
0.000200	-0.166490	0.021840	-0.033540	0.001030	-0.047840	0.070720	-0.160340	0.008250
0.000220	-0.046640	0.007000	-0.009070	-0.002680	-0.040570	0.051450	-0.147120	0.007990
0.000240	-0.101830	0.047180	0.014290	0.003910	-0.026700	0.045210	-0.133480	0.010520
0.000260	-0.207830	0.056790	-0.005840	0.027260	-0.033660	0.041980	-0.110020	0.026780
0.000280	-0.163580	0.016300	-0.018660	0.028250	-0.045220	0.039390	-0.081730	0.034490
0.000300	0.030350	0.007420	-0.026470	0.008170	-0.032060	0.046130	-0.068180	0.038260
0.000320	0.026160	0.017520	-0.032980	-0.003150	-0.030770	0.041360	-0.068050	0.042760
0.000340	-0.098950	0.031960	0.000670	-0.005290	-0.048300	0.023760	-0.057500	0.031050
0.000360	-0.038110	0.052100	0.008280	0.013190	-0.038740	0.015040	-0.039470	0.021210
0.000380	0.048300	0.028550	-0.022890	0.038560	-0.018750	0.017910	-0.035490	0.030170
0.000400	-0.085340	-0.010010	-0.023770	0.022040	-0.020510	0.019940	-0.040760	0.029070
0.000420	-0.210420	-0.001010	-0.037010	-0.000990	-0.016720	0.010040	-0.025700	0.009910
0.000440	-0.013000	0.014250	-0.054990	0.017560	-0.010240	0.005880	-0.007000	-0.001570
0.000460	0.151070	0.012420	-0.015010	0.032790	-0.015950	0.004310	-0.009390	-0.008360
0.000480	0.002300	0.026270	-0.004850	0.024010	-0.001910	-0.006020	-0.012290	-0.023590
0.000500	-0.027560	0.027990	-0.036830	0.010330	0.012090	-0.002730	-0.010640	-0.028680
0.000520	0.059210	0.005460	-0.015970	-0.010280	0.001550	0.007010	-0.013220	-0.012890
0.000540	-0.008510	-0.000980	-0.004160	-0.014970	0.009770	0.005070	-0.007960	-0.008780
0.000560	0.003090	-0.013090	-0.038280	0.006280	0.014660	0.001650	0.007690	-0.028270
0.000580	0.118000	-0.032420	-0.034530	0.010670	-0.009860	0.002400	0.009480	-0.036230
0.000600	0.136600	-0.011500	-0.020310	0.001380	-0.004390	-0.003760	-0.001450	-0.032420
0.000620	0.028250	0.018180	-0.025540	0.010800	0.013560	-0.019570	-0.000760	-0.044250
0.000640	-0.065570	0.008280	-0.011350	0.006890	-0.010530	-0.021650	0.011580	-0.054890
0.000660	0.039200	-0.015310	-0.008800	-0.020270	-0.019910	-0.004030	0.019140	-0.044220
0.000680	0.136220	-0.019590	-0.043240	-0.017650	0.005230	0.002290	0.021750	-0.034310
0.000700	0.093870	0.008130	-0.036790	0.011080	0.014600	-0.005160	0.023640	-0.032320
0.000720	0.118260	0.052950	0.012650	0.039230	0.019980	0.001480	0.016770	-0.022390
0.000740	0.061830	0.044890	0.021350	0.057520	0.031180	0.014470	-0.001100	-0.002010
0.000760	-0.031240	-0.003730	-0.001520	0.033770	0.019110	0.005240	-0.005030	0.012880
0.000780	0.036040	0.000990	-0.015360	-0.007030	0.011540	-0.003460	0.011720	0.014890
0.000800	0.065150	0.019310	-0.025190	-0.005850	0.009200	0.004710	0.020040	0.021450
0.000820	0.125400	-0.012720	-0.012190	0.008040	-0.012460	-0.004150	0.012140	0.021420
0.000840	0.191740	-0.002810	0.013430	0.005390	-0.003320	-0.020400	-0.003260	0.002420
0.000860	0.050800	0.031230	0.012360	0.024440	0.025980	-0.016390	-0.015110	0.005100
0.000880	-0.061370	0.001720	0.008280	0.036100	0.012760	-0.015290	-0.001190	0.023730
0.000900	-0.077820	-0.021230	0.007270	0.011920	-0.003190	-0.017820	0.022060	0.010010
0.000920	-0.112890	-0.006730	-0.027430	0.003770	0.007480	-0.009970	0.015890	-0.010070
0.000940	-0.027220	-0.006990	-0.045210	0.006970	0.006510	-0.009900	0.002700	-0.013580
0.000960	0.104060	-0.012850	-0.001820	-0.000600	0.010700	-0.012090	0.008430	-0.021120
0.000980	0.129660	-0.022090	0.032020	0.013470	0.034560	-0.001220	0.001850	-0.012140
0.001000	0.063580	-0.040840	0.033220	0.019210	0.023580	0.003750	-0.018320	0.021100
0.001020	-0.069110	-0.035550	0.012180	-0.012900	-0.011640	0.001470	-0.013740	0.031990
0.001040	-0.143570	-0.009780	-0.047480	-0.020030	-0.017230	-0.002130	-0.002430	0.014470
0.001060	-0.080980	-0.014730	-0.059820	0.006320	-0.005570	-0.017640	-0.005450	0.007050
0.001080	0.005340	-0.018550	-0.002740	0.006190	0.010060	-0.025790	0.002570	0.019350
0.001100	0.046000	0.000550	0.026560	-0.000750	0.020400	-0.008710	0.008860	0.037140
0.001120	0.046470	-0.019310	0.039030	0.010570	-0.004210	0.009160	-0.004800	0.047560
0.001140	-0.061320	-0.039730	0.027290	-0.000020	-0.021840	0.002070	-0.005350	0.036830
0.001160	-0.228190	0.003400	-0.035770	-0.015310	0.003880	-0.026380	0.012760	0.014050
0.001180	-0.299570	0.019740	-0.043540	-0.015380	0.023950	-0.043800	0.013240	0.001550
0.001200	-0.276370	-0.029140	0.021300	-0.028410	0.018040	-0.034240	0.001060	0.003820
0.001220	-0.129740	-0.100190	0.044610	-0.015290	-0.001080	-0.017090	0.004020	0.017620
0.001240	0.089960	-0.190190	0.017130	0.028380	-0.027620	-0.010940	0.009680	0.029110
0.001260	0.179410	-0.234930	-0.002310	0.018430	-0.024970	-0.017420	0.012310	0.027050
0.001280	0.256030	-0.191440	-0.028790	-0.043290	0.012450	-0.028710	0.016850	0.024840
0.001300	0.359070	-0.117000	-0.070700	-0.066780	0.020820	-0.029970	0.005780	0.041460
0.001320	0.332210	0.008640	-0.108290	-0.024850	-0.001140	-0.008710	-0.016160	0.060760
0.001340	0.424030	0.197190	-0.175180	0.030710	-0.004230	0.020330	-0.019990	0.054520
0.001360	0.598920	0.340290	-0.211870	0.028930	0.011180	0.015370	0.012260	0.043820
0.001380	0.487850	0.401250	-0.122310	-0.054560	0.024110	-0.029040	0.060970	0.038970
0.001400	0.239880	0.400860	0.042380	-0.176060	0.025860	-0.045030	0.062640	0.028220
0.001420	-0.061920	0.340110	0.213420	-0.252100	0.021660	-0.002460	0.001910	0.029170
0.001440	-0.518920	0.292380	0.375180	-0.223030	-0.003410	0.028770	-0.046760	0.038680
0.001460	-0.762210	0.253460	0.464920	-0.106400	-0.069720	0.011230	-0.028140	0.025900
0.001480	-0.713560	0.131520	0.453540	0.056680	-0.148390	-0.012860	0.017190	0.004990
0.001500	-0.618240	-0.101680	0.413840	0.204220	-0.197950	-0.016190	0.021670	0.022720
0.001520	-0.224180	-0.421260	0.333650	0.279450	-0.178530	-0.008330	-0.006630	0.052690
0.001540	0.338180	-0.621240	0.154060	0.335750	-0.072310	-0.035280	-0.031590	0.043800
0.001560	0.559930	-0.542630	-0.032470	0.378650	0.064300	-0.134040	-0.028260	0.023530
0.001580	0.580550	-0.370390	-0.174220	0.312090	0.211330	-0.212570	0.005690	0.012090
0.001600	0.449290	-0.160020	-0.317860	0.196140	0.340850	-0.191210	-0.003830	0.015260
0.001620	0.151850	0.161910	-0.417190	0.110390	0.355710	-0.115320	-0.066360	0.047280
0.001640	-0.220920	0.361850	-0.417310	-0.027220	0.310810	0.029670	-0.118420	0.055990
0.001660	-0.652880	0.292360	-0.333480	-0.205730	0.296300	0.201080	-0.163420	0.022840
0.001680	-0.492120	0.171600	-0.134610	-0.324690	0.239080	0.262010	-0.147460	-0.013680
0.001700	0.315640	0.038750	0.165170	-0.379180	0.132470	0.289060	-0.052420	-0.078260
0.001720	0.617050	-0.255260	0.371200	-0.407330	0.040220	0.329280	0.011760	-0.131550
0.001740	0.129420	-0.456610	0.348910	-0.382010	-0.069500	0.278600	0.102010	-0.115250
0.001760	-0.303730	-0.246830	0.211540	-0.202590	-0.202990	0.198430	0.257640	-0.114300
0.001780	-0.337530	0.144820	-0.009980	0.045090	-0.333570	0.134880	0.320670	-0.102800
0.001800	-0.316660	0.244450	-0.213550	0.168940	-0.444670	0.041030	0.292750	0.016330
0.001820	-0.046400	-0.100190	-0.149100	0.247440	-0.440670	-0.059130	0.231470	0.153410
0.001840	0.670470	-0.495670	-0.028610	0.286840	-0.274520	-0.185520	0.125870	0.243880
0.001860	0.985500	-0.536970	-0.040480	0.079110	-0.055740	-0.354260	0.062060	0.284230
0.001880	0.730740	-0.299230	-0.040220	-0.228760	0.156070	-0.494550	0.034400	0.239190
0.001900	0.469120	0.199880	-0.183150	-0.280140	0.355170	-0.503910	-0.014420	0.156190
0.001920	-0.010310	0.898080	-0.417110	-0.142810	0.391860	-0.311500	-0.080300	0.090960
0.001940	-0.535220	1.323480	-0.434360	-0.087390	0.156420	-0.057060	-0.208030	0.060260
0.001960	-0.545500	1.166910	-0.278010	-0.078590	-0.148170	0.110790	-0.335370	0.039910
0.001980	-0.453930	0.417480	0.111200	-0.112940	-0.244120	0.282300	-0.353050	-0.030090
0.002000	-0.722000	-0.719170	0.786500	-0.311980	-0.169000	0.416900	-0.260430	-0.132380
0.002020	-0.830510	-1.548020	1.302790	-0.452090	-0.116220	0.320760	-0.071020	-0.249500
0.002040	-0.273140	-1.322650	1.288170	-0.278500	-0.093190	0.075790	0.131810	-0.371500
0.002060	0.547560	-0.186610	0.768300	0.110140	-0.082680	-0.124750	0.251420	-0.388000
0.002080	1.225410	0.861930	-0.136380	0.534810	-0.159410	-0.209490	0.310600	-0.288830
0.002100	1.392910	0.973310	-1.083100	0.798760	-0.239600	-0.192010	0.272990	-0.157320
0.002120	0.575350	0.156110	-1.574960	0.790440	-0.142700	-0.158640	0.078090	0.036310
0.002140	-0.432740	-0.741010	-1.289490	0.604700	0.148110	-0.133360	-0.148450	0.228190
0.002160	-1.380500	-0.888490	-0.259900	0.243230	0.473050	-0.142060	-0.257470	0.264190
0.002180	-2.674120	-0.197050	0.783910	-0.228400	0.623010	-0.234120	-0.224750	0.179120
0.002200	-2.639320	0.502160	1.041310	-0.466780	0.541610	-0.232830	-0.125840	0.029560
0.002220	-0.745000	0.321170	0.596420	-0.448950	0.346030	0.004100	-0.065230	-0.148230
0.002240	1.385870	-0.205780	-0.023600	-0.439520	0.100340	0.314840	-0.057160	-0.212380
0.002260	3.201010	-0.425930	-0.582240	-0.291930	-0.180380	0.514260	-0.119480	-0.154140
0.002280	3.942530	-0.991990	-0.758370	0.035180	-0.337210	0.561320	-0.216690	-0.121070
0.002300	2.727290	-1.740920	-0.109160	0.196010	-0.226740	0.500870	-0.120090	-0.152480
0.002320	0.216360	-1.283260	0.541010	0.274720	0.040540	0.288450	0.203670	-0.201680
0.002340	-2.301330	0.634380	0.012920	0.314250	0.262670	-0.099390	0.489940	-0.238610
0.002360	-3.527890	2.723330	-0.850610	0.026010	0.279350	-0.397360	0.601560	-0.205090
0.002380	-2.526110	3.482030	-0.955540	-0.349210	0.020480	-0.428990	0.532870	-0.027580
0.002400	0.277560	2.460920	-0.609680	-0.462730	-0.295100	-0.280660	0.279370	0.240580
0.002420	2.621520	0.370910	-0.058960	-0.371680	-0.366500	0.009120	-0.083010	0.418390
0.002440	2.943690	-1.779320	0.936640	-0.339970	-0.212900	0.289500	-0.420490	0.446100
0.002460	1.347360	-3.266130	2.289650	-0.684820	0.038070	0.322030	-0.579680	0.371960
0.002480	-1.403150	-3.281390	2.837380	-0.998420	0.263270	0.158090	-0.471330	0.175080
0.002500	-3.661150	-0.758140	1.468830	-0.425150	0.114460	-0.059440	-0.188700	-0.097760
0.002520	-3.990130	2.926260	-0.607680	0.867060	-0.370290	-0.293190	0.084300	-0.312470
0.002540	-1.396870	4.204890	-1.687170	1.801000	-0.624520	-0.372810	0.217810	-0.395730
0.002560	2.949800	2.087070	-2.225140	1.818930	-0.565920	-0.200730	0.196450	-0.305740
0.002580	4.899160	-1.256880	-2.348230	1.130680	-0.486260	0.026280	0.078220	-0.102760
0.002600	3.190090	-3.395820	-0.684750	-0.086650	-0.156140	0.152430	-0.052200	0.032000
0.002620	0.335710	-3.404550	2.064600	-1.399860	0.732270	0.082290	-0.071930	0.040970
0.002640	-1.965500	-1.246720	3.211660	-1.989270	1.491520	-0.181840	0.033410	-0.002300
0.002660	-2.942290	2.201140	1.724370	-1.674060	1.284220	-0.323510	0.155280	-0.066190
0.002680	-2.506930	4.189230	-1.007250	-0.752630	0.560070	-0.087910	0.257850	-0.095050
0.002700	-1.702520	3.287420	-2.697700	0.458010	-0.177520	0.326430	0.307370	-0.033720
0.002720	-0.786110	0.545000	-2.659670	1.552880	-1.147860	0.522450	0.242360	0.065890
0.002740	0.591370	-2.538510	-1.202590	2.151520	-1.814160	0.487830	0.165400	0.116800
0.002760	1.441110	-4.136520	1.335610	1.792210	-1.595880	0.426260	0.256240	0.055260
0.002780	0.989610	-3.402250	3.096570	0.418270	-0.833670	0.216130	0.537220	-0.118900
0.002800	0.464620	-1.225920	2.694840	-1.114490	0.174530	-0.165610	0.852480	-0.287700
0.002820	0.927770	1.097050	0.678390	-1.809470	1.140790	-0.556910	0.934860	-0.300080
0.002840	1.577080	2.404650	-1.931620	-1.372070	1.689800	-0.960850	0.609530	-0.111340
0.002860	1.332700	2.184010	-3.741760	-0.168350	1.725990	-1.166570	0.042020	0.210800
0.002880	0.054310	1.191550	-3.601180	1.124310	1.221680	-0.928190	-0.434820	0.499110
0.002900	-1.851550	0.347440	-1.680320	1.788270	0.292970	-0.372010	-0.603510	0.530050
0.002920	-3.242290	-0.206790	0.879170	1.293950	-0.734180	0.317630	-0.428460	0.285450
0.002940	-2.991650	-0.425310	2.641120	-0.181210	-1.376900	1.078160	-0.209150	-0.076340
0.002960	-1.383710	-0.271560	2.745730	-1.804740	-1.225790	1.613210	-0.250460	-0.486180
0.002980	0.807830	-0.168400	1.961730	-2.642770	-0.428360	1.537240	-0.448090	-0.830730
0.003000	3.219530	-0.489260	1.160840	-2.100510	0.451420	0.981440	-0.629930	-0.846050
0.003020	4.525970	-1.158620	0.087980	-0.557560	0.840130	0.148520	-0.667120	-0.438990
0.003040	3.157030	-1.729330	-0.902710	1.144240	0.673550	-0.870690	-0.346480	0.017700
0.003060	-0.189070	-1.415860	-1.334210	2.361880	0.070970	-1.533270	0.230330	0.127450
0.003080	-3.492040	0.327100	-1.467680	2.527990	-0.809490	-1.428590	0.621140	0.040780
0.003100	-4.778730	2.699090	-1.333520	1.778000	-1.339100	-0.698350	0.576850	-0.032890
0.003120	-3.056810	4.009560	-1.009840	0.617990	-1.146450	0.212850	0.084100	-0.072710
0.003140	0.141460	3.125520	-0.643580	-0.717350	-0.259060	0.808400	-0.798620	0.143140
0.003160	2.621820	0.248860	0.004450	-1.842490	1.029070	0.837830	-1.718330	0.635400
0.003180	3.318030	-3.025880	1.089370	-2.287850	1.863280	0.267680	-2.132370	1.033160
0.003200	1.842130	-4.696040	2.244880	-1.883740	1.697550	-0.417720	-1.732940	1.035520
0.003220	-0.598400	-3.704460	2.842770	-0.885410	0.709620	-0.750070	-0.596000	0.536300
0.003240	-1.921600	-0.637510	2.186290	0.374460	-0.606630	-0.677620	0.782080	-0.325980
0.003260	-1.483140	2.599370	0.058500	1.548900	-1.617050	0.030670	1.752080	-1.132050
0.003280	-0.094850	4.102800	-2.412160	2.085320	-1.898330	1.023070	1.759260	-1.413080
0.003300	1.108850	2.908940	-3.735960	1.902290	-1.438110	1.334990	0.838040	-1.040450
0.003320	1.147320	-0.010590	-3.244810	1.297080	-0.517290	0.760850	-0.209740	-0.178600
0.003340	-0.122720	-2.110050	-1.195560	0.361400	0.536580	-0.241300	-0.797560	0.920780
0.003360	-1.435760	-2.204350	1.313410	-0.710380	1.345570	-1.171610	-0.682690	1.733040
0.003380	-1.442850	-0.974100	2.979880	-1.582810	1.641250	-1.509610	0.199070	1.725230
0.003400	-0.179430	0.560780	2.772030	-2.036390	1.433340	-1.071980	1.131320	0.891920
0.003420	1.298880	1.260810	0.838590	-1.847660	0.764900	-0.271790	1.272690	-0.207610
0.003440	1.774250	0.643000	-1.109250	-0.867690	-0.089960	0.466570	0.568910	-0.928960
0.003460	0.836640	-0.465830	-1.741930	0.577900	-0.710660	0.976880	-0.538420	-1.002140
0.003480	-0.783700	-0.921350	-1.095620	1.886510	-1.092280	1.146800	-1.365330	-0.450690
0.003500	-1.963830	-0.314780	0.086370	2.419920	-1.310240	0.989290	-1.310690	0.295150
0.003520	-1.759860	0.786500	0.888430	1.665020	-1.222770	0.560300	-0.452250	0.588090
0.003540	-0.156760	1.357480	0.785450	0.026660	-0.727910	-0.023020	0.625630	0.310670
0.003560	1.620200	0.859120	0.049930	-1.473540	0.122640	-0.518310	1.357590	-0.278500
0.003580	2.361960	-0.307710	-0.516440	-2.156400	1.072640	-0.815980	1.441930	-0.855480
0.003600	1.741670	-1.286960	-0.432810	-1.669120	1.708770	-0.930440	0.978370	-0.909260
0.003620	0.104050	-1.407770	0.038190	-0.317510	1.618470	-0.870900	0.231410	-0.249120
0.003640	-1.587900	-0.559470	0.319790	0.954440	0.719410	-0.591620	-0.528630	0.675700
0.003660	-2.147960	0.740450	0.145450	1.512960	-0.610450	-0.031270	-0.982830	1.309760
0.003680	-1.333810	1.651810	-0.267720	1.305980	-1.770560	0.651610	-1.034540	1.378510
0.003700	0.106890	1.523280	-0.579220	0.573220	-2.127200	1.181160	-0.830630	0.887850
0.003720	1.317230	0.506510	-0.491100	-0.262500	-1.365080	1.332300	-0.528020	0.054240
0.003740	1.510790	-0.608610	0.071390	-0.796540	0.091020	0.909340	-0.196060	-0.755210
0.003760	0.566240	-1.203310	0.793350	-0.914010	1.361480	-0.001270	0.171120	-1.167680
0.003780	-0.507140	-1.057360	1.131050	-0.677490	1.847300	-0.996310	0.562540	-1.093320
0.003800	-0.986360	-0.336640	0.749880	-0.220920	1.388750	-1.656500	0.909420	-0.703280
0.003820	-0.864090	0.441280	-0.007470	0.220420	0.277610	-1.577350	1.120440	-0.185740
0.003840	-0.099960	0.817970	-0.630570	0.503170	-0.740240	-0.609150	1.066910	0.277810
0.003860	0.794770	0.609760	-0.975560	0.573460	-1.117490	0.718530	0.599810	0.598860
0.003880	1.024870	-0.056540	-0.919710	0.434580	-0.832460	1.617730	-0.242210	0.805650
0.003900	0.489900	-0.675690	-0.438710	0.141290	-0.161560	1.648810	-1.165200	0.850910
0.003920	-0.467070	-0.787160	0.149140	-0.150700	0.396320	0.804110	-1.710920	0.703230
0.003940	-1.148100	-0.345980	0.518010	-0.197980	0.485420	-0.373030	-1.436560	0.419100
0.003960	-0.921020	0.349340	0.564830	-0.082510	0.220810	-1.118920	-0.368800	-0.030420
0.003980	0.087700	0.757300	0.296760	-0.008390	-0.097290	-1.096100	0.929150	-0.634010
0.004000	1.104500	0.569990	-0.120580	0.020640	-0.245380	-0.486620	1.770930	-1.201730
0.004020	1.262290	-0.007270	-0.420530	-0.052850	-0.104900	0.228460	1.646850	-1.444860
0.004040	0.480970	-0.593420	-0.438140	-0.129500	0.167320	0.596320	0.631730	-1.083530
0.004060	-0.655150	-0.713770	-0.091360	-0.014630	0.280330	0.487450	-0.599850	-0.163610
0.004080	-1.390240	-0.191500	0.363190	0.168250	0.179850	0.118840	-1.336280	0.874980
0.004100	-0.993370	0.450000	0.469630	0.197100	-0.045990	-0.166510	-1.263500	1.560940
0.004120	0.221650	0.652340	0.180080	-0.007440	-0.239800	-0.188400	-0.594140	1.556350
0.004140	1.231540	0.269030	-0.235710	-0.338560	-0.187260	-0.032690	0.165940	0.796650
0.004160	1.510070	-0.485570	-0.447660	-0.508670	0.098980	0.092680	0.576780	-0.320790
0.004180	0.796370	-0.987830	-0.256260	-0.351180	0.333750	0.060070	0.499560	-1.183170
0.004200	-0.429920	-0.749510	0.167660	0.039390	0.279990	-0.094720	0.171190	-1.384430
0.004220	-1.072510	0.084000	0.440370	0.456410	-0.058030	-0.194990	-0.074990	-0.915930
0.004240	-0.843840	0.927100	0.290770	0.618900	-0.490050	-0.088470	-0.110530	-0.124850
0.004260	-0.103770	1.169120	-0.209230	0.393920	-0.722600	0.194760	-0.026400	0.518290
0.004280	0.546610	0.621490	-0.657490	-0.033120	-0.537930	0.470410	-0.008790	0.724310
0.004300	0.533380	-0.277450	-0.611370	-0.399030	-0.027420	0.499440	-0.135090	0.533390
0.004320	0.062740	-0.846170	-0.016250	-0.512190	0.531440	0.201560	-0.290550	0.169760
0.004340	-0.374310	-0.728430	0.686290	-0.326300	0.834140	-0.266400	-0.306320	-0.159140
0.004360	-0.560050	-0.135490	0.983380	-0.032960	0.648630	-0.644040	-0.128120	-0.327360
0.004380	-0.245960	0.387030	0.680820	0.127280	0.096960	-0.692880	0.158320	-0.334000
0.004400	0.468670	0.435590	0.003500	0.141730	-0.427270	-0.368910	0.362500	-0.290820
0.004420	0.814880	0.031370	-0.582420	0.125640	-0.633350	0.144480	0.326010	-0.225140
0.004440	0.435620	-0.435500	-0.699690	0.107240	-0.460020	0.571660	0.086920	-0.061480
0.004460	-0.197720	-0.541620	-0.306350	0.101670	-0.060670	0.675040	-0.198620	0.142470
0.004480	-0.652610	-0.234650	0.225050	0.100480	0.266240	0.419680	-0.351080	0.272460
0.004500	-0.647400	0.229040	0.441980	0.037850	0.328730	-0.021690	-0.257020	0.300270
0.004520	-0.101340	0.505690	0.226560	-0.070370	0.170440	-0.402120	0.012960	0.177550
0.004540	0.461520	0.327540	-0.149970	-0.153470	-0.066610	-0.513180	0.315140	-0.080520
0.004560	0.611010	-0.176410	-0.332970	-0.134030	-0.205110	-0.303510	0.495650	-0.309120
0.004580	0.443510	-0.573640	-0.239510	0.014310	-0.141190	0.074620	0.416050	-0.373190
0.004600	-0.013520	-0.575370	0.017210	0.181060	0.020730	0.377150	0.138720	-0.255950
0.004620	-0.529360	-0.185900	0.248180	0.221630	0.129840	0.429720	-0.144390	-0.020790
0.004640	-0.562420	0.353080	0.243800	0.108360	0.119420	0.207890	-0.336480	0.213910
0.004660	-0.234910	0.664100	0.015760	-0.065070	-0.010890	-0.117330	-0.362830	0.326750
0.004680	-0.012840	0.529950	-0.240530	-0.192190	-0.136790	-0.296440	-0.163070	0.254510
0.004700	0.180680	0.078480	-0.337700	-0.205580	-0.089980	-0.267270	0.132360	0.034220
0.004720	0.346500	-0.404760	-0.162130	-0.127930	0.119580	-0.124640	0.334730	-0.218440
0.004740	0.224390	-0.630330	0.219760	-0.067630	0.321040	0.026010	0.357120	-0.385940
0.004760	0.081610	-0.509340	0.532970	-0.055160	0.374890	0.088480	0.198320	-0.397650
0.004780	0.069770	-0.228950	0.560190	-0.057910	0.199930	0.041350	-0.021660	-0.238750
0.004800	-0.016960	0.048850	0.338160	-0.075170	-0.138410	-0.009330	-0.169780	0.031420
0.004820	0.016890	0.203550	-0.030480	-0.046400	-0.402430	0.063250	-0.206800	0.274830
0.004840	0.135620	0.146140	-0.414020	0.084270	-0.447880	0.242670	-0.152200	0.360920
0.004860	-0.050410	0.001770	-0.578390	0.225600	-0.292350	0.390200	-0.085670	0.274320
0.004880	-0.327000	-0.035510	-0.468250	0.268620	-0.037110	0.376830	-0.084840	0.076000
0.004900	-0.387570	0.058910	-0.198410	0.193140	0.150000	0.138950	-0.125080	-0.140840
0.004920	-0.282960	0.165240	0.127210	0.024690	0.164770	-0.243390	-0.107240	-0.258240
0.004940	-0.059560	0.192820	0.350260	-0.157800	0.074650	-0.535550	0.009310	-0.246790
0.004960	0.298610	0.096090	0.379460	-0.273180	0.000480	-0.552360	0.154030	-0.169180
0.004980	0.607050	-0.146560	0.293220	-0.292200	0.002020	-0.323550	0.223660	-0.066040
0.005000	0.394930	-0.366410	0.142800	-0.210440	0.089130	-0.005570	0.129780	0.033290
0.005020	-0.107960	-0.351700	-0.012140	-0.053160	0.184890	0.231760	-0.109500	0.115030
0.005040	-0.331260	-0.097570	-0.042420	0.106550	0.161070	0.268800	-0.322180	0.206720
0.005060	-0.402110	0.253010	0.022260	0.209680	0.005120	0.149160	-0.360770	0.287940
0.005080	-0.265900	0.464650	0.053910	0.234760	-0.182700	0.008370	-0.208200	0.305210
0.005100	0.180290	0.370590	0.036940	0.149260	-0.291110	-0.064700	0.064550	0.240910
0.005120	0.445200	0.039920	-0.013270	-0.034750	-0.221170	-0.037520	0.293720	0.079060
0.005140	0.380030	-0.320490	-0.060290	-0.186990	0.006830	0.034870	0.345010	-0.127690
0.005160	0.100460	-0.465410	-0.014530	-0.213640	0.202480	0.061170	0.241490	-0.248830
0.005180	-0.310250	-0.271000	0.088630	-0.132870	0.240630	0.024540	0.085250	-0.209790
0.005200	-0.394070	0.086810	0.117570	0.020810	0.134800	-0.043710	-0.027370	-0.025800
0.005220	-0.197330	0.321740	0.048250	0.165750	-0.065610	-0.102520	-0.053710	0.176950
0.005240	-0.042670	0.308470	-0.092550	0.211930	-0.230900	-0.089420	-0.034290	0.246180
0.005260	0.291370	0.062150	-0.235660	0.181160	-0.238100	0.000230	-0.040350	0.178880
0.005280	0.367610	-0.241480	-0.224440	0.109240	-0.116880	0.079390	-0.085460	0.059710
0.005300	-0.057180	-0.343260	-0.033400	0.006260	0.055310	0.089660	-0.113150	-0.046640
0.005320	-0.174220	-0.180570	0.178140	-0.080890	0.210210	0.032160	-0.085960	-0.083450
0.005340	0.021130	0.078470	0.275010	-0.141290	0.271150	-0.066750	-0.025620	-0.037530
0.005360	0.051930	0.253180	0.202430	-0.188860	0.238160	-0.154640	0.060640	0.052390
0.005380	0.038170	0.235440	-0.004610	-0.172770	0.143910	-0.190280	0.136750	0.136860
0.005400	0.111960	0.024230	-0.183190	-0.071490	-0.001840	-0.137530	0.132860	0.176030
0.005420	0.129540	-0.204040	-0.211390	0.050180	-0.142830	0.013640	0.067700	0.150960
0.005440	0.021130	-0.228550	-0.137460	0.156720	-0.209160	0.174300	-0.000210	0.082910
0.005460	0.043120	-0.064090	-0.007570	0.198310	-0.199400	0.246370	-0.048270	0.021910
0.005480	0.200300	0.111090	0.140740	0.105070	-0.134540	0.202500	-0.057190	-0.001170
0.005500	0.224930	0.190760	0.145810	-0.035830	-0.031370	0.055920	-0.022330	0.007700
0.005520	0.221680	0.148680	0.012350	-0.118380	0.074940	-0.126860	0.019750	0.033440
0.005540	0.112720	0.047010	-0.067860	-0.137680	0.149520	-0.240110	0.027880	0.049750
0.005560	-0.235500	0.000090	-0.075600	-0.064590	0.167710	-0.243710	0.009100	0.035040
0.005580	-0.367980	0.063660	-0.049150	0.057920	0.118190	-0.157670	-0.018340	0.006140
0.005600	-0.216170	0.205700	0.001650	0.104780	0.030690	-0.018200	-0.051670	-0.021210
0.005620	-0.065760	0.297560	0.016350	0.053030	-0.052920	0.098180	-0.068190	-0.041050
0.005640	0.055660	0.217460	0.034590	-0.044200	-0.111630	0.124290	-0.062640	-0.029370
0.005660	0.062570	-0.005510	0.106900	-0.141440	-0.098670	0.075340	-0.056550	0.020490
0.005680	0.012270	-0.232280	0.178440	-0.170150	-0.006290	0.001110	-0.048480	0.066830
0.005700	-0.010200	-0.344950	0.218480	-0.104600	0.076150	-0.043410	-0.019920	0.069060
0.005720	-0.069110	-0.278570	0.218410	-0.015200	0.100310	-0.038510	0.033570	0.025640
0.005740	-0.110050	-0.057300	0.118510	0.061090	0.085140	-0.026190	0.090170	-0.046340
0.005760	-0.094130	0.174480	-0.072740	0.139900	-0.003380	-0.021180	0.135360	-0.121960
0.005780	-0.060500	0.276640	-0.247220	0.196570	-0.142040	0.000180	0.161220	-0.151890
0.005800	-0.017000	0.189190	-0.335450	0.195820	-0.193410	0.022780	0.128410	-0.100500
0.005820	0.102000	-0.022760	-0.301980	0.150750	-0.126650	0.031420	0.027690	0.014130
0.005840	0.192900	-0.177700	-0.145030	0.081500	-0.001690	0.040250	-0.095110	0.136130
0.005860	0.060800	-0.162700	0.021060	-0.003110	0.147750	0.039630	-0.181830	0.210950
0.005880	-0.211150	-0.022070	0.094210	-0.079420	0.232330	0.003640	-0.169230	0.204050
0.005900	-0.346890	0.132810	0.074940	-0.137990	0.175870	-0.048630	-0.045450	0.098480
0.005920	-0.234000	0.240200	-0.008370	-0.153770	0.051380	-0.076090	0.113000	-0.070800
0.005940	0.027530	0.248140	-0.091700	-0.083120	-0.048700	-0.075400	0.233000	-0.227380
0.005960	0.214260	0.098480	-0.076500	0.038410	-0.087270	-0.054210	0.264460	-0.312120
0.005980	0.230220	-0.110380	0.021410	0.113880	-0.061610	-0.009760	0.183340	-0.284810
0.006000	0.180830	-0.216100	0.117140	0.106160	-0.026380	0.036430	0.052550	-0.142020
0.006020	-0.004260	-0.167530	0.169790	0.033240	-0.011400	0.051480	-0.028030	0.040750
0.006040	-0.196070	-0.009650	0.131400	-0.073300	0.007690	0.041930	-0.022400	0.167980
0.006060	-0.037750	0.138080	-0.002160	-0.145750	0.031430	0.018390	0.035010	0.186710
0.006080	0.163520	0.161300	-0.141470	-0.130180	0.053720	-0.014940	0.087000	0.091080
0.006100	0.186080	0.049310	-0.224040	-0.046090	0.084440	-0.041500	0.084750	-0.057640
0.006120	0.169830	-0.105320	-0.237860	0.068680	0.082510	-0.046760	0.021340	-0.168340
0.006140	-0.031110	-0.168340	-0.173730	0.151540	0.003960	-0.018500	-0.052090	-0.202990
0.006160	-0.202110	-0.092790	-0.073650	0.152110	-0.099600	0.037100	-0.082430	-0.181570
0.006180	-0.141120	0.059530	-0.005340	0.091670	-0.180910	0.093350	-0.057700	-0.147960
0.006200	-0.126920	0.181700	0.023410	-0.001350	-0.217150	0.126560	0.000360	-0.139470
0.006220	-0.078010	0.181080	0.026960	-0.099900	-0.134210	0.118500	0.044760	-0.152310
0.006240	0.171210	0.048030	0.011170	-0.143620	0.046900	0.054640	0.042430	-0.152460
0.006260	0.227800	-0.124230	0.023460	-0.115740	0.177320	-0.045280	0.013400	-0.125410
0.006280	0.033270	-0.222280	0.067300	-0.052830	0.202250	-0.131760	-0.016590	-0.076040
0.006300	-0.039800	-0.184870	0.069680	0.038350	0.139060	-0.176070	-0.028850	-0.021760
0.006320	-0.101040	-0.027640	0.020360	0.127160	0.004760	-0.162670	0.007590	0.000670
0.006340	-0.082920	0.155400	-0.053130	0.129040	-0.094280	-0.075210	0.066850	-0.020830
0.006360	0.112760	0.240430	-0.133890	0.057280	-0.093620	0.049490	0.085360	-0.058530
0.006380	0.072790	0.179620	-0.167000	0.006890	-0.065230	0.137030	0.050610	-0.076420
0.006400	-0.059850	0.031020	-0.116680	-0.008240	-0.017440	0.163300	-0.013160	-0.062320
0.006420	-0.045700	-0.101650	-0.011780	-0.004760	0.061450	0.140510	-0.062560	-0.032650
0.006440	-0.049640	-0.167580	0.089110	0.013180	0.073870	0.076390	-0.040630	-0.013450
0.006460	-0.028090	-0.134910	0.132930	0.008550	0.001150	0.010440	0.048560	-0.030230
0.006480	-0.003360	0.011720	0.086560	-0.009040	-0.075580	-0.006140	0.141900	-0.094380
0.006500	-0.063190	0.145960	-0.014130	-0.006440	-0.133570	0.017190	0.200250	-0.168460
0.006520	-0.063380	0.152590	-0.083700	0.006380	-0.139560	0.038610	0.185110	-0.199180
0.006540	-0.018170	0.086120	-0.105470	0.022730	-0.063260	0.038780	0.067850	-0.172810
0.006560	-0.065980	-0.002590	-0.080770	0.032430	0.023750	0.007610	-0.075950	-0.088010
0.006580	-0.104800	-0.060470	-0.000930	0.020920	0.076810	-0.056500	-0.153680	0.024490
0.006600	-0.072340	-0.030560	0.050710	-0.014230	0.099980	-0.115680	-0.147700	0.086310
0.006620	-0.065470	0.027070	0.032670	-0.058420	0.066030	-0.130600	-0.065430	0.071770
0.006640	-0.008680	0.064700	0.012090	-0.074680	-0.004070	-0.093340	0.044470	0.002960
0.006660	0.099140	0.070230	-0.000540	-0.033910	-0.052420	-0.010870	0.106960	-0.095500
0.006680	0.086660	-0.008800	-0.018550	0.038470	-0.075370	0.082510	0.089350	-0.158710
0.006700	0.047000	-0.127520	-0.009380	0.073500	-0.072660	0.129560	0.004820	-0.146440
0.006720	0.040070	-0.168460	0.004710	0.051460	-0.038760	0.106280	-0.078700	-0.082320
0.006740	-0.109230	-0.101790	0.013880	0.018140	-0.031360	0.052930	-0.090090	-0.001090
0.006760	-0.228810	0.003670	0.035960	-0.017540	-0.064240	0.019210	-0.032930	0.054770
0.006780	-0.115960	0.065850	0.029110	-0.061170	-0.067760	0.004860	0.047350	0.049290
0.006800	-0.007300	0.065630	-0.005860	-0.073470	-0.041370	-0.002040	0.090040	-0.008660
0.006820	-0.022670	0.039690	-0.033590	-0.027690	-0.005890	-0.000080	0.055220	-0.076620
0.006840	0.100060	-0.012120	-0.076330	0.051980	0.060260	-0.001380	-0.027840	-0.114680
0.006860	0.263130	-0.073900	-0.115500	0.118440	0.113160	-0.027270	-0.096220	-0.097360
0.006880	0.072820	-0.074100	-0.098540	0.129250	0.086670	-0.060110	-0.099950	-0.030620
0.006900	-0.160560	-0.005460	-0.036950	0.083660	0.007910	-0.057090	-0.051510	0.047520
0.006920	-0.025880	0.053110	0.022130	0.023000	-0.058700	-0.011220	-0.009840	0.100820
0.006940	0.132330	0.035970	0.066920	-0.024170	-0.072490	0.044570	-0.001670	0.108950
0.006960	0.009650	-0.004790	0.078060	-0.041200	-0.025370	0.083180	-0.019120	0.084470
0.006980	-0.126170	-0.017390	0.044920	-0.022940	0.021720	0.083030	-0.035680	0.060540
0.007000	-0.116420	-0.054810	0.025900	0.005880	0.016910	0.030510	-0.018350	0.046580
0.007020	-0.105810	-0.097340	0.036670	0.014030	0.000250	-0.035590	0.014940	0.046460
0.007040	-0.067370	-0.061120	0.039850	0.000130	-0.015510	-0.071170	0.021560	0.057540
0.007060	-0.010840	0.017610	0.050650	-0.022260	-0.052580	-0.065010	0.002750	0.058730
0.007080	-0.016350	0.054280	0.042160	-0.038770	-0.058480	-0.012950	-0.034850	0.053970
0.007100	-0.080290	0.044920	-0.021760	-0.026180	-0.013190	0.058920	-0.090140	0.075170
0.007120	-0.155330	0.035320	-0.074870	0.014560	0.016320	0.094050	-0.137080	0.124400
0.007140	-0.120680	0.017450	-0.081510	0.051830	0.007690	0.064030	-0.153740	0.161240
0.007160	0.007410	-0.036740	-0.058030	0.065390	-0.023310	-0.007460	-0.143840	0.163990
0.007180	0.100830	-0.091540	0.020270	0.039070	-0.062500	-0.069280	-0.114200	0.132700
0.007200	0.144250	-0.092690	0.124940	-0.035100	-0.064240	-0.082670	-0.069880	0.082810
0.007220	0.192080	-0.047270	0.159910	-0.095380	-0.025610	-0.054040	-0.034840	0.059310
0.007240	0.146050	0.010570	0.113160	-0.089940	0.002560	-0.016850	-0.030420	0.069020
0.007260	-0.073970	0.072870	0.033570	-0.052770	0.023390	0.009970	-0.050400	0.086570
0.007280	-0.182100	0.113040	-0.042520	0.010260	0.030520	0.014020	-0.074970	0.113980
0.007300	-0.109960	0.105950	-0.063580	0.085190	-0.023070	-0.011550	-0.092920	0.146700
0.007320	-0.072980	0.065250	-0.025910	0.090570	-0.084650	-0.041370	-0.098900	0.160910
0.007340	0.000390	0.006180	0.019480	0.023950	-0.073990	-0.042490	-0.083710	0.151820
0.007360	0.033280	-0.042600	0.079280	-0.047270	-0.042760	-0.010280	-0.049570	0.131140
0.007380	0.009410	-0.068870	0.142260	-0.089120	-0.023260	0.032060	-0.011220	0.096580
0.007400	0.134980	-0.069250	0.127680	-0.082210	0.039800	0.045330	0.012060	0.048930
0.007420	0.155860	-0.043500	0.048380	-0.038670	0.094700	0.016590	0.012630	0.019290
0.007440	-0.007960	0.003830	-0.010640	0.017610	0.071750	-0.017440	-0.000940	0.028950
0.007460	-0.039770	0.040640	-0.036480	0.086650	0.032550	-0.027060	-0.015940	0.076960
0.007480	0.062730	0.034400	-0.037360	0.118830	-0.001580	-0.025430	-0.025530	0.149820
0.007500	0.067650	0.015880	-0.005970	0.073520	-0.055190	-0.005890	-0.029690	0.197400
0.007520	-0.088450	0.024480	0.036550	0.007800	-0.067590	0.040270	-0.031680	0.187790
0.007540	-0.062350	0.017680	0.070010	-0.035760	-0.016280	0.063570	-0.035350	0.133770
0.007560	0.144920	-0.024920	0.089740	-0.058350	0.047600	0.038750	-0.035650	0.048940
0.007580	0.099650	-0.049770	0.054440	-0.044970	0.086400	-0.002670	-0.021380	-0.016820
0.007600	-0.114400	-0.049310	-0.024090	-0.012520	0.073330	-0.052930	0.006370	-0.029440
0.007620	-0.209680	-0.047140	-0.055310	0.013700	0.030730	-0.096900	0.034700	-0.017320
0.007640	-0.120440	-0.050790	-0.039350	0.048450	-0.005600	-0.094320	0.040250	0.012110
0.007660	0.097050	-0.058220	-0.034150	0.086600	-0.039340	-0.042460	0.010900	0.042920
0.007680	0.171560	-0.046020	-0.023990	0.086150	-0.043930	0.027920	-0.026340	0.047150
0.007700	0.086170	-0.013330	-0.011770	0.049400	-0.011850	0.073810	-0.046840	0.035630
0.007720	0.090630	0.004290	-0.007310	0.000190	0.003000	0.071390	-0.055910	0.019590
0.007740	0.008710	0.004410	0.009290	-0.073620	0.015070	0.042130	-0.044270	0.003700
0.007760	-0.130860	-0.005130	0.028840	-0.136400	0.052390	0.009400	-0.014310	-0.010090
0.007780	-0.050280	-0.026700	0.054920	-0.129380	0.066800	-0.028230	-0.001320	-0.027300
0.007800	0.041680	-0.025470	0.072540	-0.078090	0.063420	-0.062050	-0.012170	-0.039410
0.007820	0.073100	0.013380	0.027310	-0.024780	0.083980	-0.054740	-0.023540	-0.048630
0.007840	0.106340	0.047530	-0.038940	0.029810	0.077810	-0.007950	-0.025710	-0.053010
0.007860	0.016390	0.060790	-0.061470	0.063250	0.006750	0.040770	-0.023280	-0.041330
0.007880	-0.133520	0.047040	-0.052720	0.063300	-0.064530	0.070690	-0.016030	-0.029430
0.007900	-0.129360	-0.004720	-0.024300	0.048690	-0.094880	0.073450	-0.005620	-0.022400
0.007920	0.020170	-0.052410	0.025360	0.008840	-0.091690	0.046500	-0.005860	-0.015530
0.007940	0.106370	-0.049370	0.059780	-0.039220	-0.042130	0.001550	-0.009060	-0.017200
0.007960	0.049180	-0.008600	0.062410	-0.061880	0.038650	-0.042310	0.006170	-0.022820
0.007980	-0.010660	0.026840	0.061360	-0.078480	0.094360	-0.065620	0.033890	-0.039460
0.008000	0.026950	0.050320	0.040850	-0.088560	0.109870	-0.063820	0.056860	-0.071130
0.008020	0.084780	0.058260	-0.003310	-0.063280	0.095110	-0.045370	0.053280	-0.087380
0.008040	0.081280	0.025360	0.001970	-0.041590	0.052550	-0.020170	0.011040	-0.075990
0.008060	0.050890	-0.002160	0.026790	-0.036840	0.010480	0.018080	-0.040140	-0.056210
0.008080	0.122430	-0.003300	-0.008400	0.006040	-0.017530	0.066020	-0.062050	-0.038440
0.008100	0.139630	-0.033850	-0.034780	0.061140	-0.040960	0.088730	-0.041180	-0.030860
0.008120	-0.009840	-0.063280	-0.014090	0.065740	-0.035830	0.066220	0.016770	-0.054970
0.008140	0.018520	-0.045100	-0.019330	0.042860	-0.004890	0.013660	0.090840	-0.104480
0.008160	0.078990	-0.033770	-0.030150	0.023990	0.011330	-0.037570	0.152420	-0.142090
0.008180	-0.058610	-0.049650	-0.016300	0.005600	0.025350	-0.066850	0.174090	-0.163740
0.008200	-0.099790	-0.057140	-0.025830	-0.005740	0.045370	-0.073720	0.153380	-0.164560
0.008220	-0.033520	-0.049090	-0.030370	-0.010630	0.034160	-0.043300	0.111060	-0.128720
0.008240	-0.014340	-0.025420	-0.001240	-0.003510	0.003870	0.018920	0.059440	-0.089430
0.008260	0.009830	0.009090	0.007660	0.019420	-0.007210	0.062050	0.016100	-0.069810
0.008280	0.027940	0.029660	0.006210	0.011770	-0.001360	0.077400	0.002150	-0.060320
0.008300	0.019120	0.031900	0.006200	-0.035040	0.017380	0.077610	0.006250	-0.079930
0.008320	0.087190	0.030870	-0.028430	-0.051110	0.042930	0.040400	0.015420	-0.128360
0.008340	0.119820	0.018240	-0.053720	-0.038180	0.048280	-0.012170	0.047170	-0.155880
0.008360	-0.013000	-0.011870	-0.033520	-0.040370	0.033640	-0.027770	0.093870	-0.147210
0.008380	-0.064120	-0.041350	-0.021480	-0.033610	0.007700	-0.013080	0.121890	-0.133340
0.008400	0.021240	-0.052700	-0.012080	-0.002170	-0.026490	0.003300	0.133010	-0.115760
0.008420	0.045090	-0.015160	0.019500	0.012680	-0.028510	0.023780	0.122100	-0.082190
0.008440	0.007570	0.030140	0.031530	-0.005170	-0.004040	0.045960	0.077140	-0.037130
0.008460	0.006240	0.023710	0.031490	-0.031270	-0.014470	0.052520	0.034340	0.011660
0.008480	0.103880	0.008380	0.034610	-0.045220	-0.029560	0.047400	0.010740	0.032170
0.008500	0.182040	0.005740	0.010620	-0.030990	-0.008540	0.036180	-0.012410	0.015020
0.008520	0.082570	-0.017470	-0.018940	-0.002390	0.002670	0.000130	-0.017250	-0.017040
0.008540	-0.039100	-0.030980	-0.035320	0.007800	-0.006720	-0.044160	0.008610	-0.062500
0.008560	-0.015930	-0.012000	-0.071180	0.012310	-0.015370	-0.052440	0.037350	-0.103140
0.008580	0.020810	0.005360	-0.100610	0.011740	-0.039290	-0.034480	0.054620	-0.105180
0.008600	-0.004590	0.011180	-0.085430	-0.015390	-0.054970	-0.011520	0.060130	-0.091940
0.008620	-0.057390	0.017290	-0.044720	-0.038070	-0.028170	0.016920	0.040530	-0.089940
0.008640	-0.093310	-0.001100	0.009930	-0.032220	-0.002930	0.038740	0.000440	-0.073630
0.008660	-0.099350	-0.034440	0.063180	-0.016550	0.001450	0.048210	-0.032960	-0.041270
0.008680	-0.103370	-0.034320	0.075790	-0.006530	0.018910	0.046130	-0.035850	-0.019330
0.008700	-0.080800	-0.015060	0.049670	-0.002380	0.025240	0.022380	-0.002560	-0.000330
0.008720	-0.073840	-0.005740	0.010090	0.010710	0.001830	-0.007180	0.037190	0.008180
0.008740	-0.024280	-0.001330	-0.026610	0.032290	-0.011410	-0.027290	0.050940	-0.005760
0.008760	0.071580	-0.010180	-0.033230	0.050330	-0.017350	-0.044150	0.039590	-0.017140
0.008780	0.092710	-0.025960	-0.014040	0.058130	-0.029580	-0.041700	0.011590	-0.021830
0.008800	0.130450	-0.023170	-0.015650	0.046600	-0.025070	-0.016360	-0.011020	-0.016260
0.008820	0.081740	-0.008260	-0.024800	0.029230	-0.012790	0.006200	-0.004670	0.010840
0.008840	-0.085410	0.005780	-0.016050	0.001000	-0.015490	0.029770	0.023110	0.039400
0.008860	-0.083710	0.009670	-0.021250	-0.043190	-0.016580	0.047050	0.044990	0.056050
0.008880	-0.017300	0.007600	-0.025160	-0.058690	-0.014150	0.029300	0.041870	0.063810
0.008900	-0.072350	0.019750	0.008850	-0.045490	-0.015510	-0.004510	0.021940	0.061110
0.008920	-0.049200	0.031110	0.052500	-0.031370	-0.003740	-0.021260	0.003800	0.059230
0.008940	0.015960	0.013990	0.090050	-0.004380	0.001110	-0.017830	-0.015910	0.077070
0.008960	-0.044770	-0.012900	0.092350	0.025210	-0.022910	-0.001510	-0.034840	0.108750
0.008980	-0.070050	-0.016790	0.024830	0.027730	-0.036090	0.005270	-0.032150	0.130620
0.009000	-0.022160	0.002580	-0.045990	0.015580	-0.040900	-0.015410	-0.021790	0.144550
0.009020	-0.044530	0.024710	-0.044270	0.024280	-0.050440	-0.036500	-0.031190	0.154040
0.009040	-0.041360	0.039740	-0.015890	0.049690	-0.026190	-0.041100	-0.036150	0.148040
0.009060	0.036160	0.030990	-0.012740	0.052700	0.009820	-0.049010	-0.016520	0.133990
0.009080	0.025420	0.002010	-0.008300	0.021040	0.007360	-0.050340	0.000390	0.119190
0.009100	-0.029200	-0.015220	0.010640	-0.021810	-0.005180	-0.034000	0.009880	0.099400
0.009120	-0.008360	-0.028320	0.011760	-0.046020	-0.009330	-0.016430	0.021800	0.088620
0.009140	-0.019200	-0.043380	0.006420	-0.036670	-0.024740	-0.001450	0.011350	0.087480
0.009160	-0.023490	-0.024760	0.011920	-0.006510	-0.033290	0.012740	-0.019930	0.091730
0.009180	0.020750	0.010040	0.006810	0.020270	-0.036040	0.021100	-0.048320	0.114240
0.009200	-0.022600	0.023000	0.008250	0.035910	-0.060640	0.023370	-0.067350	0.122690
0.009220	-0.034820	0.028170	0.018400	0.038630	-0.062360	0.015020	-0.059960	0.088220
0.009240	0.027730	0.016990	0.013260	0.026140	-0.019950	-0.006700	-0.032740	0.055170
0.009260	0.040560	-0.016400	0.017660	0.019090	0.010190	-0.033350	-0.016080	0.048090
0.009280	0.020390	-0.023110	0.021580	0.019160	0.032970	-0.058930	-0.009780	0.049090
0.009300	-0.062220	0.008670	-0.010370	0.026130	0.065900	-0.084270	-0.000850	0.064600
0.009320	-0.132660	0.045690	-0.036090	0.039740	0.064770	-0.094100	0.010920	0.095190
0.009340	-0.132020	0.050650	-0.026860	0.030910	0.036040	-0.064330	0.018970	0.110540
0.009360	-0.093340	0.019520	-0.006420	0.020610	0.008830	-0.017250	0.012900	0.108080
0.009380	0.032580	-0.007900	0.017720	0.033880	-0.032120	0.013980	-0.003360	0.118980
0.009400	0.094060	-0.008480	0.051410	0.027310	-0.056730	0.034500	-0.013810	0.134970
0.009420	0.079690	-0.000370	0.067920	0.002220	-0.026870	0.038350	-0.017400	0.131060
0.009440	0.076780	-0.012880	0.058700	-0.008480	-0.001540	0.013610	-0.013880	0.111710
0.009460	-0.062480	-0.013450	0.048400	-0.015630	-0.013500	-0.011550	-0.002890	0.090300
0.009480	-0.173630	0.028570	0.032860	-0.012810	-0.011700	-0.026640	-0.001490	0.066780
0.009500	-0.100230	0.051290	0.004800	0.011410	0.007300	-0.046890	0.002930	0.043470
0.009520	-0.038630	0.052830	-0.018950	0.026750	0.021470	-0.047360	0.019440	0.036860
0.009540	0.034560	0.058560	-0.033180	0.030690	0.030710	-0.016710	0.012840	0.051760
0.009560	0.115470	0.028050	-0.041820	0.043870	0.017040	0.000580	-0.025340	0.076640
0.009580	0.038420	-0.016160	-0.034260	0.045650	0.003710	-0.002620	-0.057180	0.094340
0.009600	-0.035490	-0.021740	-0.006840	0.025190	0.019110	0.000160	-0.067070	0.085690
0.009620	0.019890	-0.026960	0.023120	0.015750	0.014700	-0.001560	-0.069160	0.052880
0.009640	-0.015360	-0.037170	0.055850	0.010860	-0.003430	-0.009790	-0.062500	0.014290
0.009660	-0.049570	-0.008880	0.073460	-0.012620	0.016850	-0.003640	-0.048870	-0.018500
0.009680	0.029800	0.018450	0.052820	-0.034300	0.038200	0.006070	-0.037470	-0.037810
0.009700	0.033350	0.024050	0.014090	-0.036780	0.027160	0.006120	-0.026510	-0.059340
0.009720	0.011040	0.033670	-0.016030	-0.016630	0.013770	0.006310	-0.022670	-0.092930
0.009740	-0.007100	0.038720	-0.019560	0.011360	-0.004710	0.011070	-0.026870	-0.119350
0.009760	-0.055170	0.038130	-0.004760	0.019170	-0.020280	0.010740	-0.028830	-0.126490
0.009780	-0.020480	0.028790	-0.013840	0.015850	-0.007920	0.005580	-0.034620	-0.118710
0.009800	0.075650	0.010560	-0.034650	0.009520	0.005320	0.013580	-0.040180	-0.107890
0.009820	0.112960	-0.006210	-0.019640	-0.018560	0.015720	0.028320	-0.032250	-0.097180
0.009840	0.064000	-0.017460	-0.008050	-0.028220	0.038200	0.022990	-0.021340	-0.084500
0.009860	0.042630	-0.013320	-0.013700	0.005100	0.038180	0.007630	-0.022900	-0.085480
0.009880	0.047040	-0.001770	0.014650	0.024510	0.014830	-0.000950	-0.032270	-0.097180
0.009900	-0.068020	0.008830	0.020110	0.024870	0.014760	-0.004370	-0.031650	-0.103890
0.009920	-0.101980	0.017500	-0.010680	0.034760	0.020890	0.003180	-0.019700	-0.110040
0.009940	0.048370	0.020450	-0.001440	0.021390	0.002130	0.019210	-0.011780	-0.113040
0.009960	0.107370	0.019930	-0.003060	-0.012630	0.001620	0.028580	-0.008940	-0.098230
0.009980	0.119800	0.003520	-0.045060	-0.019020	0.023060	0.026410	0.000980	-0.075150
0.010000	0.111260	-0.017110	-0.048060	-0.012790	0.029840	0.020460	0.006100	-0.065980
0.010020	-0.020650	-0.019080	-0.021390	-0.010320	0.041860	0.012880	0.005370	-0.064020
0.010040	-0.077580	-0.021120	-0.015250	-0.001830	0.052530	0.006780	0.023730	-0.057330
0.010060	-0.061020	-0.038460	-0.020940	-0.005680	0.021430	0.012630	0.050210	-0.054590
0.010080	-0.007760	-0.045000	-0.039630	-0.005550	-0.015070	0.031030	0.057540	-0.063180
0.010100	0.114260	-0.032170	-0.072290	0.010980	-0.017030	0.039330	0.053610	-0.069220
0.010120	0.014350	-0.028330	-0.067750	0.008110	-0.013930	0.027260	0.044760	-0.057320
0.010140	-0.135460	-0.022410	-0.024360	-0.004530	-0.010040	0.018080	0.024930	-0.029590
0.010160	-0.004510	-0.014660	0.002950	0.001670	-0.001800	0.010820	0.005000	-0.006390
0.010180	0.043810	-0.016170	0.018840	0.002600	-0.014040	-0.002390	0.007750	-0.006390
0.010200	-0.082740	-0.004160	0.035230	-0.016980	-0.019660	-0.000560	0.020670	-0.015020
0.010220	-0.029420	0.008140	0.011820	-0.040270	-0.005000	0.010110	0.024910	-0.010620