0.000000	0.040940	-0.008100	0.042040	-0.074990	0.113140	0.086880	-0.042320	-0.000950
0.000020	0.027910	0.001190	0.047540	-0.055850	0.075420	0.075130	-0.032500	0.009710
0.000040	-0.030690	-0.010200	0.077240	0.053380	-0.090670	-0.015320	0.040190	0.075810
0.000060	-0.125570	-0.066690	0.101090	0.223750	-0.321130	-0.167450	0.147150	0.172930
0.000080	-0.172570	-0.151380	0.076040	0.270670	-0.353760	-0.222170	0.156050	0.187370
0.000100	-0.145340	-0.167240	0.063970	0.175340	-0.246080	-0.151710	0.086940	0.130120
0.000120	-0.091440	-0.087320	0.091580	0.130510	-0.229850	-0.112010	0.072020	0.111210
0.000140	-0.043180	-0.053270	0.081320	0.166520	-0.211140	-0.114800	0.064890	0.115030
0.000160	-0.040340	-0.079400	0.057470	0.150230	-0.167690	-0.087290	0.027410	0.102360
0.000180	-0.039310	-0.045010	0.042470	0.082800	-0.156970	-0.060960	0.007160	0.088710
0.000200	-0.002820	-0.051160	0.002080	0.093970	-0.111620	-0.069450	-0.011140	0.078000
0.000220	-0.023490	-0.101930	-0.002570	0.135140	-0.099730	-0.079510	-0.016500	0.068800
0.000240	-0.045940	-0.004600	0.030020	0.094440	-0.111770	-0.061710	-0.011790	0.044740
0.000260	-0.005050	0.068700	0.028630	0.052000	-0.065080	-0.047060	-0.026820	0.017980
0.000280	-0.001030	-0.010100	0.005150	0.029720	-0.050240	-0.045590	-0.031670	0.016980
0.000300	0.004610	-0.014320	-0.023650	-0.014740	-0.048060	-0.038110	-0.032300	0.024680
0.000320	0.034500	-0.004750	-0.056840	0.001220	0.007700	-0.040590	-0.052920	0.035100
0.000340	0.010040	-0.068430	-0.037230	0.045680	0.011560	-0.049700	-0.048320	0.046880
0.000360	0.003100	-0.001020	0.023330	0.026910	-0.028840	-0.031560	-0.021370	0.041150
0.000380	0.029150	0.075430	0.025030	0.021740	-0.015040	-0.004040	-0.027980	0.025250
0.000400	0.000600	-0.000210	-0.013640	0.024890	-0.017340	-0.003270	-0.037160	0.015030
0.000420	-0.011560	-0.020220	-0.046080	-0.031060	-0.030940	-0.006450	-0.022560	0.003760
0.000440	0.023900	-0.006900	-0.082700	-0.037740	0.023870	-0.006760	-0.018510	-0.004440
0.000460	0.017980	-0.073050	-0.062620	0.018450	0.052970	-0.019810	-0.008780	-0.002810
0.000480	0.007270	-0.045900	0.004740	0.013120	0.032900	-0.022000	0.013450	-0.002970
0.000500	0.022710	0.028390	0.005840	-0.012400	0.059490	-0.020930	0.009300	-0.014020
0.000520	0.004680	-0.007190	-0.034730	-0.007690	0.069360	-0.031470	0.007030	-0.021810
0.000540	-0.004980	-0.011230	-0.063740	-0.043620	0.035770	-0.021300	0.012510	-0.028760
0.000560	0.020280	0.011640	-0.090530	-0.058110	0.049200	0.006390	-0.005370	-0.037440
0.000580	0.006250	-0.056940	-0.065300	0.005620	0.065860	0.016050	-0.002010	-0.025110
0.000600	0.006520	-0.066890	0.000270	0.014330	0.044550	0.016690	0.024180	-0.007070
0.000620	0.055610	0.006020	0.007090	-0.018210	0.063770	0.019460	0.016180	-0.017320
0.000640	0.023640	0.019790	-0.028340	-0.001650	0.073480	0.002330	0.004650	-0.039560
0.000660	-0.044450	0.034030	-0.044340	-0.028540	0.023070	-0.027390	0.028020	-0.047990
0.000680	-0.005540	0.037990	-0.073230	-0.059330	0.017610	-0.038790	0.044220	-0.055280
0.000700	0.021970	-0.054420	-0.093740	-0.013170	0.037460	-0.031050	0.047350	-0.060260
0.000720	-0.000200	-0.067160	-0.039340	-0.009890	0.008820	-0.012520	0.056300	-0.052090
0.000740	0.044620	0.028130	0.023950	-0.036870	0.030340	0.002370	0.035200	-0.046090
0.000760	0.036500	0.025070	0.031440	-0.011960	0.077500	-0.004290	0.004450	-0.033680
0.000780	-0.034420	0.019470	0.009000	-0.022630	0.044780	-0.003290	0.012820	-0.009380
0.000800	0.011090	0.074610	-0.035760	-0.038870	0.034750	0.009180	0.017980	0.000950
0.000820	0.058810	0.004590	-0.069110	0.013070	0.058150	-0.006310	0.013870	-0.000160
0.000840	0.005150	-0.040970	-0.031530	0.020040	0.024250	-0.018370	0.037820	-0.003310
0.000860	-0.004010	0.051400	0.026510	-0.016170	0.018090	0.002560	0.049050	-0.011430
0.000880	0.014310	0.020770	0.034180	-0.003110	0.050960	0.004590	0.035680	-0.014750
0.000900	-0.007070	-0.054190	0.009740	-0.011640	0.037190	-0.011160	0.038260	-0.018320
0.000920	-0.011680	0.008870	-0.038180	-0.033010	0.040820	-0.008680	0.043480	-0.033010
0.000940	-0.036950	0.009580	-0.078040	0.002600	0.058210	-0.016910	0.041080	-0.037830
0.000960	-0.066460	-0.036790	-0.037720	0.008130	0.017730	-0.021210	0.050960	-0.035290
0.000980	-0.004330	0.020030	0.006980	-0.014920	0.009510	0.017780	0.053750	-0.044450
0.001000	0.042940	0.014880	-0.020310	0.010970	0.037950	0.042450	0.042080	-0.048290
0.001020	-0.005160	-0.040000	-0.030490	-0.002280	0.019190	0.026020	0.039230	-0.045150
0.001040	-0.038740	-0.006520	-0.023490	-0.057250	0.022670	0.002450	0.028150	-0.057970
0.001060	-0.056390	0.001380	-0.040180	-0.033120	0.043290	-0.023900	0.018480	-0.067560
0.001080	-0.064920	-0.010630	-0.004440	-0.003230	-0.001470	-0.031490	0.047220	-0.050230
0.001100	0.000510	0.029260	0.041270	-0.035200	-0.025090	-0.002170	0.059510	-0.042400
0.001120	0.024280	0.010830	-0.006830	-0.013010	0.004230	0.011390	0.029390	-0.057410
0.001140	-0.097430	0.000270	-0.061520	0.017720	-0.006530	-0.012650	0.022670	-0.057700
0.001160	-0.224210	0.077780	-0.050810	-0.031280	-0.008570	-0.031660	0.030460	-0.043640
0.001180	-0.255740	0.033910	-0.012720	-0.032880	0.033800	-0.031940	0.023410	-0.031990
0.001200	-0.227660	-0.105600	0.029540	0.015820	0.010120	-0.021310	0.031630	-0.020570
0.001220	-0.093090	-0.102620	0.030380	0.008390	-0.034840	-0.001600	0.040490	-0.025230
0.001240	0.079020	-0.082970	-0.016700	0.007080	-0.002890	-0.000560	0.038110	-0.043080
0.001260	0.085800	-0.138730	-0.052810	0.000550	0.003250	-0.016630	0.045340	-0.042740
0.001280	0.055550	-0.103000	-0.083980	-0.060680	-0.017780	-0.019230	0.037850	-0.026070
0.001300	0.199660	-0.072450	-0.111410	-0.055490	0.008750	-0.024440	0.022590	-0.007600
0.001320	0.413710	-0.082560	-0.106830	0.004450	-0.003460	-0.039960	0.042680	-0.002690
0.001340	0.606760	0.105600	-0.122640	0.007100	-0.039180	-0.023860	0.068680	-0.022480
0.001360	0.699210	0.319680	-0.151960	-0.009510	-0.000300	-0.003880	0.066120	-0.036090
0.001380	0.539370	0.366500	-0.080080	-0.064000	0.014220	-0.017630	0.064760	-0.020440
0.001400	0.239450	0.445060	0.058170	-0.169110	-0.021510	-0.000090	0.060380	-0.007150
0.001420	-0.115490	0.493520	0.151570	-0.174470	-0.011580	0.045470	0.032030	-0.012990
0.001440	-0.595760	0.420310	0.255620	-0.088280	-0.036510	0.042010	0.034810	-0.018990
0.001460	-0.908140	0.388520	0.403570	-0.030230	-0.119700	0.012840	0.071990	-0.035190
0.001480	-0.844510	0.242260	0.479260	0.054170	-0.146250	-0.012730	0.060060	-0.059550
0.001500	-0.601530	-0.166840	0.441590	0.175540	-0.169380	-0.036910	0.030810	-0.048460
0.001520	-0.130900	-0.553670	0.322290	0.273980	-0.192840	-0.033390	0.027970	-0.032670
0.001540	0.508620	-0.694560	0.144790	0.361020	-0.093430	-0.062320	0.005990	-0.053590
0.001560	0.743480	-0.583670	-0.043840	0.392870	0.057310	-0.148530	-0.001360	-0.063540
0.001580	0.434140	-0.267580	-0.213240	0.298070	0.188860	-0.168610	0.006590	-0.054680
0.001600	0.024210	0.110780	-0.356070	0.149600	0.352150	-0.108300	-0.048060	-0.039100
0.001620	-0.317990	0.399710	-0.407500	0.035620	0.424210	-0.028440	-0.110330	-0.010500
0.001640	-0.594780	0.469840	-0.342180	-0.094430	0.332220	0.098320	-0.134930	-0.029000
0.001660	-0.527860	0.236520	-0.227020	-0.222490	0.224430	0.228590	-0.156780	-0.074470
0.001680	-0.048340	-0.062820	-0.043200	-0.259660	0.097480	0.298030	-0.110210	-0.066240
0.001700	0.472800	-0.194670	0.191650	-0.272890	-0.080300	0.337340	0.003270	-0.067900
0.001720	0.627820	-0.329700	0.254160	-0.297560	-0.168680	0.320920	0.096980	-0.107880
0.001740	0.145120	-0.347370	0.136200	-0.223850	-0.216360	0.220480	0.181890	-0.122010
0.001760	-0.758070	0.049620	0.052820	-0.075970	-0.307340	0.091260	0.237800	-0.099090
0.001780	-1.280680	0.387120	-0.085700	0.033250	-0.315730	-0.036290	0.224690	-0.008060
0.001800	-0.871360	0.143920	-0.261030	0.082070	-0.274370	-0.130540	0.194750	0.144980
0.001820	0.238960	-0.330430	-0.128760	0.116920	-0.229350	-0.166220	0.154150	0.261830
0.001840	1.296750	-0.614840	0.134890	0.161100	-0.075650	-0.202370	0.064500	0.316870
0.001860	1.706430	-0.646690	0.091920	0.095030	0.040670	-0.264220	-0.021300	0.324410
0.001880	1.486430	-0.231130	-0.149790	-0.084310	0.051500	-0.270080	-0.062920	0.269180
0.001900	0.702760	0.507800	-0.352960	-0.144080	0.142110	-0.192070	-0.103010	0.186610
0.001920	-0.516240	1.042490	-0.443220	-0.079320	0.176740	-0.094810	-0.175330	0.112110
0.001940	-1.367660	1.310010	-0.302670	-0.092730	0.047480	0.010060	-0.259720	0.042490
0.001960	-1.377070	1.152690	0.027630	-0.191430	-0.012850	0.154940	-0.292280	-0.019910
0.001980	-1.041950	0.178410	0.415040	-0.282040	-0.034220	0.260000	-0.256080	-0.085950
0.002000	-0.548500	-0.930990	0.847740	-0.316740	-0.166210	0.195600	-0.171630	-0.176470
0.002020	0.361330	-1.284570	1.120430	-0.197350	-0.250830	0.034790	-0.052150	-0.292430
0.002040	1.400520	-1.002320	0.903480	0.077540	-0.272830	-0.046470	0.078650	-0.378080
0.002060	1.709610	-0.356630	0.224680	0.379380	-0.346640	-0.083300	0.190860	-0.356850
0.002080	0.709560	0.351060	-0.548410	0.667920	-0.300110	-0.173260	0.163890	-0.254970
0.002100	-0.538220	0.541820	-0.976470	0.802650	-0.112260	-0.230880	-0.010670	-0.118000
0.002120	-0.571340	0.252460	-0.883540	0.585620	0.062700	-0.184030	-0.129350	0.080820
0.002140	-0.448770	0.005800	-0.391430	0.160930	0.353220	-0.153190	-0.194970	0.265650
0.002160	-1.342050	0.014440	0.299960	-0.242290	0.723070	-0.170100	-0.276730	0.284830
0.002180	-1.469030	0.200690	0.755480	-0.542870	0.784210	-0.116300	-0.225930	0.159130
0.002200	-0.406780	0.175070	0.628810	-0.534680	0.490660	0.061170	-0.087070	0.012230
0.002220	-0.114470	-0.029550	0.103910	-0.147870	0.104000	0.327400	-0.069190	-0.089270
0.002240	0.289460	0.060850	-0.464190	0.199790	-0.350080	0.559310	-0.121800	-0.126020
0.002260	2.115930	-0.463450	-0.761040	0.290030	-0.672020	0.631770	-0.133240	-0.104030
0.002280	3.056510	-2.019910	-0.419230	0.316960	-0.523000	0.516160	-0.070050	-0.026010
0.002300	1.654620	-2.302050	0.384700	0.192890	-0.076030	0.206330	0.139470	0.045330
0.002320	-0.433850	-0.496740	0.614290	-0.123720	0.329680	-0.223520	0.372730	0.011200
0.002340	-1.525810	1.535410	-0.155990	-0.302920	0.440990	-0.534860	0.417990	-0.064690
0.002360	-1.511920	3.155960	-1.131620	-0.262880	0.169150	-0.520400	0.321330	-0.040630
0.002380	-0.947340	3.954700	-1.512200	-0.214840	-0.162590	-0.211070	0.142340	0.105280
0.002400	0.207790	2.315950	-0.942530	-0.115230	-0.327320	0.225120	-0.138980	0.310820
0.002420	1.277380	-1.012770	0.190080	0.079700	-0.289260	0.542290	-0.379000	0.498530
0.002440	1.286850	-2.925380	1.359060	-0.132200	-0.047420	0.524730	-0.455460	0.563710
0.002460	0.347230	-3.019960	2.660410	-0.846700	0.108210	0.212900	-0.371150	0.422130
0.002480	-1.405560	-2.206070	2.974000	-1.078370	0.040120	-0.215150	-0.125840	0.123330
0.002500	-2.882890	0.132250	0.905740	-0.189930	-0.128730	-0.501140	0.130470	-0.188110
0.002520	-2.635840	2.603320	-1.716740	1.026910	-0.428180	-0.441680	0.205600	-0.396120
0.002540	-0.758130	2.998340	-2.517260	1.505050	-0.668460	-0.181970	0.137400	-0.427220
0.002560	2.108590	1.305390	-2.354560	1.477720	-0.531260	0.092610	0.029010	-0.270650
0.002580	4.126830	-1.453120	-1.746970	1.164920	-0.113820	0.290490	-0.073290	-0.042560
0.002600	3.528240	-3.491280	0.418340	-0.224200	0.505090	0.153020	-0.118900	0.093440
0.002620	1.312810	-3.430760	2.673720	-1.803570	1.373890	-0.312500	-0.099120	0.108950
0.002640	-1.060940	-0.971840	2.787640	-1.912360	1.849220	-0.595620	0.005030	0.045890
0.002660	-2.939070	2.605490	1.202830	-1.310270	1.182690	-0.304350	0.181140	-0.069560
0.002680	-3.589360	4.440060	-0.820360	-0.775880	-0.084430	0.402310	0.241980	-0.128080
0.002700	-2.980830	3.407360	-2.425140	0.478770	-1.068240	0.908980	0.125080	-0.069150
0.002720	-1.236830	0.410980	-2.629120	1.972790	-1.624550	0.886160	0.050450	0.028930
0.002740	1.232570	-2.862680	-0.789880	2.081000	-1.558640	0.675820	0.168830	0.091290
0.002760	2.591180	-4.315860	1.855900	0.840560	-0.836610	0.356040	0.459290	0.059270
0.002780	2.123370	-3.589600	3.020560	-0.262890	0.069370	-0.324370	0.769890	-0.089850
0.002800	1.317140	-1.667050	2.111260	-0.735160	0.848150	-1.063390	0.845920	-0.201250
0.002820	1.008820	0.872610	-0.165360	-1.161780	1.367910	-1.342270	0.551420	-0.063890
0.002840	0.833560	2.909880	-2.461600	-0.930020	1.328180	-1.020380	0.008460	0.264330
0.002860	0.269170	3.065870	-3.152740	0.432180	0.797470	-0.401690	-0.410760	0.548230
0.002880	-0.887910	1.631740	-2.266260	1.323650	0.438250	0.164250	-0.464630	0.646170
0.002900	-2.178270	0.073310	-0.737850	0.932450	0.150160	0.726980	-0.435090	0.478690
0.002920	-2.794480	-0.402850	1.103690	0.042950	-0.659430	1.126380	-0.598760	0.072930
0.002940	-2.050570	0.103100	2.397430	-0.845720	-1.281570	0.978530	-0.633570	-0.370300
0.002960	-0.360810	0.143470	2.173400	-1.442600	-1.049080	0.693280	-0.365610	-0.650680
0.002980	1.258970	-0.696560	1.082530	-1.441430	-0.460610	0.715970	-0.307570	-0.683000
0.003000	2.642210	-1.631400	0.203240	-0.666500	0.142450	0.346160	-0.378510	-0.459160
0.003020	3.304960	-2.358800	-0.246310	0.493760	0.471380	-0.697010	0.061490	-0.121130
0.003040	2.353910	-2.175940	-0.462950	1.188760	0.378840	-1.425480	0.552550	0.047140
0.003060	0.081620	-0.534100	-0.780080	1.247210	-0.025160	-1.324370	0.475090	-0.011810
0.003080	-2.403610	1.726120	-1.237060	1.070510	-0.676910	-0.735480	0.283430	-0.144240
0.003100	-3.667570	3.621320	-1.516570	0.773630	-0.947590	0.094360	-0.021920	-0.179060
0.003120	-2.786950	4.181310	-1.294010	0.201720	-0.459770	0.911290	-0.919440	0.142490
0.003140	-0.619420	2.570300	-0.449210	-0.655700	0.440930	1.201980	-1.708850	0.684390
0.003160	1.380150	-0.565470	0.761320	-1.466680	1.348980	0.663950	-1.511350	0.959420
0.003180	2.435610	-3.592550	1.960390	-1.730100	1.719810	-0.271200	-0.708450	0.884810
0.003200	2.048000	-4.829580	2.629770	-1.324680	1.377890	-0.940750	0.159570	0.430680
0.003220	0.536890	-3.364680	2.355870	-0.529460	0.445090	-1.092020	1.037220	-0.457830
0.003240	-0.899770	-0.351010	1.040340	0.498430	-1.009030	-0.481530	1.508810	-1.186400
0.003260	-1.520090	2.356260	-1.142710	1.524010	-2.218110	0.790160	1.082080	-1.194720
0.003280	-1.139180	3.706360	-3.080250	2.026560	-2.305190	1.682650	0.140110	-0.694930
0.003300	0.023790	2.891960	-3.389140	1.709300	-1.414260	1.429600	-0.499180	0.023590
0.003320	0.916700	0.463270	-1.962010	0.817430	0.017460	0.250510	-0.623250	0.848490
0.003340	0.694760	-1.586510	0.175250	-0.223030	1.615020	-1.217400	-0.278800	1.318830
0.003360	-0.213060	-2.105440	2.045150	-1.282160	2.543880	-2.095250	0.583870	1.048730
0.003380	-0.840370	-1.193250	2.940470	-2.048320	2.295230	-1.846310	1.365530	0.275910
0.003400	-0.660420	0.373590	2.176990	-1.974990	1.142670	-0.771860	1.241570	-0.473200
0.003420	0.112410	1.376790	0.200760	-1.147060	-0.285520	0.628820	0.241510	-0.797160
0.003440	0.694160	0.966110	-1.393130	0.062320	-1.235650	1.852470	-0.948940	-0.606000
0.003460	0.561070	-0.392870	-1.700710	1.367860	-1.579480	2.249750	-1.559950	-0.024900
0.003480	-0.010980	-1.271130	-0.981000	2.208220	-1.551040	1.618850	-1.189010	0.570050
0.003500	-0.448480	-0.912050	-0.029950	2.002570	-1.151470	0.334990	-0.142140	0.617130
0.003520	-0.472040	0.228020	0.450210	0.720220	-0.632110	-0.967100	0.940700	0.046200
0.003540	-0.073320	1.209630	0.308420	-0.746010	-0.018890	-1.625900	1.578570	-0.701600
0.003560	0.571780	1.174840	-0.054610	-1.507860	0.861410	-1.519550	1.512020	-1.200120
0.003580	0.902350	0.131920	-0.067930	-1.637710	1.583690	-0.984890	0.824520	-1.068150
0.003600	0.526730	-0.879190	0.339440	-1.272830	1.776690	-0.324190	-0.122590	-0.263910
0.003620	-0.231570	-1.097950	0.762440	-0.397320	1.315300	0.173990	-0.932500	0.704750
0.003640	-0.925530	-0.487570	0.754470	0.479120	0.176680	0.504720	-1.231850	1.320730
0.003660	-1.091550	0.731040	0.053860	0.933100	-1.108670	0.876360	-1.029090	1.340010
0.003680	-0.487350	1.645400	-0.997330	1.114670	-2.013710	1.176300	-0.674960	0.798810
0.003700	0.303680	1.313570	-1.522420	1.048190	-2.209570	1.200290	-0.299070	0.041420
0.003720	0.714360	0.081210	-0.996220	0.556880	-1.279170	0.832750	0.091660	-0.647440
0.003740	0.735790	-1.164130	0.249010	-0.167380	0.392000	-0.010310	0.431900	-1.065610
0.003760	0.392570	-1.697610	1.416960	-0.813740	1.714030	-1.096680	0.733200	-1.039030
0.003780	-0.125830	-1.059930	1.746410	-1.173800	2.142630	-1.987240	0.977840	-0.735200
0.003800	-0.450960	0.197820	0.960390	-1.010860	1.634990	-2.162000	0.999230	-0.357400
0.003820	-0.491750	1.089950	-0.334750	-0.355120	0.395970	-1.209770	0.640690	0.088030
0.003840	-0.306380	1.262780	-1.211460	0.426930	-0.899770	0.484450	-0.013710	0.527390
0.003860	0.080340	0.738100	-1.252440	0.917120	-1.559520	1.942960	-0.747010	0.890810
0.003880	0.380030	-0.150780	-0.536990	0.862920	-1.372140	2.432910	-1.360290	1.085840
0.003900	0.296550	-0.735310	0.430700	0.365880	-0.567920	1.704810	-1.527390	0.953000
0.003920	-0.019200	-0.722500	0.918250	-0.165170	0.333290	0.149630	-0.952240	0.508560
0.003940	-0.272630	-0.305990	0.723900	-0.385370	0.786570	-1.332470	0.192460	-0.112190
0.003960	-0.245800	0.268630	0.160910	-0.338680	0.624850	-1.944420	1.295860	-0.786020
0.003980	0.081250	0.602870	-0.471390	-0.186820	0.156310	-1.475190	1.774590	-1.258150
0.004000	0.446360	0.355190	-0.770030	0.023390	-0.232410	-0.363850	1.388530	-1.255960
0.004020	0.566350	-0.155690	-0.464600	0.111650	-0.306220	0.704250	0.322710	-0.750500
0.004040	0.240550	-0.394470	0.140470	0.060490	-0.016250	1.159290	-0.834760	0.079140
0.004060	-0.414110	-0.279710	0.581030	0.061290	0.304960	0.821660	-1.426330	0.878790
0.004080	-0.829790	0.073430	0.582690	0.033060	0.284790	0.114470	-1.210370	1.283310
0.004100	-0.629150	0.474790	0.116320	-0.055840	0.046690	-0.372270	-0.470140	1.150750
0.004120	0.020490	0.552810	-0.431290	-0.091720	-0.120460	-0.402100	0.327460	0.523240
0.004140	0.724830	0.130130	-0.585460	-0.138420	-0.151450	-0.113950	0.774400	-0.312260
0.004160	1.060420	-0.510310	-0.286340	-0.154710	-0.024590	0.151110	0.651460	-0.904020
0.004180	0.778180	-0.921470	0.250420	-0.017510	0.114230	0.142820	0.195030	-0.968180
0.004200	0.119060	-0.731080	0.713940	0.133810	0.017040	-0.053840	-0.169450	-0.547540
0.004220	-0.401440	0.047270	0.655440	0.184380	-0.227410	-0.179490	-0.284010	0.058650
0.004240	-0.533300	0.807020	-0.037680	0.202940	-0.433210	-0.090840	-0.170590	0.550450
0.004260	-0.350710	1.046600	-0.826330	0.148980	-0.501660	0.161820	-0.020870	0.730850
0.004280	-0.048410	0.764480	-1.072340	0.001090	-0.241970	0.354450	-0.076960	0.539620
0.004300	0.092990	0.070880	-0.573170	-0.089910	0.285770	0.265660	-0.247000	0.166180
0.004320	-0.052090	-0.625080	0.359470	-0.133660	0.695390	-0.052160	-0.279090	-0.163680
0.004340	-0.221010	-0.749880	1.083040	-0.227700	0.768670	-0.384850	-0.133530	-0.378950
0.004360	-0.141920	-0.391430	1.086820	-0.249200	0.505630	-0.546010	0.070440	-0.443250
0.004380	0.158850	-0.009580	0.405790	-0.113500	-0.017780	-0.391930	0.206740	-0.361490
0.004400	0.516520	0.182210	-0.456360	0.090220	-0.514570	0.035320	0.151710	-0.182700
0.004420	0.629670	0.039170	-0.937540	0.287040	-0.673840	0.453780	-0.078710	0.082850
0.004440	0.328200	-0.281280	-0.769990	0.375310	-0.507680	0.586850	-0.272940	0.380900
0.004460	-0.071530	-0.325590	-0.116920	0.262920	-0.151000	0.386050	-0.301190	0.562220
0.004480	-0.273550	-0.055670	0.538700	0.023140	0.232920	-0.010090	-0.170590	0.508170
0.004500	-0.290330	0.285970	0.710520	-0.237950	0.385150	-0.401000	0.085520	0.211500
0.004520	-0.107550	0.505950	0.309310	-0.409090	0.261440	-0.557680	0.322680	-0.202110
0.004540	0.152290	0.316870	-0.253650	-0.325630	0.055370	-0.373520	0.377410	-0.498800
0.004560	0.218490	-0.193620	-0.488300	-0.048080	-0.098290	0.039310	0.236120	-0.511690
0.004580	0.101440	-0.499770	-0.289500	0.189250	-0.110730	0.454740	-0.009320	-0.270670
0.004600	-0.050290	-0.437880	0.071140	0.309480	0.025450	0.608830	-0.240170	0.081100
0.004620	-0.141010	-0.161690	0.302880	0.296840	0.131480	0.411660	-0.351700	0.360280
0.004640	-0.049530	0.220050	0.258950	0.153880	0.093050	0.032470	-0.292780	0.399410
0.004660	0.103720	0.422010	-0.090710	0.031400	-0.008280	-0.318130	-0.079730	0.186000
0.004680	0.075740	0.243000	-0.471320	0.013200	-0.095430	-0.460960	0.204680	-0.109470
0.004700	-0.054550	-0.101660	-0.485080	-0.001200	-0.065380	-0.312450	0.398470	-0.299520
0.004720	-0.119040	-0.365520	-0.134540	-0.060100	0.154730	-0.027600	0.381600	-0.322370
0.004740	-0.098170	-0.406120	0.297910	-0.144740	0.362770	0.148830	0.205810	-0.199060
0.004760	0.053400	-0.165200	0.568770	-0.261860	0.334520	0.137130	-0.026940	0.008660
0.004780	0.261010	0.109580	0.517610	-0.307450	0.121340	0.022910	-0.225930	0.194770
0.004800	0.278630	0.138050	0.190980	-0.171720	-0.182950	-0.030710	-0.268750	0.296980
0.004820	0.112430	-0.022810	-0.218520	0.048000	-0.477840	0.120180	-0.168570	0.305100
0.004840	-0.006650	-0.190730	-0.498310	0.248880	-0.553670	0.380210	-0.076410	0.193990
0.004860	-0.094840	-0.250490	-0.449550	0.370190	-0.375480	0.481130	-0.050150	-0.013930
0.004880	-0.215580	-0.065950	-0.145410	0.302760	-0.093840	0.314100	-0.066830	-0.226730
0.004900	-0.208640	0.267090	0.112740	0.081930	0.201980	-0.053170	-0.088610	-0.347740
0.004920	-0.065970	0.378800	0.206480	-0.147400	0.369220	-0.473650	-0.024400	-0.339410
0.004940	0.071840	0.229190	0.154950	-0.289440	0.317970	-0.697820	0.111940	-0.252590
0.004960	0.194430	0.000090	0.011840	-0.263390	0.209510	-0.554350	0.164240	-0.147350
0.004980	0.254330	-0.310730	-0.064810	-0.087530	0.132240	-0.146310	0.082010	-0.035920
0.005000	0.164900	-0.494830	-0.022180	0.075030	0.028630	0.269670	-0.085460	0.079300
0.005020	0.015550	-0.330990	0.057010	0.131340	-0.056320	0.484870	-0.271560	0.175300
0.005040	-0.096400	-0.039880	0.144950	0.099000	-0.102660	0.421010	-0.340690	0.220910
0.005060	-0.140800	0.211710	0.170900	-0.011090	-0.157320	0.188060	-0.219670	0.181540
0.005080	-0.079710	0.374470	0.031200	-0.097110	-0.144860	-0.020650	0.015500	0.050540
0.005100	0.013480	0.265630	-0.165460	-0.058960	-0.058840	-0.119160	0.235710	-0.123430
0.005120	0.044220	-0.024280	-0.196920	0.032050	-0.004930	-0.117970	0.336020	-0.280310
0.005140	0.011220	-0.223630	-0.079680	0.100110	0.033480	-0.066350	0.280490	-0.346660
0.005160	-0.112720	-0.284630	0.058390	0.102860	0.053320	-0.028730	0.129500	-0.262750
0.005180	-0.250460	-0.169010	0.204810	0.002990	0.014720	-0.010450	-0.014800	-0.081760
0.005200	-0.225590	0.065210	0.258420	-0.097380	-0.001610	0.020640	-0.104050	0.075660
0.005220	-0.063420	0.167720	0.107900	-0.083040	0.022080	0.063220	-0.131330	0.125020
0.005240	0.111430	0.107740	-0.131360	0.006560	0.030020	0.100930	-0.101880	0.052670
0.005260	0.210100	-0.015370	-0.269520	0.102800	0.044070	0.118430	-0.070470	-0.083050
0.005280	0.123390	-0.198350	-0.208510	0.181660	0.049860	0.082010	-0.058580	-0.187970
0.005300	-0.097330	-0.287470	-0.009500	0.148700	0.000200	-0.006770	-0.015700	-0.196410
0.005320	-0.239300	-0.138880	0.171230	-0.024130	-0.034560	-0.098400	0.046340	-0.125200
0.005340	-0.232990	0.082310	0.257700	-0.179440	0.015350	-0.158670	0.076550	-0.027920
0.005360	-0.149820	0.219450	0.200480	-0.236670	0.075000	-0.162630	0.086980	0.051850
0.005380	-0.002600	0.235720	-0.003770	-0.199560	0.091280	-0.079820	0.070850	0.079250
0.005400	0.134630	0.049640	-0.176100	-0.045490	0.058500	0.043100	0.012780	0.074280
0.005420	0.134690	-0.201810	-0.167300	0.105230	-0.085130	0.130630	-0.038260	0.073790
0.005440	0.080860	-0.242250	-0.051590	0.155360	-0.244060	0.169170	-0.064380	0.071700
0.005460	0.054710	-0.127280	0.073020	0.155700	-0.259760	0.157350	-0.067440	0.050440
0.005480	-0.004710	0.012330	0.176710	0.059350	-0.178430	0.092790	-0.017450	0.003960
0.005500	-0.021770	0.217190	0.167440	-0.112100	-0.038840	-0.000060	0.047720	-0.057010
0.005520	0.003580	0.309600	0.013410	-0.175330	0.147720	-0.104500	0.066300	-0.104570
0.005540	-0.087020	0.184450	-0.127600	-0.121910	0.229440	-0.176860	0.054350	-0.119440
0.005560	-0.208220	0.100840	-0.142440	-0.050190	0.175310	-0.159250	0.036650	-0.106830
0.005580	-0.224170	0.089670	-0.093550	0.038760	0.079250	-0.079580	0.005030	-0.081230
0.005600	-0.191370	0.047400	-0.002070	0.083360	-0.062420	-0.005700	-0.035680	-0.050910
0.005620	-0.133250	0.093260	0.126580	0.024280	-0.175810	0.045890	-0.069530	-0.021880
0.005640	-0.044160	0.126300	0.172790	-0.040280	-0.152960	0.071480	-0.087440	-0.001040
0.005660	0.027240	-0.016410	0.134530	-0.081970	-0.068720	0.062250	-0.063520	0.017510
0.005680	0.072330	-0.162780	0.103260	-0.130280	0.022190	0.037770	-0.001750	0.036940
0.005700	0.085480	-0.220820	0.079380	-0.100900	0.107000	0.010390	0.046140	0.040790
0.005720	0.015380	-0.217650	0.089920	-0.002360	0.077600	-0.027370	0.082870	0.017830
0.005740	-0.087720	-0.057230	0.110450	0.047650	-0.038600	-0.050820	0.111070	-0.015640
0.005760	-0.135210	0.177160	0.028950	0.068570	-0.108920	-0.043650	0.096200	-0.039980
0.005780	-0.153120	0.265290	-0.093540	0.091250	-0.150080	-0.022770	0.066640	-0.051250
0.005800	-0.121300	0.231390	-0.152360	0.039030	-0.143770	0.012310	0.032300	-0.036880
0.005820	-0.000970	0.134540	-0.164180	-0.016330	-0.016280	0.042750	-0.040180	0.019290
0.005840	0.091640	-0.040330	-0.099040	0.009980	0.123610	0.036780	-0.100030	0.093040
0.005860	0.097370	-0.127670	0.051240	-0.002760	0.155100	0.003660	-0.104420	0.127870
0.005880	0.041980	-0.053020	0.166220	-0.055410	0.128090	-0.043970	-0.080410	0.102850
0.005900	-0.088330	0.047750	0.172000	-0.043470	0.054010	-0.083960	-0.012740	0.050290
0.005920	-0.189810	0.154370	0.073940	-0.036320	-0.052810	-0.063590	0.090450	-0.004210
0.005940	-0.143090	0.223570	-0.087070	-0.039980	-0.054530	-0.006450	0.152100	-0.041020
0.005960	-0.063990	0.124800	-0.180080	0.007490	0.026510	0.018510	0.149100	-0.028350
0.005980	-0.036020	-0.013260	-0.125030	0.024600	0.054040	0.013760	0.105700	0.029170
0.006000	0.004720	-0.043070	0.004070	0.001600	0.054940	-0.015100	0.052820	0.098610
0.006020	-0.000740	-0.069020	0.128970	-0.016260	0.029070	-0.071210	0.028460	0.166320
0.006040	-0.064390	-0.071620	0.194100	-0.075430	-0.055230	-0.090190	0.028290	0.197750
0.006060	-0.040680	0.008220	0.146420	-0.123180	-0.088990	-0.050110	0.021410	0.158400
0.006080	0.066640	0.029700	0.017120	-0.076060	-0.055420	0.003250	-0.002750	0.083730
0.006100	0.144220	0.034680	-0.087460	0.005900	-0.035220	0.067110	-0.052440	0.013480
0.006120	0.133600	0.103520	-0.129300	0.076660	-0.010220	0.115790	-0.124410	-0.035540
0.006140	-0.003280	0.096290	-0.143320	0.133180	-0.009240	0.081660	-0.156120	-0.037380
0.006160	-0.190320	0.086080	-0.113950	0.117180	-0.079720	0.013200	-0.110210	-0.017030
0.006180	-0.269610	0.173430	-0.055000	0.039320	-0.118760	-0.014610	-0.040220	-0.021760
0.006200	-0.216210	0.170110	-0.022930	-0.026250	-0.068780	-0.038130	0.023430	-0.043360
0.006220	-0.086210	0.036760	0.013750	-0.075160	0.026680	-0.073550	0.072600	-0.066410
0.006240	0.087260	-0.087610	0.068390	-0.105180	0.160020	-0.097000	0.043320	-0.075480
0.006260	0.176570	-0.183820	0.104040	-0.085310	0.257110	-0.122520	-0.041170	-0.035140
0.006280	0.095770	-0.191180	0.111940	-0.047110	0.212320	-0.134710	-0.077630	0.041600
0.006300	-0.025440	-0.046540	0.057330	-0.005900	0.075880	-0.096830	-0.080520	0.094740
0.006320	-0.106350	0.101540	-0.051650	0.074900	-0.060900	-0.019610	-0.078940	0.110610
0.006340	-0.142390	0.187300	-0.138740	0.137470	-0.170400	0.067000	-0.047580	0.103030
0.006360	-0.037710	0.261670	-0.172520	0.109950	-0.194070	0.135670	-0.032060	0.075890
0.006380	0.116480	0.190200	-0.155490	0.054670	-0.098120	0.137980	-0.046200	0.058530
0.006400	0.127330	-0.017600	-0.079080	-0.007320	0.034520	0.063540	-0.035610	0.075100
0.006420	0.089690	-0.134490	0.023070	-0.091750	0.133320	-0.029700	-0.006030	0.092550
0.006440	0.067860	-0.153810	0.085680	-0.122950	0.173770	-0.092340	0.038360	0.077630
0.006460	-0.035900	-0.097720	0.093750	-0.095840	0.111810	-0.098380	0.099830	0.040940
0.006480	-0.099830	0.092220	0.053490	-0.055230	-0.002320	-0.038110	0.117560	-0.007860
0.006500	-0.056080	0.217590	-0.043390	0.020030	-0.068750	0.038670	0.068070	-0.056150
0.006520	-0.027620	0.165110	-0.136030	0.088040	-0.101440	0.075110	-0.003180	-0.070610
0.006540	0.016400	0.090560	-0.153870	0.095090	-0.077200	0.064990	-0.083270	-0.045000
0.006560	0.076290	-0.026170	-0.104750	0.084490	0.025420	0.007340	-0.144670	-0.002260
0.006580	0.060100	-0.160220	-0.002660	0.059580	0.090680	-0.081920	-0.117620	0.033140
0.006600	0.025140	-0.085290	0.089460	-0.006110	0.093330	-0.133380	-0.023070	0.036860
0.006620	0.017830	0.075840	0.069900	-0.049060	0.086300	-0.116760	0.060430	0.016750
0.006640	0.006910	0.098390	-0.012340	-0.062690	0.036960	-0.058400	0.111160	-0.004420
0.006660	0.019950	0.066750	-0.080940	-0.076590	-0.006100	0.023270	0.095500	-0.022850
0.006680	0.063470	-0.005500	-0.144720	-0.028150	0.027480	0.085140	0.009130	-0.019290
0.006700	0.079900	-0.122390	-0.132970	0.061750	0.049370	0.095880	-0.055330	0.026150
0.006720	0.063560	-0.119790	-0.022210	0.085640	0.017150	0.073260	-0.054240	0.081960
0.006740	0.028420	-0.034980	0.049460	0.073340	-0.008770	0.025740	-0.023100	0.097100
0.006760	-0.052390	0.003530	0.047920	0.057180	-0.056800	-0.025730	0.032140	0.048880
0.006780	-0.112430	0.053030	0.031140	-0.017220	-0.097400	-0.040980	0.086670	-0.047580
0.006800	-0.038440	0.055770	-0.009250	-0.058240	-0.032010	-0.026210	0.086500	-0.159800
0.006820	0.079200	-0.069950	-0.040270	0.007340	0.065970	-0.018950	0.054760	-0.238450
0.006840	0.123570	-0.137770	-0.048950	0.053340	0.113660	-0.017120	0.024220	-0.244810
0.006860	0.131550	-0.077050	-0.084120	0.065250	0.145550	-0.006370	-0.020910	-0.177230
0.006880	0.086200	-0.025950	-0.094000	0.097220	0.109810	-0.002430	-0.047180	-0.053450
0.006900	-0.014680	0.026470	-0.058490	0.062290	0.003320	0.000050	-0.030640	0.069670
0.006920	-0.057530	0.065300	-0.061060	-0.003200	-0.036670	0.015350	-0.018290	0.136570
0.006940	-0.054450	-0.007120	-0.060900	-0.002530	-0.020820	0.033660	-0.019800	0.144470
0.006960	-0.031550	-0.067910	-0.007970	-0.001350	-0.006900	0.055010	-0.017950	0.102160
0.006980	0.072230	-0.053240	0.008490	-0.012990	0.065320	0.052370	-0.020860	0.031270
0.007000	0.147420	-0.098630	-0.015860	0.012630	0.114290	-0.003560	-0.005320	-0.028520
0.007020	0.106040	-0.123870	-0.012310	0.024960	0.043870	-0.054810	0.030330	-0.070060
0.007040	0.064020	-0.040620	0.001530	0.012450	-0.043510	-0.057640	0.037650	-0.102980
0.007060	0.016450	-0.020140	0.010750	0.010760	-0.097000	-0.027780	0.016750	-0.116030
0.007080	-0.053730	-0.024970	0.031150	-0.006750	-0.124420	0.041530	-0.019240	-0.102020
0.007100	-0.037990	0.055670	0.020050	-0.010440	-0.078540	0.118000	-0.079370	-0.067420
0.007120	0.004690	0.069100	-0.049520	0.025460	-0.006690	0.130580	-0.125460	-0.019620
0.007140	0.034760	0.022610	-0.115910	0.027730	0.011230	0.083120	-0.128790	0.015850
0.007160	0.118760	-0.002820	-0.133330	0.003050	0.019740	0.010440	-0.113960	0.016470
0.007180	0.162100	-0.088090	-0.085540	-0.000250	0.037270	-0.069720	-0.072870	-0.005340
0.007200	0.140750	-0.130140	0.047400	-0.014760	0.019870	-0.102870	-0.009700	-0.034410
0.007220	0.132160	-0.055080	0.151900	-0.037860	0.010050	-0.065130	0.010950	-0.072860
0.007240	0.071700	-0.035440	0.114950	-0.026650	0.027470	-0.016480	-0.008610	-0.099570
0.007260	-0.011260	-0.039770	0.010370	-0.012370	0.011540	0.019980	-0.018040	-0.088670
0.007280	0.002680	0.032010	-0.082870	-0.009380	-0.016570	0.059370	-0.042480	-0.054000
0.007300	0.037460	0.065730	-0.110710	0.037540	-0.037040	0.072830	-0.078710	-0.017250
0.007320	0.022440	0.045280	-0.028240	0.076360	-0.088150	0.050570	-0.064580	0.016520
0.007340	0.025200	0.027710	0.067630	0.030190	-0.101620	0.031550	-0.019290	0.034100
0.007360	0.047200	-0.031100	0.087590	-0.012490	-0.047100	0.018040	0.017970	0.023480
0.007380	0.045230	-0.083190	0.073500	-0.032460	-0.032320	0.003900	0.054390	-0.019480
0.007400	0.043930	-0.082930	0.036790	-0.078250	-0.025830	-0.001670	0.064940	-0.074010
0.007420	0.035550	-0.121450	-0.025160	-0.052800	0.037110	-0.016890	0.045570	-0.088100
0.007440	0.006480	-0.147060	-0.049110	0.028360	0.053280	-0.033300	0.037760	-0.046690
0.007460	0.037100	-0.050680	-0.023790	0.042860	0.018180	-0.019700	0.030420	0.018660
0.007480	0.073720	0.037170	0.003610	0.038490	-0.000670	0.001460	0.012390	0.082350
0.007500	-0.000260	0.029840	0.034820	0.032160	-0.053380	0.018470	0.013030	0.113050
0.007520	-0.051080	0.011610	0.059960	-0.015720	-0.090140	0.047090	0.022600	0.082970
0.007540	-0.011420	-0.027310	0.049940	-0.019530	-0.036960	0.067450	0.021450	0.022180
0.007560	-0.020290	-0.063050	0.046920	-0.001780	-0.003800	0.062290	0.028870	-0.025670
0.007580	-0.043340	-0.009230	0.080240	-0.045800	-0.010820	0.049750	0.046990	-0.059250
0.007600	-0.026570	-0.003890	0.104010	-0.047170	0.016170	0.023500	0.063730	-0.061230
0.007620	-0.038380	-0.102190	0.076700	0.007090	0.001110	-0.024370	0.079100	-0.008190
0.007640	-0.030140	-0.120210	0.018050	0.017400	-0.038350	-0.052290	0.073190	0.050640
0.007660	0.031760	-0.090940	-0.012830	0.037900	-0.017310	-0.034150	0.041380	0.082250
0.007680	0.078500	-0.107240	0.012340	0.075450	-0.025690	0.010480	0.011730	0.097610
0.007700	0.098000	-0.059080	0.025940	0.058840	-0.063270	0.065060	-0.007220	0.082650
0.007720	0.066570	0.003160	-0.016060	0.034120	-0.032720	0.090980	-0.017910	0.053000
0.007740	-0.016150	-0.012730	-0.020330	-0.000120	-0.001070	0.059160	-0.017020	0.035400
0.007760	-0.044570	0.005720	0.039190	-0.078480	-0.001450	0.006910	-0.021020	0.008200
0.007780	-0.000710	0.038390	0.076680	-0.104960	0.024810	-0.035150	-0.031940	-0.025000
0.007800	0.031530	0.004110	0.084060	-0.066450	0.031270	-0.055240	-0.018180	-0.032110
0.007820	0.054480	-0.002380	0.074450	-0.057210	-0.007840	-0.028080	-0.003090	-0.031610
0.007840	0.047160	0.023000	0.027910	-0.034470	-0.031090	0.025820	-0.027360	-0.041170
0.007860	-0.046220	0.000540	-0.013820	0.025530	-0.063840	0.064360	-0.049360	-0.026010
0.007880	-0.129570	-0.003670	-0.012690	0.026290	-0.122040	0.078710	-0.046470	0.013480
0.007900	-0.095450	0.001220	0.017320	0.012340	-0.123250	0.059550	-0.048400	0.043790
0.007920	-0.006480	-0.064680	0.060610	0.041400	-0.074660	0.010830	-0.038340	0.071620
0.007940	0.065050	-0.075890	0.087860	0.020190	-0.037450	-0.031250	-0.008190	0.086500
0.007960	0.105870	-0.003260	0.074240	-0.038430	0.016760	-0.051060	-0.001110	0.065190
0.007980	0.066400	0.005710	0.038800	-0.056470	0.055670	-0.066010	-0.009850	0.029770
0.008000	-0.039650	-0.000760	0.008760	-0.083810	0.028140	-0.071420	-0.012830	-0.001660
0.008020	-0.105720	0.031950	-0.000530	-0.109950	0.001620	-0.036320	-0.039860	-0.015990
0.008040	-0.124940	0.024010	0.019010	-0.076210	-0.025870	0.015530	-0.079130	0.004990
0.008060	-0.104510	0.039410	0.053450	-0.040060	-0.086160	0.043330	-0.088390	0.033730
0.008080	-0.017100	0.087980	0.059160	-0.012500	-0.090670	0.069700	-0.077770	0.032030
0.008100	0.038730	0.033960	0.031970	0.029620	-0.051700	0.085810	-0.044760	0.015490
0.008120	0.011890	-0.043080	0.016220	0.030960	-0.044730	0.061870	0.016730	0.004590
0.008140	-0.012720	-0.046370	0.029180	0.009650	-0.006510	0.019140	0.061980	-0.004020
0.008160	-0.028470	-0.081780	0.053870	0.012110	0.045100	-0.024750	0.083460	-0.007840
0.008180	-0.065030	-0.088940	0.083370	-0.011010	0.040250	-0.051920	0.099770	-0.003060
0.008200	-0.072780	0.004900	0.084000	-0.041490	0.041940	-0.047160	0.083370	0.014110
0.008220	-0.045320	0.041330	0.041760	-0.016130	0.055090	-0.038890	0.039890	0.050090
0.008240	-0.021290	0.032430	0.003210	0.000670	0.034050	-0.032860	0.008580	0.078850
0.008260	0.008150	0.060390	-0.021050	-0.010300	0.024860	-0.010450	-0.020340	0.068050
0.008280	0.011360	0.031810	-0.028420	0.013830	0.030680	0.008750	-0.034450	0.037810
0.008300	-0.030770	0.000050	0.001690	0.023570	0.013250	0.009390	-0.002270	0.017670
0.008320	-0.056710	0.052310	0.023900	-0.015560	0.015990	0.005660	0.028130	-0.012170
0.008340	-0.072310	0.057350	0.023150	-0.027660	0.035710	-0.002930	0.035860	-0.058030
0.008360	-0.103830	0.002180	0.034730	-0.027140	0.009550	-0.012100	0.060270	-0.083320
0.008380	-0.102360	-0.005880	0.025490	-0.048120	-0.002010	-0.014720	0.076800	-0.076250
0.008400	-0.072910	-0.013010	-0.002210	-0.021900	0.021550	-0.013180	0.065920	-0.046850
0.008420	-0.046270	-0.017640	0.003370	0.021470	-0.002870	0.004900	0.054100	-0.009230
0.008440	0.005010	0.039420	0.020380	0.005260	-0.023240	0.025430	0.027390	0.008890
0.008460	0.033600	0.061680	0.012370	-0.008460	0.010560	0.009660	-0.018640	0.008800
0.008480	-0.008700	0.026830	-0.001120	-0.014080	0.020580	-0.026940	-0.044180	-0.001530
0.008500	-0.047210	0.022240	-0.008240	-0.048460	0.028060	-0.046570	-0.051850	-0.029230
0.008520	-0.056160	-0.001810	-0.017100	-0.040950	0.067460	-0.056880	-0.065520	-0.047820
0.008540	-0.066360	-0.032180	-0.021150	-0.002040	0.063530	-0.063240	-0.065510	-0.048090
0.008560	-0.031140	0.039780	-0.029130	0.001710	0.030950	-0.042380	-0.053270	-0.048180
0.008580	0.002340	0.098140	-0.049690	0.005370	0.020080	-0.017090	-0.045980	-0.039290
0.008600	-0.060870	0.063280	-0.050640	0.009920	-0.008460	-0.007040	-0.028740	-0.016560
0.008620	-0.111420	0.046520	-0.031880	-0.013790	-0.027790	0.003630	-0.011310	-0.006720
0.008640	-0.076220	0.012180	-0.027500	-0.008120	-0.003680	0.006900	-0.009430	-0.015130
0.008660	-0.070810	-0.041120	-0.011440	0.011200	0.009140	-0.005110	0.003630	-0.022600
0.008680	-0.087550	0.023110	0.020080	-0.018450	0.019020	-0.013240	0.014380	-0.029710
0.008700	-0.040790	0.080540	0.007770	-0.029170	0.057700	-0.022370	-0.006730	-0.038220
0.008720	0.004770	0.032650	-0.030500	-0.013570	0.065770	-0.042170	-0.024180	-0.034160
0.008740	0.016030	0.039590	-0.045670	-0.028040	0.044660	-0.048500	-0.026640	-0.028720
0.008760	0.042930	0.068340	-0.053160	-0.007430	0.055930	-0.041480	-0.028310	-0.034420
0.008780	0.053750	0.019440	-0.047950	0.044420	0.054740	-0.036860	-0.011970	-0.030490
0.008800	0.029790	0.006950	-0.033730	0.039150	0.022380	-0.014730	-0.001000	-0.010520
0.008820	-0.002820	0.043600	-0.062150	0.025880	0.026610	0.010080	-0.013020	0.011100
0.008840	-0.051440	0.040660	-0.087920	0.025000	0.035920	0.003110	-0.003780	0.034960
0.008860	-0.082880	0.062180	-0.061600	-0.022990	0.023850	-0.016340	0.020440	0.051180
0.008880	-0.058230	0.099700	-0.040190	-0.035780	0.048120	-0.026050	0.031130	0.043900
0.008900	-0.017860	0.051270	-0.022160	0.020160	0.068030	-0.034830	0.049670	0.029850
0.008920	0.026780	0.005380	0.016920	0.022260	0.035390	-0.041480	0.068080	0.011650
0.008940	0.043670	0.021770	0.016820	0.000200	0.024600	-0.038690	0.052390	-0.017220
0.008960	-0.026040	0.027520	-0.023050	0.025810	0.023720	-0.028640	0.027650	-0.034080
0.008980	-0.073710	0.047440	-0.043190	0.017030	-0.015060	-0.014770	0.013930	-0.033190
0.009000	-0.011040	0.061380	-0.067590	0.000240	-0.015630	-0.009620	-0.010080	-0.021220
0.009020	0.024870	0.023630	-0.107220	0.035300	0.026270	-0.018210	-0.020520	0.007800
0.009040	0.004430	0.052590	-0.099040	0.029800	0.047320	-0.025880	0.004830	0.024660
0.009060	0.034460	0.112530	-0.057010	-0.011870	0.081020	-0.026650	0.025300	0.008020
0.009080	0.041870	0.049460	-0.036200	-0.016120	0.100290	-0.026100	0.032300	0.001060
0.009100	-0.025170	-0.006620	-0.033870	-0.028490	0.062960	-0.018400	0.045030	0.010730
0.009120	-0.054050	0.028220	-0.053840	-0.052520	0.041420	-0.007190	0.049280	0.002820
0.009140	-0.046050	0.009530	-0.069180	-0.021900	0.023950	-0.001160	0.041270	0.003940
0.009160	-0.041950	0.004780	-0.026210	0.022350	-0.030860	0.008880	0.032810	0.025410
0.009180	-0.000330	0.076930	0.017610	0.039330	-0.042750	0.014220	0.022110	0.024190
0.009200	0.017540	0.058160	0.000050	0.057670	-0.014960	-0.011840	0.021350	0.004460
0.009220	-0.015660	-0.005650	-0.031780	0.041220	-0.024670	-0.035580	0.030540	-0.010320
0.009240	-0.008940	-0.010150	-0.064680	0.005370	-0.026690	-0.032280	0.024870	-0.032160
0.009260	0.016720	-0.043740	-0.097410	0.020020	0.000030	-0.044160	0.028890	-0.051860
0.009280	0.011190	-0.051790	-0.078370	0.021260	0.005040	-0.050920	0.055820	-0.047340
0.009300	0.020150	0.022400	-0.053930	-0.013440	0.019550	-0.016800	0.051370	-0.023850
0.009320	0.030020	0.047900	-0.063410	0.001560	0.051160	0.008160	0.020420	0.014330
0.009340	0.019470	0.045320	-0.053490	0.019150	0.044390	0.014070	0.017570	0.052670
0.009360	0.043010	0.068090	-0.054340	-0.000250	0.021170	0.029560	0.022390	0.074240
0.009380	0.063200	0.021500	-0.074380	0.030750	0.007350	0.032700	0.015580	0.084500
0.009400	0.038800	-0.039750	-0.045410	0.064820	-0.022520	0.015400	0.028480	0.076060
0.009420	0.049440	-0.017800	-0.001500	0.032680	-0.036860	-0.000890	0.037820	0.045590
0.009440	0.075460	-0.009140	0.006690	0.028190	-0.016730	-0.016390	0.021060	0.011090
0.009460	0.034630	-0.028810	0.002800	0.029880	-0.016430	-0.029640	0.017540	-0.018960
0.009480	-0.000420	-0.003580	-0.018620	-0.013620	-0.020590	-0.030490	0.021270	-0.034050
0.009500	0.003350	-0.006940	-0.043370	0.003320	-0.005880	-0.023580	0.007430	-0.022260
0.009520	-0.020600	-0.023030	-0.033750	0.056480	-0.021330	-0.011530	-0.002530	0.004980
0.009540	-0.004430	0.040160	-0.028240	0.042260	-0.033320	0.004840	-0.011250	0.024280
0.009560	0.058520	0.058930	-0.047550	0.024810	-0.013480	0.013730	-0.034260	0.035300
0.009580	0.052850	0.008730	-0.047170	0.027850	-0.032310	0.021810	-0.045200	0.037560
0.009600	0.036310	0.023690	-0.034960	0.004290	-0.047850	0.027320	-0.035870	0.022350
0.009620	0.054430	0.001860	-0.030680	0.007070	-0.013630	0.016800	-0.032380	0.005050
0.009640	0.021570	-0.092540	-0.004250	0.018900	-0.012050	0.005400	-0.029600	-0.009200
0.009660	-0.003480	-0.054580	0.039120	-0.008160	-0.030270	0.004700	-0.020630	-0.028620
0.009680	0.026360	0.033520	0.053540	-0.001610	-0.022850	-0.001860	-0.019540	-0.035210
0.009700	0.022730	0.013070	0.029910	0.016970	-0.054090	-0.009970	-0.018330	-0.017650
0.009720	0.006240	0.003570	-0.011120	-0.007990	-0.088680	0.002060	-0.022480	0.005090
0.009740	0.019450	0.001740	-0.042350	-0.000550	-0.060100	0.017910	-0.037480	0.019320
0.009760	0.024210	-0.046550	-0.026540	0.035930	-0.045260	0.024470	-0.030790	0.027880
0.009780	0.033740	-0.019450	0.025010	0.030850	-0.053820	0.041290	-0.006580	0.033750
0.009800	0.044120	0.020070	0.039470	0.022040	-0.019940	0.042990	0.001760	0.028930
0.009820	0.023020	-0.029020	0.013460	0.013540	-0.003730	0.007980	0.012960	0.016270
0.009840	0.023380	-0.039610	-0.008180	-0.022690	-0.028430	-0.013280	0.030970	0.014000
0.009860	0.041360	-0.020320	-0.018060	-0.013180	-0.027020	-0.013510	0.032750	0.015450
0.009880	0.009210	-0.058910	-0.001960	0.042970	-0.029800	-0.020730	0.039900	0.013330
0.009900	-0.020880	-0.055920	0.035500	0.046080	-0.056900	-0.013120	0.054560	0.015160
0.009920	-0.008040	0.001870	0.043070	0.024520	-0.055940	0.017550	0.036800	0.019970
0.009940	-0.005180	0.013690	0.034150	0.026210	-0.054220	0.042900	0.009050	0.030960
0.009960	-0.008600	0.012800	0.042160	-0.001680	-0.061510	0.052440	0.008980	0.037400
0.009980	0.025450	-0.005830	0.033240	-0.014930	-0.026390	0.049390	0.013700	0.031990
0.010000	0.046230	-0.082000	0.026850	0.024590	0.005240	0.034700	0.022970	0.030570
0.010020	0.023220	-0.092320	0.053290	0.022320	-0.009770	0.017680	0.046790	0.019280
0.010040	0.019280	-0.034430	0.068680	-0.008510	0.003480	0.007740	0.055120	-0.007850
0.010060	0.008480	-0.043660	0.062760	0.005060	0.022810	-0.003100	0.047700	-0.024360
0.010080	-0.028110	-0.051620	0.040790	0.010310	-0.014080	-0.013190	0.035040	-0.025480
0.010100	-0.014070	-0.012070	-0.006030	0.013900	-0.025970	-0.004410	0.004590	-0.019830
0.010120	0.003630	-0.049630	-0.020590	0.055750	-0.015110	0.014900	-0.016800	-0.000740
0.010140	-0.015580	-0.077350	0.032400	0.063350	-0.039890	0.023500	-0.010440	0.019250
0.010160	0.009470	-0.006780	0.088170	0.035000	-0.032680	0.021760	-0.016500	0.014010
0.010180	0.026910	-0.004730	0.104880	0.014090	-0.001590	0.012170	-0.036300	-0.003580
0.010200	-0.004380	-0.045270	0.087790	-0.028120	-0.006230	0.007970	-0.035880	-0.020290
0.010220	0.006570	-0.020370	0.038460	-0.051690	0.019010	0.013450	-0.029910	-0.044730