0.000000	-0.016850	-0.141960	0.038850	-0.002060	-0.044320	0.064080	0.157290	0.062070
0.000020	-0.022220	-0.119810	0.045590	-0.001450	-0.034440	0.051790	0.123280	0.039250
0.000040	-0.049120	0.005270	0.043620	-0.025200	0.033600	-0.000260	-0.095160	-0.063330
0.000060	-0.070980	0.210590	0.022320	-0.074500	0.139450	-0.076840	-0.431940	-0.217220
0.000080	-0.041750	0.288650	0.001190	-0.092630	0.166070	-0.094530	-0.504240	-0.252340
0.000100	-0.005790	0.196230	0.013140	-0.056460	0.108380	-0.059200	-0.330240	-0.167020
0.000120	-0.033450	0.124020	0.023340	-0.041940	0.081170	-0.055260	-0.297430	-0.134160
0.000140	-0.088740	0.140420	-0.010350	-0.066570	0.093740	-0.063420	-0.330160	-0.141850
0.000160	-0.060070	0.151600	-0.041580	-0.057030	0.098210	-0.061780	-0.275020	-0.120980
0.000180	0.011560	0.126550	-0.026710	-0.018820	0.081250	-0.069540	-0.233030	-0.101350
0.000200	0.021140	0.155910	-0.009520	-0.001640	0.069320	-0.059190	-0.203940	-0.092020
0.000220	0.004380	0.169980	-0.013530	-0.001550	0.075900	-0.044100	-0.177070	-0.081190
0.000240	-0.015830	0.069530	-0.018020	-0.015070	0.043280	-0.043100	-0.159790	-0.060990
0.000260	-0.052720	0.042110	-0.030580	-0.031950	0.012000	-0.031780	-0.136000	-0.038570
0.000280	-0.048750	0.097100	-0.038820	-0.024650	0.041320	-0.024230	-0.115900	-0.019890
0.000300	0.022090	0.061660	-0.020570	-0.009120	0.043500	-0.025800	-0.093030	-0.006460
0.000320	0.086770	0.048680	-0.025220	-0.010040	0.019590	-0.017050	-0.071060	-0.007800
0.000340	0.060660	0.090040	-0.055550	0.006000	0.036340	-0.025030	-0.056640	-0.007900
0.000360	-0.037070	0.039680	-0.048630	0.023880	0.039010	-0.043430	-0.038600	-0.003890
0.000380	-0.089820	-0.012170	-0.040120	-0.001460	0.011840	-0.025180	-0.019840	-0.002280
0.000400	-0.035750	0.016770	-0.056130	-0.016280	0.007060	-0.004500	-0.010070	0.002680
0.000420	0.040070	0.009710	-0.039740	0.011380	0.000090	-0.017000	0.005200	0.005430
0.000440	0.050340	0.010940	-0.017680	0.020400	-0.001620	-0.021870	0.020780	0.000180
0.000460	0.014120	0.051190	-0.031010	0.010960	0.027670	-0.016850	0.022930	0.000900
0.000480	-0.028000	0.006990	-0.043720	0.017080	0.018630	-0.017320	0.028670	0.008690
0.000500	-0.024560	-0.042220	-0.049860	0.013140	-0.019450	-0.002870	0.040030	0.007040
0.000520	0.043170	-0.007440	-0.046870	0.004910	-0.011830	0.005630	0.045020	0.000990
0.000540	0.055360	-0.010290	-0.025830	0.010750	-0.001320	-0.002750	0.052030	0.008020
0.000560	-0.016440	-0.009550	-0.024330	0.012270	-0.008770	0.010740	0.058660	0.017310
0.000580	-0.022420	0.050570	-0.026400	0.012550	0.009250	0.026790	0.048060	0.019110
0.000600	0.008850	0.026660	-0.011310	0.010420	0.013100	0.007390	0.035810	0.022510
0.000620	-0.034990	-0.041620	-0.040360	-0.011580	-0.007770	-0.012450	0.048410	0.018500
0.000640	-0.050550	-0.020080	-0.078060	-0.019610	-0.009980	-0.014800	0.064430	0.005110
0.000660	0.007220	0.001660	-0.056000	0.004730	-0.019580	-0.017290	0.067000	0.006440
0.000680	0.025900	0.005940	-0.035110	0.014850	-0.033050	-0.003660	0.059410	0.017120
0.000700	0.047020	0.050040	-0.033240	0.009430	-0.004490	0.015690	0.043370	0.021320
0.000720	0.051240	0.024560	-0.008360	0.012570	0.010490	0.007620	0.042900	0.039690
0.000740	-0.037220	-0.049000	-0.007880	0.009240	-0.020560	0.003850	0.052210	0.063190
0.000760	-0.083450	-0.002490	-0.041920	0.009740	-0.018370	0.018080	0.038630	0.060960
0.000780	-0.049530	0.046610	-0.037580	0.017590	0.008380	0.018000	0.024580	0.049370
0.000800	0.032410	0.013040	-0.003690	0.012890	0.002320	0.021600	0.032610	0.046560
0.000820	0.184720	0.048120	-0.003330	0.011340	0.002670	0.023640	0.034740	0.041260
0.000840	0.217040	0.048950	-0.014710	0.015960	0.008610	-0.008670	0.017970	0.039800
0.000860	0.049110	-0.055670	-0.016690	-0.000400	-0.011050	-0.019860	0.008750	0.046720
0.000880	-0.097100	-0.068840	-0.016310	-0.020420	-0.011350	0.004930	0.012160	0.042670
0.000900	-0.095790	-0.026120	0.006320	0.004950	0.000310	0.012340	0.014830	0.027480
0.000920	-0.033370	-0.016500	0.020040	0.043970	-0.010830	0.013500	0.013520	0.019720
0.000940	-0.018780	0.035750	-0.012480	0.031530	0.000790	0.017060	0.001060	0.014870
0.000960	-0.037450	0.056810	-0.031320	0.001290	0.023290	0.006450	-0.013680	0.003180
0.000980	0.011350	-0.029460	-0.021290	-0.019170	0.004590	0.008830	-0.022840	-0.002110
0.001000	0.082950	-0.089630	-0.022080	-0.036070	-0.012530	0.022500	-0.037760	-0.002190
0.001020	0.062760	-0.060630	-0.007140	-0.010390	-0.017950	0.021630	-0.032280	-0.006620
0.001040	0.009110	-0.011180	0.005700	0.022670	-0.042040	0.021660	-0.005610	-0.007860
0.001060	0.022850	0.057160	-0.020700	0.004850	-0.029950	0.015930	0.001530	-0.004950
0.001080	0.027850	0.081910	-0.007900	-0.016280	0.012560	-0.012100	-0.009600	0.009480
0.001100	-0.028730	-0.021430	0.026180	-0.024310	-0.005290	-0.015840	-0.020370	0.029100
0.001120	-0.086800	-0.072090	-0.013330	-0.019830	-0.042230	0.008770	-0.028290	0.029890
0.001140	-0.146440	-0.002480	-0.044810	0.004340	-0.037310	0.005970	-0.023180	0.017600
0.001160	-0.186420	-0.008400	-0.008460	0.001080	-0.025790	-0.008620	-0.004140	0.015080
0.001180	-0.236650	-0.023170	0.023600	-0.016750	-0.011530	-0.003650	0.004070	0.028000
0.001200	-0.350730	-0.016570	0.045060	-0.015380	-0.006790	-0.007040	-0.012350	0.040910
0.001220	-0.288510	-0.149700	0.053720	-0.011930	-0.045910	-0.006830	-0.027400	0.043740
0.001240	0.023070	-0.248380	-0.001620	-0.005150	-0.063430	-0.002910	-0.020070	0.039320
0.001260	0.227990	-0.195050	-0.062210	0.000790	-0.023860	-0.035920	0.003290	0.026990
0.001280	0.217270	-0.170700	-0.047540	-0.014720	-0.005620	-0.058930	0.025210	0.018490
0.001300	0.264630	-0.110580	-0.048920	-0.036800	-0.008340	-0.020110	0.018990	0.030170
0.001320	0.511080	0.039070	-0.114550	-0.018980	0.001800	0.024650	-0.017110	0.049510
0.001340	0.704020	0.143750	-0.132640	0.016180	-0.024490	0.035210	-0.031780	0.053730
0.001360	0.613150	0.265060	-0.128160	-0.005960	-0.039320	0.025780	-0.004150	0.042200
0.001380	0.429050	0.430380	-0.105920	-0.080870	0.010500	-0.009430	0.018410	0.028520
0.001400	0.315550	0.474570	0.049430	-0.162400	0.028360	-0.022940	0.013310	0.035260
0.001420	0.063640	0.440590	0.211800	-0.212960	0.007970	0.031100	-0.017520	0.050570
0.001440	-0.437860	0.419130	0.277250	-0.168140	-0.017050	0.058030	-0.058060	0.036890
0.001460	-0.856550	0.274120	0.369770	-0.056350	-0.104090	0.032860	-0.041090	0.008620
0.001480	-0.903320	0.018580	0.448810	0.056300	-0.182070	0.030230	0.016190	-0.016710
0.001500	-0.661460	-0.213860	0.428570	0.206940	-0.195090	0.002800	0.014340	-0.025750
0.001520	-0.260110	-0.470860	0.347640	0.351040	-0.193500	-0.039070	-0.021810	0.000040
0.001540	0.234350	-0.635440	0.210750	0.378700	-0.096140	-0.054370	-0.034650	0.018900
0.001560	0.617570	-0.518260	0.039670	0.363580	0.102230	-0.137860	-0.036030	0.004010
0.001580	0.617340	-0.277210	-0.164720	0.358780	0.223900	-0.216230	-0.010200	-0.018880
0.001600	0.275760	-0.050630	-0.389220	0.228260	0.286670	-0.149010	-0.012300	-0.022320
0.001620	-0.050300	0.197520	-0.453970	0.016730	0.357440	-0.036790	-0.104870	0.018910
0.001640	-0.376780	0.334180	-0.333670	-0.102570	0.339090	0.073570	-0.172350	0.045250
0.001660	-0.705010	0.283650	-0.221800	-0.174420	0.260620	0.215570	-0.166960	0.008460
0.001680	-0.475320	0.177480	-0.071910	-0.259820	0.195580	0.296940	-0.151980	-0.027230
0.001700	0.163800	-0.007780	0.187770	-0.331310	0.066870	0.314010	-0.080510	-0.058690
0.001720	0.404360	-0.322700	0.284530	-0.381360	-0.101150	0.333540	0.028570	-0.109030
0.001740	0.128230	-0.421920	0.164060	-0.333210	-0.195830	0.308730	0.110610	-0.128120
0.001760	-0.385810	-0.131120	0.103360	-0.128510	-0.258020	0.221010	0.217330	-0.116360
0.001780	-0.769760	0.152160	0.037440	0.117420	-0.325000	0.114170	0.297370	-0.071110
0.001800	-0.555230	0.103240	-0.110170	0.280580	-0.352280	-0.004700	0.273440	0.034890
0.001820	0.110000	-0.238750	-0.096880	0.329280	-0.320880	-0.126090	0.216910	0.177800
0.001840	0.710000	-0.577490	-0.018990	0.205210	-0.186490	-0.234460	0.155030	0.310600
0.001860	1.082430	-0.516140	-0.038220	-0.057910	0.040660	-0.351000	0.059710	0.355310
0.001880	1.231630	-0.037360	-0.072340	-0.201620	0.236680	-0.429120	-0.032200	0.291250
0.001900	0.905750	0.506330	-0.272520	-0.122470	0.318680	-0.362570	-0.097810	0.185060
0.001920	0.132460	0.919020	-0.532760	-0.092920	0.248390	-0.172460	-0.171850	0.078410
0.001940	-0.599340	1.198430	-0.429900	-0.182070	0.016030	0.023700	-0.268810	0.011860
0.001960	-1.150460	1.056270	-0.074010	-0.171080	-0.181180	0.198200	-0.347030	-0.006020
0.001980	-1.372590	0.238150	0.258510	-0.180490	-0.149640	0.338490	-0.344740	-0.039370
0.002000	-0.963680	-0.803560	0.697860	-0.333000	-0.103950	0.304390	-0.239500	-0.110970
0.002020	-0.278780	-1.355380	1.159560	-0.322650	-0.205270	0.092660	-0.073550	-0.208550
0.002040	0.426320	-0.978510	1.144160	-0.052600	-0.212790	-0.062030	0.110570	-0.314490
0.002060	1.021580	-0.036920	0.608550	0.272180	-0.150290	-0.095880	0.294230	-0.342790
0.002080	1.025580	0.508720	-0.072520	0.577230	-0.257280	-0.135640	0.387250	-0.245070
0.002100	0.792330	0.445140	-0.763650	0.810740	-0.289650	-0.187680	0.295390	-0.085300
0.002120	0.773110	0.012250	-1.150020	0.833290	-0.009870	-0.175920	0.089740	0.103320
0.002140	-0.067180	-0.586620	-0.755300	0.548780	0.300690	-0.124090	-0.100820	0.282180
0.002160	-1.980950	-0.659650	0.127640	0.016710	0.523730	-0.126050	-0.220120	0.338240
0.002180	-2.887220	0.095330	0.713880	-0.495250	0.722040	-0.165980	-0.257070	0.242820
0.002200	-2.051330	0.768480	0.673300	-0.714270	0.676480	-0.094700	-0.217250	0.059110
0.002220	-0.730400	0.351120	0.199500	-0.585070	0.353830	0.144900	-0.121870	-0.145170
0.002240	1.183800	-0.368920	-0.343970	-0.260210	-0.050710	0.402440	-0.058860	-0.258320
0.002260	3.079170	-0.415420	-0.629850	0.120440	-0.411670	0.554490	-0.081620	-0.240970
0.002280	3.424800	-1.175730	-0.416050	0.447260	-0.522250	0.593640	-0.095450	-0.184450
0.002300	2.732120	-2.617350	0.133740	0.482850	-0.308210	0.439620	-0.005580	-0.133690
0.002320	0.828260	-1.703910	0.306330	0.204810	0.044490	0.088250	0.193700	-0.094130
0.002340	-2.053670	1.616620	-0.273420	-0.087530	0.332800	-0.293880	0.408440	-0.097650
0.002360	-3.272600	3.675090	-0.960630	-0.228430	0.353420	-0.532370	0.527350	-0.094690
0.002380	-2.155400	3.325550	-1.043020	-0.289230	0.070210	-0.463140	0.521910	0.021420
0.002400	-0.105840	2.337630	-0.835350	-0.260940	-0.214330	-0.117370	0.338360	0.236440
0.002420	1.801170	0.517480	-0.552720	-0.154900	-0.229660	0.235710	-0.023850	0.452190
0.002440	2.583590	-2.263790	0.605580	-0.350710	-0.089890	0.427620	-0.388020	0.593000
0.002460	1.590910	-3.645950	2.184220	-0.910260	0.042760	0.386660	-0.617210	0.532570
0.002480	-0.654620	-2.896540	2.389020	-1.086370	0.133220	0.078310	-0.619930	0.197070
0.002500	-2.806800	-0.530630	1.110110	-0.235040	-0.037890	-0.270220	-0.332100	-0.244030
0.002520	-3.770280	2.759880	-0.477530	1.131560	-0.483220	-0.370970	0.054960	-0.520370
0.002540	-2.162570	4.054760	-1.684440	1.774000	-0.722100	-0.255910	0.295700	-0.522420
0.002560	1.773700	1.796630	-2.332570	1.548290	-0.618990	-0.080510	0.369240	-0.320590
0.002580	4.404830	-1.557420	-2.052120	1.031510	-0.436520	0.095880	0.267870	-0.039910
0.002600	3.849010	-3.423470	-0.209820	0.027610	0.005580	0.118390	0.048090	0.163570
0.002620	1.757390	-3.298140	2.139960	-1.319940	0.981840	-0.113950	-0.068170	0.185140
0.002640	-0.767520	-1.031200	2.913620	-2.099200	1.790930	-0.333660	-0.028470	0.088250
0.002660	-2.828100	2.577690	1.717300	-1.845950	1.405010	-0.252250	0.071860	-0.027880
0.002680	-3.361960	4.418730	-0.435690	-0.788090	0.158090	0.070980	0.207740	-0.104690
0.002700	-2.883240	3.148170	-1.972030	0.555510	-0.792640	0.424580	0.321470	-0.073380
0.002720	-1.721300	0.419000	-2.007450	1.654540	-1.296830	0.622180	0.332050	0.046620
0.002740	0.368440	-2.753570	-0.718290	2.137750	-1.689260	0.662730	0.274310	0.094300
0.002760	2.049470	-4.836340	1.273420	1.600450	-1.496420	0.565340	0.271240	-0.022390
0.002780	2.159920	-3.827510	2.542440	0.028460	-0.332700	0.087760	0.424770	-0.221030
0.002800	1.647750	-0.973060	2.108500	-1.233280	0.869270	-0.639780	0.708680	-0.373940
0.002820	1.465120	1.370490	0.333990	-1.354240	1.321900	-1.077640	0.878190	-0.364020
0.002840	1.281440	2.678840	-1.751550	-0.826740	1.479000	-1.158490	0.678080	-0.135590
0.002860	0.672460	2.530140	-3.093120	0.228640	1.373230	-1.008520	0.238060	0.246750
0.002880	-0.451940	1.188510	-2.996210	1.236170	0.662590	-0.515650	-0.151440	0.608050
0.002900	-1.995980	0.199750	-1.348910	1.231580	-0.097240	0.184870	-0.414410	0.683430
0.002920	-3.117310	-0.153380	0.723010	0.299180	-0.635730	0.697790	-0.563880	0.352990
0.002940	-2.765470	-0.367230	1.838180	-0.951330	-1.050860	1.077820	-0.602220	-0.211480
0.002960	-1.145870	-0.261970	1.956200	-1.944150	-0.848450	1.413590	-0.549150	-0.778130
0.002980	0.834010	-0.205210	1.606280	-2.040170	-0.203610	1.245160	-0.467450	-1.090020
0.003000	2.784040	-0.761820	0.955870	-1.016010	0.247690	0.543670	-0.395070	-0.906720
0.003020	3.935400	-1.563260	0.134380	0.346300	0.390270	-0.298010	-0.284600	-0.303430
0.003040	3.215470	-1.970570	-0.593780	1.348090	0.261870	-1.085870	-0.041460	0.246030
0.003060	0.847150	-1.415920	-1.077190	1.926940	-0.160090	-1.497750	0.326160	0.274310
0.003080	-1.934780	0.568640	-1.297960	1.884110	-0.699380	-1.297690	0.498860	-0.053510
0.003100	-3.697960	3.126500	-1.333310	1.247110	-0.877840	-0.529120	0.276190	-0.229160
0.003120	-3.387920	4.207100	-1.117590	0.306500	-0.614630	0.396890	-0.180470	-0.178760
0.003140	-1.310320	2.860200	-0.519090	-0.839530	-0.000030	0.972340	-0.861200	0.058020
0.003160	1.110190	-0.027530	0.273400	-1.929550	1.004540	1.018030	-1.581000	0.651760
0.003180	2.420380	-2.999910	1.216660	-2.322150	1.695890	0.435610	-1.851100	1.259140
0.003200	2.099630	-4.587480	2.167540	-1.828300	1.472350	-0.392260	-1.482030	1.152740
0.003220	0.801280	-3.643280	2.493210	-0.787400	0.632690	-0.868830	-0.585700	0.322560
0.003240	-0.555270	-0.639940	1.670790	0.651140	-0.520480	-0.788920	0.472130	-0.665960
0.003260	-1.247040	2.540210	-0.281740	1.933390	-1.699070	-0.031020	1.240830	-1.445060
0.003280	-0.873480	3.991150	-2.290250	2.368460	-2.235530	0.936650	1.371540	-1.680630
0.003300	0.144140	2.648310	-3.070120	2.110730	-1.803600	1.179460	0.848730	-1.081650
0.003320	0.780340	-0.315810	-2.343610	1.367250	-0.721640	0.556230	0.135080	0.112050
0.003340	0.422920	-2.306070	-0.469920	0.158990	0.734050	-0.348310	-0.352440	1.256620
0.003360	-0.541710	-2.177940	1.631540	-1.206610	1.988920	-1.139580	-0.386070	1.868710
0.003380	-1.065810	-0.516590	2.631840	-2.256430	2.361300	-1.553860	0.136820	1.686600
0.003400	-0.527980	1.267190	1.864160	-2.530610	1.892690	-1.249130	0.764210	0.700720
0.003420	0.470830	1.849440	0.024110	-1.852030	0.808840	-0.339350	0.827550	-0.468790
0.003440	0.933470	0.981250	-1.470290	-0.394420	-0.477160	0.675170	0.289510	-1.054290
0.003460	0.577810	-0.607960	-1.712520	1.243040	-1.359200	1.399570	-0.471420	-0.941720
0.003480	-0.207920	-1.623400	-0.772630	2.280870	-1.732970	1.598770	-1.050780	-0.403370
0.003500	-0.736010	-1.213070	0.425920	2.274980	-1.652430	1.226160	-0.988180	0.223540
0.003520	-0.605040	0.121200	1.022970	1.188820	-1.131430	0.418200	-0.265150	0.390600
0.003540	0.050180	1.206720	0.802700	-0.399820	-0.289500	-0.476120	0.658120	-0.048600
0.003560	0.900220	1.209780	0.054650	-1.518390	0.693370	-1.082720	1.381270	-0.590580
0.003580	1.268060	0.193680	-0.425820	-1.696040	1.457030	-1.285430	1.585290	-0.849120
0.003600	0.662250	-0.827700	-0.206710	-1.128550	1.720550	-1.110430	1.165550	-0.589620
0.003620	-0.487670	-0.927930	0.307360	-0.218110	1.369770	-0.723600	0.345470	0.252450
0.003640	-1.411650	-0.215530	0.552260	0.562120	0.433890	-0.249880	-0.508950	1.142010
0.003660	-1.518570	0.740120	0.212590	0.872790	-0.759750	0.384830	-1.068490	1.463060
0.003680	-0.735010	1.377760	-0.492530	0.832420	-1.708750	1.028900	-1.205800	1.124480
0.003700	0.407490	1.079690	-0.937290	0.630340	-1.915700	1.359330	-0.956230	0.377640
0.003720	1.217360	-0.100300	-0.708490	0.260400	-1.196950	1.286950	-0.507480	-0.447920
0.003740	1.185730	-1.222430	0.099620	-0.190530	0.053970	0.761500	-0.069170	-1.011680
0.003760	0.468070	-1.516500	0.950780	-0.573190	1.202250	-0.246860	0.344460	-1.138290
0.003780	-0.352400	-0.959270	1.213660	-0.747130	1.782640	-1.379780	0.730060	-0.930670
0.003800	-0.859050	0.080330	0.724900	-0.562560	1.521700	-2.010140	0.983830	-0.554650
0.003820	-0.797090	1.075000	-0.088150	-0.061570	0.557000	-1.715360	1.065840	-0.136460
0.003840	-0.225870	1.369680	-0.730080	0.462160	-0.540180	-0.567900	0.931440	0.250770
0.003860	0.378650	0.809120	-0.913790	0.687310	-1.225810	0.881260	0.468200	0.607000
0.003880	0.611920	-0.151200	-0.596120	0.500420	-1.183090	1.900840	-0.269490	0.904370
0.003900	0.453350	-1.003890	0.006700	0.040190	-0.511980	1.942540	-1.036730	1.023060
0.003920	0.016100	-1.220630	0.550350	-0.378440	0.265690	1.026630	-1.498260	0.862560
0.003940	-0.478040	-0.586890	0.701330	-0.451590	0.722170	-0.251900	-1.327020	0.468470
0.003960	-0.602820	0.356760	0.437720	-0.208250	0.696650	-1.188000	-0.517950	-0.143320
0.003980	-0.240200	0.904410	-0.018690	0.060700	0.288420	-1.336050	0.544720	-0.909380
0.004000	0.292590	0.816350	-0.510980	0.220820	-0.127220	-0.790390	1.318540	-1.482030
0.004020	0.584770	0.186860	-0.781130	0.250130	-0.290430	-0.064130	1.374630	-1.560980
0.004040	0.321970	-0.592770	-0.572500	0.135530	-0.222770	0.436770	0.721270	-1.065380
0.004060	-0.335330	-0.815830	0.027120	0.033070	-0.038820	0.549310	-0.239920	-0.086250
0.004080	-0.807230	-0.287630	0.595970	0.010900	0.084860	0.336900	-0.986480	1.001810
0.004100	-0.703770	0.445750	0.717650	-0.100360	0.052090	0.103820	-1.140630	1.690510
0.004120	-0.021860	0.845620	0.334720	-0.363950	0.001440	0.058900	-0.729490	1.619190
0.004140	0.784840	0.528000	-0.240380	-0.563430	0.054390	0.117870	-0.103400	0.824070
0.004160	1.048630	-0.390300	-0.550530	-0.449810	0.162720	0.135340	0.338170	-0.251710
0.004180	0.613100	-1.059430	-0.338490	-0.059750	0.221930	0.033190	0.384200	-1.055120
0.004200	-0.107570	-0.907280	0.202430	0.382970	0.110710	-0.166690	0.153550	-1.253590
0.004220	-0.604460	-0.121350	0.566000	0.653510	-0.194050	-0.287270	-0.087240	-0.888430
0.004240	-0.596010	0.770530	0.382280	0.596310	-0.512800	-0.183500	-0.179660	-0.262250
0.004260	-0.205180	1.124530	-0.189930	0.289850	-0.603300	0.086870	-0.123160	0.273820
0.004280	0.191740	0.682560	-0.672590	-0.062790	-0.387540	0.340190	-0.028470	0.507160
0.004300	0.325910	-0.147520	-0.685240	-0.319910	0.034200	0.369210	0.000110	0.469980
0.004320	0.090010	-0.789250	-0.158610	-0.390920	0.481250	0.109260	-0.030880	0.337130
0.004340	-0.434470	-0.808510	0.544850	-0.306480	0.697850	-0.258250	-0.049910	0.205740
0.004360	-0.707780	-0.152160	0.866940	-0.201940	0.543040	-0.471370	-0.007110	0.059280
0.004380	-0.327270	0.512730	0.558220	-0.143380	0.149130	-0.414440	0.101570	-0.099470
0.004400	0.326160	0.516440	-0.136530	-0.064980	-0.266310	-0.141140	0.196000	-0.259640
0.004420	0.698650	0.017460	-0.688780	0.096170	-0.499510	0.236230	0.184620	-0.369340
0.004440	0.563610	-0.489090	-0.663510	0.276280	-0.436310	0.522840	0.072540	-0.281060
0.004460	0.085120	-0.703770	-0.101170	0.356130	-0.171360	0.510270	-0.075730	-0.008010
0.004480	-0.306910	-0.448110	0.489820	0.267650	0.113430	0.217130	-0.161100	0.232880
0.004500	-0.395700	0.126270	0.654400	0.049810	0.278160	-0.176330	-0.120720	0.301200
0.004520	-0.189570	0.551410	0.361560	-0.184450	0.239570	-0.479920	0.009290	0.173230
0.004540	0.121470	0.560830	-0.120260	-0.299440	0.051390	-0.499540	0.172000	-0.080960
0.004560	0.238270	0.212070	-0.449990	-0.200200	-0.122340	-0.197190	0.285530	-0.273490
0.004580	0.153050	-0.249980	-0.416940	0.028540	-0.187130	0.223450	0.261860	-0.260750
0.004600	0.002750	-0.469040	-0.122030	0.178750	-0.135130	0.502600	0.123990	-0.072720
0.004620	-0.113860	-0.297000	0.141680	0.177860	-0.014330	0.484490	-0.058850	0.157270
0.004640	-0.115970	0.035270	0.210160	0.069660	0.056800	0.192170	-0.226820	0.293190
0.004660	-0.018060	0.241840	0.049980	-0.091850	0.042530	-0.156460	-0.271270	0.249920
0.004680	0.119780	0.255340	-0.231750	-0.188940	0.023130	-0.342540	-0.135930	0.035820
0.004700	0.115020	0.106740	-0.360250	-0.160570	0.053210	-0.298810	0.094500	-0.204780
0.004720	-0.068260	-0.081570	-0.244670	-0.077830	0.155980	-0.086200	0.283110	-0.317450
0.004740	-0.150930	-0.159440	-0.007900	-0.014000	0.273950	0.120270	0.316680	-0.301660
0.004760	-0.060910	-0.186960	0.248730	0.017780	0.240000	0.173130	0.161250	-0.193910
0.004780	0.127980	-0.196000	0.381710	0.027280	0.029110	0.087670	-0.089850	-0.004360
0.004800	0.313850	-0.093270	0.345550	0.024710	-0.221920	-0.024420	-0.277920	0.198170
0.004820	0.301440	-0.020220	0.207550	0.023730	-0.429260	-0.007700	-0.295250	0.318080
0.004840	0.189230	-0.036630	-0.034000	0.019560	-0.486850	0.178890	-0.166680	0.286540
0.004860	0.111750	0.006630	-0.268800	0.021760	-0.296740	0.343380	-0.005090	0.119900
0.004880	-0.075650	0.045670	-0.328660	0.053310	-0.009380	0.319210	0.086340	-0.079630
0.004900	-0.317740	0.057640	-0.250450	0.086330	0.157170	0.107190	0.052660	-0.224570
0.004920	-0.383500	0.169400	-0.123290	0.096050	0.184820	-0.232490	-0.041060	-0.243140
0.004940	-0.241430	0.243320	0.029380	0.068020	0.108650	-0.522540	-0.061850	-0.133570
0.004960	0.041810	0.149180	0.121830	-0.033070	-0.000400	-0.541160	0.013920	-0.016960
0.004980	0.298010	-0.016880	0.060350	-0.167270	-0.009150	-0.291230	0.105630	0.035010
0.005000	0.259050	-0.229930	-0.063570	-0.243100	0.071190	0.030050	0.137330	0.049240
0.005020	0.002020	-0.367610	-0.086430	-0.211540	0.142390	0.251740	0.054410	0.058420
0.005040	-0.173250	-0.205600	0.024240	-0.073360	0.148180	0.296010	-0.107740	0.107390
0.005060	-0.201270	0.120970	0.192530	0.099540	0.031150	0.171000	-0.216760	0.199260
0.005080	-0.087690	0.345780	0.269420	0.200320	-0.158470	-0.000590	-0.193720	0.250310
0.005100	0.135580	0.368560	0.160540	0.174580	-0.261920	-0.076770	-0.059310	0.188960
0.005120	0.303870	0.128250	-0.037350	0.055630	-0.225520	-0.038220	0.119400	0.027990
0.005140	0.276760	-0.221650	-0.151750	-0.060920	-0.105850	0.051940	0.245730	-0.152940
0.005160	0.028280	-0.381300	-0.093100	-0.091320	0.031120	0.115630	0.255040	-0.242430
0.005180	-0.320320	-0.266360	0.096780	-0.031330	0.109480	0.076490	0.166150	-0.165340
0.005200	-0.470420	0.026720	0.239060	0.065450	0.093920	-0.056270	0.052290	0.015930
0.005220	-0.222280	0.310830	0.175990	0.120240	0.048400	-0.166580	-0.028980	0.155210
0.005240	0.099420	0.344710	-0.055000	0.110450	0.030820	-0.183640	-0.064650	0.180260
0.005260	0.153090	0.075030	-0.307910	0.083930	0.004240	-0.115550	-0.050060	0.091880
0.005280	0.057470	-0.250360	-0.380280	0.060070	-0.031730	0.010640	-0.011620	-0.052280
0.005300	-0.020770	-0.380030	-0.146660	0.033380	-0.020750	0.119930	-0.007110	-0.132720
0.005320	-0.084990	-0.257920	0.209180	-0.019440	0.011600	0.149090	-0.044360	-0.095610
0.005340	-0.107250	0.054950	0.398650	-0.111850	0.035120	0.113570	-0.082120	0.005300
0.005360	-0.041200	0.295880	0.320940	-0.189200	0.070070	0.022250	-0.100510	0.101580
0.005380	0.050160	0.212180	0.037530	-0.178420	0.081220	-0.097590	-0.090660	0.145090
0.005400	0.094010	-0.043750	-0.250280	-0.035280	0.049810	-0.158920	-0.041980	0.115350
0.005420	0.074520	-0.196800	-0.316360	0.156630	-0.007140	-0.129310	0.031150	0.040630
0.005440	0.019430	-0.194890	-0.159550	0.245930	-0.097520	-0.045110	0.102080	-0.020240
0.005460	0.051670	-0.039850	0.039370	0.210000	-0.166760	0.050560	0.132130	-0.027320
0.005480	0.210330	0.160050	0.168870	0.092680	-0.144670	0.084670	0.071790	0.022030
0.005500	0.320610	0.209080	0.165130	-0.072840	-0.046980	0.038600	-0.053480	0.110120
0.005520	0.257090	0.142920	-0.003500	-0.180440	0.068150	-0.021620	-0.168170	0.198540
0.005540	0.024980	0.073220	-0.181440	-0.150160	0.134440	-0.077870	-0.226550	0.233380
0.005560	-0.311140	0.009480	-0.196350	-0.051630	0.119250	-0.108760	-0.199190	0.186970
0.005580	-0.490800	0.052260	-0.118350	0.017950	0.074530	-0.057520	-0.092690	0.077110
0.005600	-0.385440	0.195510	-0.064070	0.027350	0.020050	0.032760	0.021410	-0.046350
0.005620	-0.132040	0.260140	-0.009530	-0.022990	-0.068790	0.068150	0.070940	-0.118610
0.005640	0.149030	0.183070	0.044020	-0.095380	-0.111190	0.027620	0.040440	-0.100440
0.005660	0.338540	-0.023110	0.088230	-0.106440	-0.044630	-0.043120	-0.030680	-0.002880
0.005680	0.347280	-0.263100	0.164890	-0.040670	0.045670	-0.070930	-0.086000	0.134320
0.005700	0.213550	-0.337100	0.203720	0.024160	0.092830	-0.036470	-0.084470	0.234120
0.005720	0.041080	-0.225200	0.165230	0.068560	0.101000	0.005560	-0.028100	0.222930
0.005740	-0.146570	-0.026780	0.111600	0.114610	0.036800	0.025220	0.037660	0.117360
0.005760	-0.267250	0.197280	0.016360	0.136690	-0.069680	0.029860	0.079430	-0.000400
0.005780	-0.172480	0.313020	-0.084680	0.140150	-0.133810	0.024550	0.097430	-0.072740
0.005800	-0.004430	0.197820	-0.107140	0.132230	-0.154260	0.015080	0.083670	-0.087230
0.005820	0.038760	-0.025330	-0.075910	0.094350	-0.103010	0.007350	0.025800	-0.055590
0.005840	0.024160	-0.187500	-0.024490	0.045940	0.058190	0.007000	-0.035860	-0.010580
0.005860	0.022540	-0.268020	0.018290	-0.015600	0.198450	0.011680	-0.044950	0.029100
0.005880	-0.015300	-0.189310	0.033610	-0.093370	0.211360	0.009070	-0.019780	0.063100
0.005900	-0.095900	0.085070	0.023900	-0.120870	0.145140	-0.017310	0.011360	0.071600
0.005920	-0.121000	0.307500	-0.027860	-0.069250	0.037260	-0.057600	0.078210	0.044110
0.005940	-0.047520	0.312710	-0.107510	0.005310	-0.041880	-0.052050	0.156990	-0.010300
0.005960	0.057160	0.189200	-0.171080	0.070290	-0.017160	-0.006140	0.175060	-0.068370
0.005980	0.097920	-0.048630	-0.173670	0.122000	0.037370	0.006310	0.132630	-0.093300
0.006000	0.076910	-0.288160	-0.073310	0.107050	0.055150	0.005300	0.075630	-0.075480
0.006020	0.028100	-0.295530	0.086780	0.010490	0.063010	0.020560	0.024720	-0.021040
0.006040	-0.050510	-0.123210	0.212510	-0.102050	0.045680	0.008400	-0.002370	0.051830
0.006060	-0.052270	0.073980	0.257110	-0.197030	0.009990	-0.006140	0.001950	0.087250
0.006080	0.165060	0.194800	0.171600	-0.224710	0.022250	0.008110	-0.005660	0.054430
0.006100	0.418040	0.110920	-0.018700	-0.117450	0.048380	0.015110	-0.054740	-0.016690
0.006120	0.342170	-0.068150	-0.174170	0.065180	0.010570	0.030680	-0.110390	-0.081730
0.006140	-0.005700	-0.111420	-0.228690	0.200400	-0.071900	0.056100	-0.140180	-0.108310
0.006160	-0.270180	-0.032850	-0.184120	0.247410	-0.171030	0.051790	-0.124610	-0.090310
0.006180	-0.353180	0.075360	-0.073990	0.188280	-0.245440	0.046020	-0.059220	-0.067910
0.006200	-0.299240	0.201670	-0.000440	0.014350	-0.201540	0.050920	0.009040	-0.080920
0.006220	-0.142780	0.228290	0.020780	-0.164240	-0.030710	0.021280	0.037020	-0.108520
0.006240	0.084260	0.038410	0.031460	-0.252820	0.166250	-0.041130	0.019080	-0.119080
0.006260	0.284020	-0.217030	0.031220	-0.242060	0.301140	-0.103820	-0.039070	-0.112930
0.006280	0.277550	-0.347510	0.051340	-0.117990	0.321510	-0.144030	-0.093930	-0.079580
0.006300	0.051030	-0.290300	0.073300	0.056470	0.195610	-0.133630	-0.096130	-0.029080
0.006320	-0.140700	-0.052550	0.026130	0.155420	-0.009970	-0.058620	-0.054210	-0.011800
0.006340	-0.141830	0.183560	-0.047050	0.143560	-0.172090	0.045970	-0.004280	-0.043060
0.006360	-0.063630	0.254380	-0.114240	0.070220	-0.231660	0.148930	0.016360	-0.091860
0.006380	0.047150	0.184280	-0.158790	0.001260	-0.166370	0.216440	-0.009310	-0.112300
0.006400	0.150500	0.002670	-0.092460	-0.015570	-0.005520	0.188380	-0.047180	-0.075380
0.006420	0.134160	-0.213150	0.049520	-0.002230	0.136470	0.077910	-0.045280	-0.019980
0.006440	0.075800	-0.272490	0.134930	-0.001570	0.189980	-0.035480	0.014540	0.001100
0.006460	0.047930	-0.144890	0.129160	-0.020330	0.150220	-0.110100	0.104900	-0.022770
0.006480	0.003260	0.031040	0.053270	-0.053810	0.030330	-0.113840	0.186540	-0.081690
0.006500	-0.012520	0.172650	-0.068340	-0.053960	-0.085840	-0.031390	0.221850	-0.145500
0.006520	0.004160	0.199820	-0.153680	-0.007560	-0.132960	0.065150	0.179870	-0.173800
0.006540	-0.018630	0.059330	-0.127840	0.023070	-0.132720	0.104350	0.071330	-0.141030
0.006560	-0.031040	-0.102700	-0.037860	0.032660	-0.070440	0.085140	-0.050980	-0.067440
0.006580	0.017870	-0.162440	0.033340	0.034930	0.040340	0.012320	-0.117430	0.007940
0.006600	0.037810	-0.144050	0.067420	-0.006690	0.089810	-0.085410	-0.092830	0.051760
0.006620	0.026750	-0.039950	0.049860	-0.081300	0.061980	-0.135190	-0.005480	0.041380
0.006640	0.044160	0.109180	0.017510	-0.113190	0.019890	-0.112790	0.087610	-0.011740
0.006660	0.020970	0.161550	0.026070	-0.072320	-0.021310	-0.045250	0.147110	-0.083290
0.006680	-0.055360	0.087350	0.024280	-0.020860	-0.032630	0.035100	0.146330	-0.137250
0.006700	-0.087020	-0.033490	0.008680	0.011370	-0.009760	0.081160	0.075350	-0.135460
0.006720	-0.072150	-0.141110	0.030700	0.056690	-0.014920	0.066570	-0.008970	-0.080200
0.006740	-0.100990	-0.160220	0.034800	0.083500	-0.051560	0.013860	-0.040840	0.006670
0.006760	-0.134130	-0.057180	0.033560	0.054490	-0.093430	-0.031220	-0.013320	0.070490
0.006780	-0.100190	0.032400	0.080040	-0.003600	-0.141520	-0.038270	0.053000	0.062040
0.006800	-0.031740	0.047250	0.075370	-0.059050	-0.139950	-0.014680	0.105060	-0.008660
0.006820	0.051610	0.031080	0.009620	-0.080720	-0.053230	0.011890	0.101520	-0.109040
0.006840	0.107090	-0.058120	-0.032820	-0.056800	0.041700	0.023190	0.069430	-0.183520
0.006860	0.093580	-0.145660	-0.084510	-0.010780	0.090700	0.009430	0.051560	-0.182210
0.006880	0.036800	-0.073040	-0.114540	0.046410	0.093460	-0.030090	0.051570	-0.106740
0.006900	-0.018750	0.063580	-0.047620	0.080030	0.045360	-0.053300	0.061580	0.009920
0.006920	-0.039240	0.139870	0.016380	0.039860	-0.005790	-0.017160	0.078680	0.103240
0.006940	-0.004230	0.175300	0.018700	-0.041110	-0.008480	0.042780	0.079450	0.127260
0.006960	0.021360	0.104820	0.027390	-0.093110	0.002200	0.070570	0.050900	0.111820
0.006980	-0.031430	-0.044900	0.013680	-0.079660	0.027530	0.069310	0.011050	0.088770
0.007000	-0.085090	-0.116090	-0.019270	-0.005590	0.078270	0.038290	-0.012840	0.056550
0.007020	-0.037020	-0.146290	0.027240	0.057250	0.053430	-0.031670	0.006500	0.021990
0.007040	0.058890	-0.138130	0.107590	0.056670	-0.058310	-0.085010	0.056280	-0.012610
0.007060	0.088320	-0.031140	0.109170	0.025440	-0.124150	-0.072010	0.089350	-0.049340
0.007080	0.026360	0.026890	0.056960	-0.005710	-0.122770	-0.026910	0.078850	-0.063340
0.007100	-0.059680	0.007690	-0.008940	-0.033730	-0.104840	0.024420	0.035040	-0.040370
0.007120	-0.117090	0.033810	-0.088420	-0.033600	-0.057910	0.066700	-0.019670	0.002800
0.007140	-0.113520	0.060000	-0.114410	0.027610	-0.011510	0.051260	-0.059550	0.057600
0.007160	-0.047460	0.042790	-0.054880	0.085550	-0.002330	-0.000430	-0.071310	0.101130
0.007180	0.054490	0.015000	0.014420	0.048740	0.007170	-0.032010	-0.069790	0.096940
0.007200	0.127380	-0.016820	0.073140	-0.032100	0.014780	-0.050760	-0.051430	0.059630
0.007220	0.077480	-0.023310	0.100930	-0.094370	-0.005310	-0.059620	-0.022220	0.025250
0.007240	-0.031230	-0.009580	0.067990	-0.122720	-0.006240	-0.053460	-0.015310	-0.005250
0.007260	-0.074660	-0.009660	0.031060	-0.072710	0.025360	-0.050620	-0.014000	-0.028290
0.007280	-0.092980	0.019440	0.006880	0.020670	0.023400	-0.043960	-0.010900	-0.025750
0.007300	-0.120530	0.081800	-0.020920	0.072160	-0.009150	-0.029480	-0.026200	-0.001090
0.007320	-0.114450	0.079460	-0.014160	0.085000	-0.038380	-0.026440	-0.041590	0.031300
0.007340	-0.093080	0.020520	0.001880	0.067150	-0.080410	-0.015760	-0.039180	0.063810
0.007360	-0.073940	-0.002500	-0.014650	0.011490	-0.105240	0.012790	-0.013100	0.085510
0.007380	0.005270	-0.009810	0.002190	-0.022230	-0.083570	0.027170	0.030090	0.083630
0.007400	0.100200	-0.037220	0.056530	-0.019340	-0.035020	0.022760	0.059770	0.058260
0.007420	0.101500	0.001500	0.050550	-0.018270	0.032690	0.009400	0.056090	0.021450
0.007440	0.018240	0.075400	0.009560	-0.001490	0.087230	-0.022810	0.032020	0.001450
0.007460	-0.084290	0.056440	0.004150	0.019910	0.071660	-0.054240	0.023050	0.028810
0.007480	-0.117950	0.047130	-0.003320	0.018300	0.023010	-0.049260	0.020840	0.084950
0.007500	-0.069070	0.114160	-0.001850	0.029320	0.004480	-0.019980	-0.002260	0.112890
0.007520	-0.042430	0.091520	0.056360	0.035800	-0.016360	0.019400	-0.025700	0.098860
0.007540	-0.037610	0.026860	0.089430	0.011400	-0.033330	0.059980	-0.040980	0.059650
0.007560	-0.004590	0.013660	0.054270	0.000010	-0.001040	0.053500	-0.056210	0.003680
0.007580	-0.008270	-0.042920	0.026950	-0.007790	0.029940	0.002730	-0.052190	-0.038180
0.007600	-0.070420	-0.077700	0.002790	-0.019260	0.033310	-0.037200	-0.019700	-0.042310
0.007620	-0.104660	-0.026210	-0.026390	0.015240	0.020700	-0.064520	0.021330	-0.016820
0.007640	-0.063260	-0.009380	-0.004770	0.069210	-0.017170	-0.083460	0.048020	0.032470
0.007660	0.025750	-0.010590	0.021500	0.080370	-0.023410	-0.074590	0.048560	0.074300
0.007680	0.086420	0.010540	-0.005690	0.069960	0.021080	-0.042800	0.034180	0.067530
0.007700	0.076920	-0.014670	-0.037490	0.053830	0.035580	-0.006330	0.016590	0.040600
0.007720	0.054370	-0.032570	-0.048290	0.002150	0.021060	0.021640	-0.007660	0.034230
0.007740	0.037850	0.012710	-0.027860	-0.051780	0.032500	0.019090	-0.017730	0.032540
0.007760	-0.009180	0.026940	0.024410	-0.057380	0.034380	-0.010760	-0.010110	0.020130
0.007780	-0.057490	0.027280	0.046830	-0.040620	0.018360	-0.024520	-0.015810	0.002400
0.007800	-0.074070	0.072890	0.035710	-0.027270	0.040110	-0.017190	-0.033270	-0.009700
0.007820	-0.052740	0.071720	0.006560	-0.006140	0.067990	-0.019380	-0.042560	-0.009960
0.007840	-0.022850	0.028360	-0.069500	0.022620	0.057650	-0.018100	-0.032480	-0.012620
0.007860	-0.036580	0.034480	-0.114860	0.050400	0.030460	-0.003060	-0.002880	-0.022010
0.007880	-0.025550	0.032430	-0.062060	0.062280	-0.014250	0.002640	0.026650	-0.013060
0.007900	0.036520	0.007250	0.000740	0.041110	-0.057260	0.010080	0.034540	0.010030
0.007920	0.046650	0.014900	0.030130	0.012100	-0.046590	0.024380	0.018500	0.026610
0.007940	0.020910	-0.012940	0.048190	0.002780	-0.003860	0.007020	-0.000150	0.050870
0.007960	0.040120	-0.041090	0.011120	0.000140	0.027660	-0.026330	-0.011370	0.060050
0.007980	0.059140	0.033880	-0.043890	-0.009550	0.054500	-0.041200	-0.022800	0.025750
0.008000	0.006030	0.072660	-0.038640	-0.014050	0.058890	-0.046010	-0.027290	-0.001400
0.008020	-0.064980	0.042230	-0.014780	-0.003600	0.028840	-0.027390	-0.035720	-0.003760
0.008040	-0.056730	0.055470	-0.004560	-0.007500	0.004800	0.017290	-0.073370	-0.017010
0.008060	-0.002670	0.022190	0.014500	-0.030740	-0.014320	0.047230	-0.119720	-0.032950
0.008080	0.001120	-0.035480	0.015700	-0.020050	-0.038580	0.066960	-0.132060	-0.030760
0.008100	-0.029080	0.000310	-0.010260	0.022050	-0.038770	0.087820	-0.099410	-0.020370
0.008120	0.001230	0.006970	-0.001990	0.039980	-0.015630	0.083130	-0.045710	-0.018400
0.008140	0.068640	-0.023860	0.015110	0.034910	0.010060	0.045890	0.006390	-0.027140
0.008160	0.072280	0.019170	-0.021030	0.026890	0.038090	-0.011570	0.046830	-0.042320
0.008180	0.014400	0.027850	-0.037480	0.017370	0.049740	-0.058150	0.067510	-0.038420
0.008200	-0.006790	-0.028750	-0.031630	0.000410	0.040450	-0.061640	0.055430	0.001110
0.008220	0.007750	-0.028800	-0.070210	-0.003870	0.033600	-0.039800	0.014900	0.030000
0.008240	-0.014950	-0.007370	-0.077020	0.027890	0.022870	-0.001350	-0.009830	0.028440
0.008260	-0.006270	0.000340	-0.016540	0.049240	0.008220	0.048010	-0.011010	0.026220
0.008280	0.034600	0.020190	0.009780	0.018560	0.022140	0.059640	-0.027490	0.012560
0.008300	-0.001190	0.002330	-0.012280	-0.025780	0.042560	0.035100	-0.045910	-0.016850
0.008320	-0.022390	-0.025560	-0.041000	-0.054530	0.037740	0.020770	-0.028570	-0.038890
0.008340	0.031010	-0.014130	-0.070790	-0.062460	0.041670	0.010590	0.009010	-0.053790
0.008360	0.047700	-0.021070	-0.062410	-0.028050	0.042620	-0.007950	0.045860	-0.062770
0.008380	0.032180	-0.028790	-0.031340	0.023400	0.000740	-0.007670	0.076970	-0.061510
0.008400	0.053930	0.017910	-0.024350	0.046540	-0.036560	0.012400	0.081380	-0.060880
0.008420	0.066650	0.038620	-0.005420	0.035650	-0.038060	0.029850	0.063170	-0.065040
0.008440	0.053550	-0.018550	-0.006120	-0.001060	-0.045610	0.048750	0.040940	-0.054560
0.008460	0.045100	-0.038740	-0.050170	-0.034390	-0.035090	0.062660	0.005420	-0.029120
0.008480	0.027700	-0.003230	-0.034100	-0.043700	0.007680	0.051540	-0.033270	-0.021490
0.008500	0.038170	-0.015080	0.032800	-0.032590	0.030690	0.029560	-0.060790	-0.037610
0.008520	0.073990	-0.019650	0.034520	-0.008080	0.051210	0.009850	-0.084980	-0.050130
0.008540	0.052310	0.004420	-0.007700	0.007530	0.063650	-0.023580	-0.091210	-0.058420
0.008560	-0.034290	-0.016490	-0.039470	0.000770	0.015610	-0.041970	-0.070260	-0.064380
0.008580	-0.110320	-0.016320	-0.092500	-0.006200	-0.042140	-0.007750	-0.053730	-0.054380
0.008600	-0.070490	0.019750	-0.120020	0.006180	-0.066090	0.025780	-0.041500	-0.041660
0.008620	0.054870	0.000560	-0.051550	0.015010	-0.087830	0.033230	-0.011270	-0.033720
0.008640	0.079910	-0.008540	0.028750	-0.001200	-0.084590	0.051780	0.010750	-0.021730
0.008660	-0.000180	0.016900	0.040390	-0.013100	-0.035790	0.057340	0.004440	-0.015070
0.008680	-0.029170	-0.013390	0.017650	-0.024020	0.007160	0.032720	0.007000	-0.013930
0.008700	-0.035300	-0.039760	-0.002020	-0.055280	0.024810	0.016650	0.025470	-0.006430
0.008720	-0.066650	-0.015730	-0.002040	-0.059430	0.033260	0.014260	0.025670	0.006000
0.008740	-0.050420	-0.008780	0.007090	-0.020110	0.025320	0.005310	0.012000	0.023650
0.008760	0.033880	0.003290	-0.003230	0.010070	0.015060	-0.006040	0.001510	0.036780
0.008780	0.136290	0.008910	-0.011510	0.021320	0.014410	0.000120	-0.005900	0.036000
0.008800	0.162620	-0.042150	-0.019250	0.040720	-0.007910	0.022700	-0.013080	0.037820
0.008820	0.056170	-0.071430	-0.058260	0.045820	-0.035230	0.031400	-0.008710	0.043450
0.008840	-0.058230	-0.044190	-0.065420	0.019230	-0.036310	0.022290	0.021530	0.041500
0.008860	-0.094370	-0.037460	-0.014730	-0.010170	-0.031530	0.018470	0.064490	0.042980
0.008880	-0.089960	-0.021420	0.017730	-0.014480	-0.026860	0.022310	0.094910	0.045410
0.008900	-0.027460	0.027780	0.042580	-0.009200	-0.008360	0.014150	0.099100	0.031410
0.008920	0.026730	0.012850	0.079540	-0.022070	-0.001800	-0.000320	0.081960	0.016880
0.008940	-0.004570	-0.039820	0.064720	-0.025940	-0.024530	0.004910	0.060650	0.022100
0.008960	-0.032290	-0.033430	0.031310	0.001140	-0.042550	0.014690	0.034470	0.024700
0.008980	0.031210	-0.037660	0.035840	0.022340	-0.051220	0.018990	0.008060	0.012940
0.009000	0.103900	-0.036040	0.020500	0.019790	-0.061020	0.035430	-0.014410	0.017000
0.009020	0.031540	0.048870	-0.020560	0.017310	-0.047500	0.038830	-0.038430	0.036660
0.009040	-0.095770	0.081250	-0.025200	0.022320	-0.023300	0.007330	-0.045990	0.045010
0.009060	-0.068980	0.021620	-0.012970	0.008230	-0.009050	-0.015890	-0.031600	0.049330
0.009080	0.040900	0.015370	-0.014230	-0.031260	0.022410	-0.016780	-0.016250	0.054300
0.009100	0.071280	0.027650	0.009670	-0.056240	0.036750	-0.026700	0.005260	0.045010
0.009120	0.044410	-0.011650	0.055280	-0.047620	0.004980	-0.031120	0.029920	0.043050
0.009140	0.045230	-0.014020	0.067760	-0.025760	-0.011590	-0.019540	0.020540	0.055240
0.009160	0.010690	0.009780	0.051800	-0.001510	-0.022160	-0.007940	-0.016210	0.052860
0.009180	-0.097760	0.003120	0.031130	0.014410	-0.063680	0.015100	-0.032770	0.042930
0.009200	-0.124160	0.008120	0.015040	0.026880	-0.099640	0.030970	-0.024950	0.038310
0.009220	-0.040860	0.012020	0.020140	0.043080	-0.121460	0.014970	-0.014560	0.041840
0.009240	0.040530	-0.022180	0.038310	0.041500	-0.120070	0.002230	-0.014040	0.045900
0.009260	0.091840	-0.040340	0.039490	0.016710	-0.059340	-0.002600	-0.021850	0.030480
0.009280	0.048820	-0.024700	0.024880	-0.012330	0.001120	-0.025500	-0.015110	0.017480
0.009300	-0.056670	-0.020660	0.004420	-0.038560	0.017320	-0.039770	0.005200	0.035860
0.009320	-0.080500	-0.013680	-0.012470	-0.046970	0.039600	-0.028860	0.010090	0.060460
0.009340	-0.025360	0.018410	0.000910	-0.010980	0.056750	-0.012190	0.005860	0.071210
0.009360	-0.000990	0.037330	0.035240	0.027670	0.026960	0.000570	0.006550	0.080360
0.009380	0.015740	0.017930	0.049760	0.016050	-0.009100	0.007730	0.008220	0.077630
0.009400	0.091800	-0.021570	0.045660	0.005320	-0.017320	0.005340	0.012310	0.058460
0.009420	0.102390	-0.054340	0.040090	0.017790	-0.022030	-0.003860	0.007470	0.041880
0.009440	0.013910	-0.047080	0.035810	0.017230	-0.020690	-0.013910	-0.006290	0.021060
0.009460	-0.012590	-0.011020	0.035110	0.019160	-0.014020	-0.024000	-0.004430	-0.004990
0.009480	0.019540	-0.002940	0.042940	0.025690	-0.027060	-0.025870	0.012920	-0.016160
0.009500	0.017680	0.013310	0.049160	0.026350	-0.025430	-0.014060	0.017030	-0.007000
0.009520	-0.029160	0.037980	0.040300	0.025760	0.003150	-0.008230	0.005370	0.010170
0.009540	-0.054190	-0.008600	0.005770	0.013690	0.002790	-0.008130	-0.002160	0.017560
0.009560	-0.031870	-0.037350	-0.028570	-0.002090	-0.006540	-0.002590	-0.006170	0.019400
0.009580	-0.033250	0.004900	-0.024700	0.001530	0.006760	-0.005330	-0.012390	0.029130
0.009600	-0.043020	0.007250	0.014500	0.011550	0.007520	-0.005500	-0.015340	0.033220
0.009620	0.003390	-0.007480	0.043670	0.001640	0.005790	0.006320	-0.013240	0.011260
0.009640	0.046910	-0.008670	0.037620	-0.009120	0.021700	0.005330	-0.018250	-0.022720
0.009660	-0.019950	-0.035310	0.041210	-0.008460	0.020920	-0.009410	-0.036550	-0.037420
0.009680	-0.083720	-0.045180	0.053720	-0.015200	0.004910	-0.021330	-0.052890	-0.037620
0.009700	-0.019600	-0.028240	0.038300	-0.010150	-0.000100	-0.031010	-0.055350	-0.038980
0.009720	0.035910	-0.010040	0.031260	0.016460	-0.014570	-0.032380	-0.050360	-0.039990
0.009740	0.025220	0.027200	0.027830	0.028950	-0.028360	-0.021750	-0.042780	-0.049380
0.009760	0.053550	0.052850	0.005470	0.033410	-0.009390	-0.015910	-0.035730	-0.065500
0.009780	0.057940	0.026860	-0.007010	0.031630	0.005280	-0.012960	-0.030140	-0.069050
0.009800	-0.004720	-0.019030	-0.023920	-0.003810	-0.004830	-0.001350	-0.015990	-0.063990
0.009820	-0.014930	-0.035100	-0.032390	-0.025580	-0.005130	-0.003120	-0.000080	-0.061790
0.009840	-0.015490	-0.023760	-0.007190	-0.000290	0.004000	-0.023370	-0.003020	-0.053270
0.009860	-0.030030	-0.015640	0.002760	0.009110	0.011740	-0.028140	-0.014330	-0.039870
0.009880	0.035830	-0.011450	0.007930	-0.005270	0.034170	-0.022420	-0.018010	-0.034250
0.009900	0.059520	-0.001540	0.038480	0.003410	0.041630	-0.022410	-0.022980	-0.038770
0.009920	-0.015720	0.007800	0.034300	0.007990	0.019100	-0.013210	-0.027540	-0.051400
0.009940	-0.028540	0.029240	0.001940	-0.006110	0.012130	-0.001250	-0.012370	-0.058580
0.009960	0.011030	0.026870	0.001140	-0.000740	0.024560	0.003580	0.009080	-0.054800
0.009980	-0.003260	0.016910	0.005970	0.014060	0.032530	0.011660	0.008700	-0.053050
0.010000	-0.016830	0.063860	-0.006560	0.011850	0.047010	0.005700	0.003660	-0.048780
0.010020	-0.006710	0.054890	-0.010360	0.001190	0.053700	-0.017010	0.012570	-0.035810
0.010040	0.001260	-0.029500	-0.024040	-0.001360	0.039110	-0.015450	0.023890	-0.018750
0.010060	0.025830	-0.026900	-0.046570	0.006360	0.024820	0.003350	0.032960	-0.004730
0.010080	0.046220	-0.002680	-0.037290	0.007890	0.007620	0.003640	0.043130	-0.007220
0.010100	0.031370	-0.034680	-0.023030	0.005020	-0.006190	0.004850	0.041430	-0.010930
0.010120	-0.041120	-0.013200	-0.037330	0.020480	0.007390	0.011990	0.017610	0.005030
0.010140	-0.143460	0.019530	-0.039520	0.030430	0.017230	-0.006760	0.000550	0.022890
0.010160	-0.164550	-0.008970	-0.022550	0.010050	0.001630	-0.022660	0.009230	0.028630
0.010180	-0.078330	-0.004510	-0.022070	-0.003830	0.001120	-0.008900	0.016220	0.021550
0.010200	0.024300	0.022290	-0.022830	-0.005710	0.014390	0.001410	0.015220	0.006080
0.010220	0.029100	0.003470	-0.011590	-0.026490	0.014600	0.012090	0.018740	-0.005370