0.000000	0.242070	-0.355520	0.387030	-0.291300	-0.520980	0.433740	0.479190	0.332330
0.000020	0.174330	-0.269940	0.305820	-0.244860	-0.405980	0.346390	0.383170	0.275310
0.000040	0.030740	0.072580	-0.143270	0.005710	0.171590	-0.089190	-0.054240	-0.013540
0.000060	0.035220	0.525710	-0.831190	0.391360	1.042530	-0.746940	-0.715310	-0.457940
0.000080	0.332970	0.525720	-0.972760	0.464450	1.215280	-0.894370	-0.867580	-0.570920
0.000100	0.288570	0.234870	-0.600270	0.235550	0.736210	-0.560380	-0.521090	-0.356770
0.000120	-0.196170	0.274700	-0.545940	0.211290	0.665540	-0.497080	-0.452770	-0.317010
0.000140	-0.126830	0.395430	-0.631670	0.312610	0.788020	-0.573720	-0.547490	-0.371160
0.000160	0.281250	0.314950	-0.466770	0.262770	0.605350	-0.460810	-0.455490	-0.309640
0.000180	0.281870	0.216280	-0.365520	0.206940	0.493040	-0.370630	-0.394790	-0.278830
0.000200	0.227310	0.110840	-0.368370	0.202630	0.500580	-0.357560	-0.386010	-0.279390
0.000220	0.120770	0.122890	-0.326300	0.165130	0.405200	-0.334660	-0.327300	-0.251330
0.000240	-0.089800	0.248420	-0.286350	0.129310	0.316870	-0.292210	-0.280000	-0.226520
0.000260	-0.121950	0.227870	-0.229740	0.143310	0.310720	-0.249920	-0.263970	-0.207870
0.000280	-0.319610	0.158280	-0.170670	0.141980	0.268730	-0.210810	-0.227600	-0.190400
0.000300	-0.684210	0.179040	-0.169570	0.102050	0.218330	-0.165340	-0.183770	-0.166150
0.000320	-0.596270	0.167110	-0.157230	0.104330	0.222850	-0.151070	-0.172900	-0.137160
0.000340	0.118820	0.109950	-0.111180	0.106740	0.149480	-0.147240	-0.139190	-0.120690
0.000360	0.748280	0.093400	-0.097360	0.067600	0.055790	-0.122650	-0.096540	-0.119710
0.000380	0.477000	0.072150	-0.056070	0.052980	0.063190	-0.095170	-0.090180	-0.098440
0.000400	-0.255500	0.081230	0.005450	0.055210	0.059060	-0.069290	-0.072930	-0.064340
0.000420	-0.528560	0.152540	0.002330	0.037480	0.010490	-0.029880	-0.030630	-0.049080
0.000440	-0.514640	0.103610	-0.029760	0.038850	0.012870	-0.012370	-0.019040	-0.044700
0.000460	-0.322410	-0.043140	-0.026990	0.037600	0.001390	-0.030950	-0.019560	-0.039300
0.000480	0.266540	-0.061390	-0.021120	0.011100	-0.048820	-0.037350	0.001440	-0.029520
0.000500	0.231760	0.009630	0.002110	0.016340	-0.043600	-0.017390	0.019060	-0.010270
0.000520	-0.523270	0.068180	0.069010	0.038700	-0.036440	-0.003030	0.033450	0.003570
0.000540	-0.379940	0.116980	0.080450	0.025340	-0.060650	0.005030	0.046970	0.003140
0.000560	0.251530	0.081420	0.023420	-0.004690	-0.040770	0.005380	0.046030	0.001680
0.000580	0.111050	0.003300	0.008900	-0.035730	-0.035810	-0.005220	0.049700	0.003790
0.000600	-0.188050	0.013970	-0.004500	-0.057530	-0.068310	0.001220	0.059580	0.010290
0.000620	-0.309970	0.039250	-0.032520	-0.025230	-0.056990	0.009570	0.055510	0.015530
0.000640	-0.258790	0.029720	0.033140	0.025890	-0.053150	0.000210	0.055700	0.010600
0.000660	0.125390	0.026010	0.100980	0.026530	-0.082480	0.009790	0.067400	0.016110
0.000680	0.272500	-0.027930	0.054930	0.012440	-0.065160	0.029620	0.062000	0.037110
0.000700	0.104740	-0.050840	0.021860	0.023990	-0.042330	0.039160	0.039710	0.038630
0.000720	-0.246650	0.023850	0.029160	0.026080	-0.051650	0.050140	0.031180	0.023620
0.000740	-0.562040	0.022880	0.006500	0.018930	-0.025680	0.044620	0.035520	0.026480
0.000760	-0.136310	-0.029010	0.041130	0.030940	-0.011580	0.023970	0.042310	0.033940
0.000780	0.307790	-0.005700	0.099290	0.042660	-0.039130	0.020660	0.044960	0.024020
0.000800	0.022840	0.003020	0.052890	0.034980	-0.016580	0.026880	0.034680	0.019640
0.000820	-0.318630	0.020340	0.013630	0.010610	0.006530	0.018090	0.032900	0.025180
0.000840	-0.562530	0.111210	0.028400	-0.016750	-0.035070	0.007590	0.035110	0.022490
0.000860	-0.497630	0.104960	0.010010	-0.009290	-0.032110	0.007660	0.016480	0.022080
0.000880	0.190130	0.006860	0.033380	0.029190	-0.008260	0.008180	0.003870	0.034320
0.000900	0.441320	-0.009940	0.076180	0.046450	-0.051210	0.024990	0.008870	0.037410
0.000920	-0.194770	-0.017410	0.021740	0.037650	-0.049780	0.049540	0.009010	0.026080
0.000940	-0.282590	-0.066610	-0.026480	0.026780	-0.014250	0.034660	0.012150	0.028590
0.000960	0.389070	-0.032870	-0.004290	0.009690	-0.050390	0.013200	0.023880	0.036010
0.000980	0.534790	0.027850	0.001170	-0.004600	-0.030940	0.017890	0.019090	0.034030
0.001000	0.195320	-0.017470	0.013080	-0.006550	0.037500	0.011030	0.005030	0.038490
0.001020	-0.407280	-0.077820	0.037670	-0.004670	-0.010310	0.024000	0.013730	0.038590
0.001040	-1.024350	-0.060250	-0.005400	0.001980	-0.045580	0.055920	0.030740	0.030020
0.001060	-0.346530	-0.025140	-0.042080	0.010360	-0.005650	0.033480	0.029820	0.030820
0.001080	0.697280	0.021080	-0.025110	0.003530	-0.040680	0.004200	0.026360	0.040450
0.001100	0.350450	0.019220	-0.037680	0.000480	-0.055430	0.018190	0.016930	0.055420
0.001120	0.098900	-0.053900	-0.016080	0.019990	-0.001360	0.020480	-0.003540	0.065280
0.001140	0.669420	-0.000920	0.025610	0.024330	-0.038510	0.024410	-0.000870	0.059260
0.001160	0.150500	0.123830	-0.050760	0.012070	-0.064890	0.056000	0.010840	0.045050
0.001180	-1.069990	0.039680	-0.084000	0.008930	0.004530	0.050280	0.011830	0.026320
0.001200	-0.916260	-0.146010	0.023800	-0.043400	-0.008190	0.010700	0.024870	0.009870
0.001220	0.011450	-0.179210	0.068640	-0.099190	-0.049440	0.003140	0.024900	0.012190
0.001240	0.330030	-0.152210	0.035770	-0.025310	-0.039870	0.003550	-0.002750	0.025750
0.001260	0.380980	-0.250770	-0.011910	0.085650	-0.096170	0.009320	0.000920	0.027980
0.001280	0.203410	-0.358720	-0.073140	0.083780	-0.083630	0.031890	0.025000	0.017960
0.001300	-0.334100	-0.293320	-0.049190	0.013170	0.054690	0.011680	0.008400	0.019160
0.001320	0.006120	-0.118260	-0.032900	-0.040760	0.051270	0.005370	-0.021930	0.035380
0.001340	1.144100	0.066140	-0.163480	-0.042050	-0.054160	0.070250	-0.041370	0.039190
0.001360	1.408330	0.249730	-0.252240	0.019330	-0.075470	0.082890	-0.042590	0.031370
0.001380	0.920820	0.407060	-0.203650	0.061090	-0.085420	0.024440	0.013900	0.006400
0.001400	0.344520	0.519230	-0.142250	-0.021180	-0.060810	0.003250	0.054130	-0.026470
0.001420	-0.454760	0.514510	0.001950	-0.173960	0.035700	0.016970	0.009450	-0.003180
0.001440	-0.761640	0.368880	0.254730	-0.254990	0.037410	0.026100	-0.039560	0.034250
0.001460	-0.177700	0.194190	0.363740	-0.207600	-0.043130	0.047000	-0.050220	-0.005490
0.001480	0.247370	0.099460	0.381380	-0.085860	-0.070180	0.054770	-0.020130	-0.059260
0.001500	-0.057590	0.022410	0.486340	0.016750	-0.136310	0.028370	0.037880	-0.054120
0.001520	-0.516430	-0.188060	0.484070	0.139550	-0.238250	0.030130	0.047210	-0.026100
0.001540	-0.694840	-0.468200	0.348500	0.329790	-0.215580	0.041660	0.002560	-0.003400
0.001560	-0.435830	-0.654940	0.219840	0.456170	-0.108320	-0.009610	-0.025080	0.009340
0.001580	0.350260	-0.735460	0.016510	0.474770	0.028550	-0.112450	-0.003760	-0.018690
0.001600	1.113080	-0.673120	-0.177940	0.409710	0.218350	-0.195650	0.011790	-0.056990
0.001620	1.163870	-0.373510	-0.254110	0.228450	0.360300	-0.183490	-0.039970	-0.021360
0.001640	0.296790	0.058310	-0.403340	0.055290	0.385460	-0.057170	-0.106450	0.034780
0.001660	-0.819040	0.371040	-0.651840	-0.037100	0.343640	0.134920	-0.147920	0.009710
0.001680	-0.951840	0.504810	-0.717450	-0.133610	0.230430	0.280260	-0.165330	-0.047420
0.001700	-0.214220	0.403590	-0.515300	-0.221440	0.094280	0.336210	-0.117140	-0.085470
0.001720	0.276860	-0.116510	-0.153900	-0.303980	0.055490	0.358250	-0.051810	-0.122230
0.001740	0.478250	-0.651790	0.314180	-0.446540	0.029870	0.338240	0.015910	-0.133720
0.001760	0.609950	-0.582810	0.676310	-0.552900	-0.079950	0.278630	0.145630	-0.137160
0.001780	0.161070	-0.229850	0.659560	-0.438550	-0.179000	0.207820	0.253880	-0.156180
0.001800	-0.933990	-0.153680	0.324460	-0.098490	-0.311960	0.123840	0.267450	-0.102500
0.001820	-1.562100	-0.234190	-0.126000	0.264660	-0.507230	0.045730	0.219500	0.033590
0.001840	-0.699370	-0.204960	-0.464760	0.486440	-0.551150	-0.034920	0.136400	0.150910
0.001860	1.018210	-0.055590	-0.423330	0.509420	-0.419230	-0.164700	0.084010	0.229640
0.001880	2.094850	0.020700	-0.188560	0.274630	-0.194870	-0.311590	0.078980	0.255730
0.001900	2.056840	-0.039980	-0.078330	-0.117940	0.159210	-0.410560	0.026840	0.215820
0.001920	1.186430	0.061460	0.056730	-0.399220	0.431980	-0.429860	-0.056830	0.178990
0.001940	-0.447720	0.608870	0.090250	-0.424790	0.402270	-0.300240	-0.114070	0.144990
0.001960	-1.956990	1.278190	-0.241180	-0.284860	0.199680	-0.036960	-0.234300	0.068930
0.001980	-2.276220	1.297240	-0.473430	-0.141740	-0.104750	0.223920	-0.371990	-0.001040
0.002000	-1.978790	0.540920	-0.173300	-0.012050	-0.383840	0.395680	-0.371630	-0.054070
0.002020	-1.246100	-0.450020	0.471020	0.055570	-0.341880	0.403640	-0.273460	-0.137340
0.002040	0.592660	-1.214300	1.172430	-0.103350	-0.142540	0.207140	-0.104960	-0.253800
0.002060	2.430290	-1.427990	1.617990	-0.385800	-0.092070	-0.063230	0.140150	-0.377020
0.002080	2.431900	-1.106360	1.387420	-0.392730	-0.059640	-0.216380	0.323100	-0.433120
0.002100	1.023230	-0.477220	0.488300	0.112780	-0.037440	-0.231330	0.342650	-0.348630
0.002120	-0.327760	0.164180	-0.581290	0.880580	-0.210960	-0.168980	0.190570	-0.145660
0.002140	-1.482480	0.444550	-1.340010	1.430750	-0.329570	-0.070230	-0.069210	0.103150
0.002160	-2.071030	0.445170	-1.413030	1.434200	-0.126210	-0.028250	-0.237180	0.281650
0.002180	-1.444310	0.346170	-0.788560	0.746780	0.248310	-0.090610	-0.214690	0.279600
0.002200	-0.812710	-0.067580	0.068520	-0.356600	0.661710	-0.216910	-0.131770	0.154850
0.002220	-0.956230	-0.584530	0.760390	-1.269940	0.933220	-0.286020	-0.061720	0.030530
0.002240	-0.120790	-0.569460	0.936290	-1.589100	0.800490	-0.122360	0.006370	-0.082300
0.002260	2.234370	-0.434070	0.335340	-1.117180	0.362610	0.260860	-0.005570	-0.149140
0.002280	3.531850	-1.077770	-0.502200	0.010480	-0.196060	0.657720	-0.110130	-0.130710
0.002300	2.616070	-1.740550	-0.800580	1.036750	-0.753630	0.867100	-0.170240	-0.092760
0.002320	1.331360	-1.356480	-0.545500	1.308160	-0.920620	0.716180	-0.079400	-0.076780
0.002340	0.436110	-0.181320	-0.056290	0.820520	-0.532140	0.222580	0.150590	-0.084960
0.002360	-0.608100	1.371970	0.294660	-0.152130	0.054990	-0.322700	0.414510	-0.125600
0.002380	-1.350370	2.622060	0.062570	-1.073910	0.548400	-0.671150	0.588890	-0.155120
0.002400	-1.566420	2.812880	-0.668860	-1.305620	0.746850	-0.724220	0.583580	-0.097310
0.002420	-1.395480	2.091200	-1.312150	-0.711890	0.452930	-0.405780	0.309920	0.099560
0.002440	-0.075700	0.660100	-1.177580	0.242550	-0.060740	0.139580	-0.192500	0.395340
0.002460	1.618580	-1.230300	0.246260	0.778910	-0.456610	0.510800	-0.626140	0.617810
0.002480	1.535560	-2.331190	2.150760	0.443370	-0.707300	0.515180	-0.707120	0.610730
0.002500	-0.111810	-1.674670	2.897050	-0.410720	-0.588220	0.273000	-0.453140	0.370280
0.002520	-2.080640	-0.275310	2.197400	-1.147630	-0.112990	-0.069210	-0.055170	0.001060
0.002540	-3.182820	0.820830	0.749020	-1.281440	0.237040	-0.321560	0.265310	-0.333050
0.002560	-1.631650	1.604840	-0.983070	-0.321570	0.318250	-0.328260	0.332230	-0.470320
0.002580	1.822860	1.413250	-2.279090	1.426310	0.057270	-0.179460	0.182790	-0.376370
0.002600	4.012080	-0.103280	-2.267890	2.527470	-0.502740	-0.001540	-0.017930	-0.164810
0.002620	3.493120	-1.884180	-0.977470	2.174910	-0.629340	0.132370	-0.180900	0.045780
0.002640	1.277030	-2.408380	0.812880	0.733500	-0.114270	0.090390	-0.218060	0.219550
0.002660	-1.059600	-0.893610	2.210650	-1.237370	0.440430	-0.105430	-0.034220	0.273430
0.002680	-2.790310	1.679350	2.175490	-2.786520	0.911360	-0.235340	0.270630	0.131890
0.002700	-3.813140	3.320860	0.680330	-2.812810	1.130930	-0.210140	0.478240	-0.089180
0.002720	-3.412450	2.685910	-1.079050	-1.339110	0.619250	-0.012580	0.506160	-0.218790
0.002740	-1.142480	0.230880	-2.002550	0.671380	-0.295360	0.346070	0.366000	-0.168170
0.002760	1.358930	-2.247860	-1.390740	2.391400	-1.107870	0.585420	0.159640	0.026780
0.002780	2.174970	-3.520360	0.476250	2.864310	-1.753210	0.484270	0.150400	0.196250
0.002800	1.946120	-3.361080	2.270760	1.533670	-1.771330	0.127280	0.431030	0.223160
0.002820	2.021620	-1.934840	2.649310	-0.447290	-0.787220	-0.331730	0.776460	0.111500
0.002840	1.916660	0.246580	1.130130	-1.634050	0.575030	-0.700050	0.977230	-0.076430
0.002860	1.054980	2.151390	-1.356000	-1.530210	1.540160	-0.845170	0.885340	-0.187450
0.002880	0.034780	2.732620	-3.259580	-0.320530	1.902180	-0.841440	0.463440	-0.084860
0.002900	-1.320130	1.911930	-3.557330	1.112700	1.509080	-0.688480	-0.043600	0.142950
0.002920	-3.038850	0.761150	-2.200560	1.723180	0.549200	-0.320920	-0.434010	0.335450
0.002940	-3.275020	0.258810	0.025220	0.973320	-0.242120	0.083860	-0.636110	0.410010
0.002960	-1.449490	0.105920	2.090780	-0.828970	-0.551060	0.434030	-0.566180	0.234660
0.002980	0.313430	-0.321840	2.957990	-2.476540	-0.627780	0.912290	-0.359600	-0.188360
0.003000	0.875570	-1.021390	2.234870	-2.681410	-0.477200	1.319610	-0.238370	-0.557000
0.003020	1.549330	-1.782080	0.827020	-1.348900	-0.072100	1.219000	-0.209450	-0.662020
0.003040	2.964230	-2.055680	-0.171500	0.463230	0.117370	0.703970	-0.258160	-0.557710
0.003060	3.315320	-1.459960	-0.598850	1.926060	-0.139970	-0.042540	-0.326870	-0.306630
0.003080	1.323140	-0.278780	-0.687850	2.530110	-0.504840	-1.011260	-0.192210	0.000270
0.003100	-1.604310	1.224940	-0.734690	1.884140	-0.569420	-1.667360	0.127990	0.194980
0.003120	-3.657800	2.646560	-1.073290	0.519860	-0.189810	-1.411750	0.285580	0.236160
0.003140	-4.076240	3.228470	-1.460730	-0.546940	0.250780	-0.552240	0.081560	0.167830
0.003160	-2.196850	2.496220	-1.368690	-0.948790	0.496030	0.287210	-0.473630	0.108860
0.003180	1.331970	0.442040	-0.666810	-0.880930	0.740890	0.838260	-1.272950	0.284180
0.003200	3.424770	-2.145830	0.622690	-0.687530	0.814980	0.942740	-1.862440	0.663260
0.003220	2.777610	-3.715680	2.134430	-0.770320	0.539790	0.573960	-1.702530	0.894430
0.003240	1.135180	-3.306300	2.991240	-1.085090	0.197570	0.019810	-0.857810	0.698440
0.003260	-0.973680	-1.281310	2.555640	-1.087500	-0.185210	-0.359420	0.203740	0.087570
0.003280	-2.638690	1.148030	0.868560	-0.491450	-0.764740	-0.364550	1.071610	-0.699170
0.003300	-1.714440	2.523360	-1.386450	0.633850	-1.199920	-0.034400	1.387390	-1.306300
0.003320	0.464550	2.273700	-3.050190	1.998710	-1.222960	0.340780	1.085010	-1.313000
0.003340	1.256120	0.974060	-3.223240	2.898880	-0.929230	0.482610	0.421760	-0.604020
0.003360	0.725770	-0.586250	-1.905090	2.617880	-0.272810	0.238710	-0.254660	0.403900
0.003380	-0.195500	-1.372280	0.172890	1.029130	0.623760	-0.439880	-0.542250	1.215780
0.003400	-1.006060	-0.684700	1.858250	-1.216180	1.354110	-1.169200	-0.290530	1.512600
0.003420	-1.254200	0.658250	2.171020	-3.009790	1.714900	-1.337610	0.205490	1.125000
0.003440	-0.444250	1.272930	1.159640	-3.474940	1.658440	-0.817180	0.585770	0.224780
0.003460	0.887010	0.702180	-0.231590	-2.420760	1.064580	0.095010	0.629510	-0.657230
0.003480	0.946960	-0.501860	-1.045250	-0.369350	-0.034210	1.028980	0.211650	-1.047480
0.003500	-0.178110	-1.353310	-0.914510	1.668470	-1.215350	1.574870	-0.423700	-0.837040
0.003520	-0.766430	-1.085010	-0.061090	2.631600	-2.017690	1.444600	-0.737800	-0.254580
0.003540	-0.783370	0.050190	0.800840	2.154330	-2.150630	0.813120	-0.476710	0.255660
0.003560	-0.513650	0.894240	0.885360	0.809610	-1.438820	0.063160	0.233300	0.332640
0.003580	0.456060	0.864460	0.248030	-0.519150	-0.181060	-0.604230	1.037270	-0.045590
0.003600	1.338000	0.301590	-0.462960	-1.148700	1.083440	-1.003920	1.469080	-0.533350
0.003620	1.266670	-0.372010	-0.758040	-0.913540	1.935760	-1.077160	1.270930	-0.695110
0.003640	0.663020	-0.663800	-0.414950	-0.271720	1.935010	-1.009180	0.556280	-0.400380
0.003660	-0.247710	-0.183080	0.153030	0.140520	1.086710	-0.802770	-0.308580	0.213990
0.003680	-1.717720	0.719850	0.316240	0.090460	-0.048120	-0.335210	-0.965470	0.862360
0.003700	-2.569380	1.294420	0.016600	-0.179550	-1.030720	0.338310	-1.163450	1.168130
0.003720	-1.212320	1.105900	-0.496480	-0.308240	-1.527640	1.071570	-0.864660	0.921670
0.003740	1.067470	0.131590	-0.751450	-0.073740	-1.309150	1.577910	-0.384100	0.209450
0.003760	2.049940	-1.046820	-0.304600	0.382460	-0.719620	1.483370	0.000410	-0.611050
0.003780	1.679780	-1.506250	0.555880	0.604400	-0.121580	0.714150	0.318890	-1.148580
0.003800	0.680520	-1.049610	1.194540	0.375550	0.520200	-0.412260	0.599870	-1.228100
0.003820	-0.369780	-0.207100	1.233510	-0.135410	0.943620	-1.404660	0.845570	-0.889300
0.003840	-1.011990	0.500420	0.545460	-0.577850	0.921370	-1.794250	1.053830	-0.359680
0.003860	-1.043170	0.782930	-0.505310	-0.546680	0.690420	-1.415660	1.019710	0.090220
0.003880	-0.252920	0.666620	-1.150500	-0.009670	0.263260	-0.484480	0.583110	0.364360
0.003900	0.869440	0.315950	-1.105910	0.610640	-0.331600	0.606680	-0.152910	0.517940
0.003920	1.166820	-0.191940	-0.626030	0.876660	-0.674600	1.370500	-0.966500	0.605830
0.003940	0.475530	-0.582020	0.069510	0.587530	-0.645890	1.450620	-1.479280	0.654500
0.003960	-0.448870	-0.505780	0.586830	-0.102760	-0.388790	0.928960	-1.359630	0.607870
0.003980	-1.139400	-0.078730	0.547000	-0.709980	0.049010	0.146660	-0.670610	0.310550
0.004000	-1.123770	0.300350	0.151500	-0.833430	0.405780	-0.554800	0.280460	-0.276450
0.004020	-0.254000	0.358640	-0.220760	-0.479990	0.421920	-0.863150	1.087760	-0.955740
0.004040	0.624940	0.045680	-0.374410	0.099480	0.239070	-0.675360	1.329850	-1.391680
0.004060	0.911770	-0.344390	-0.208930	0.569260	0.026750	-0.215920	0.907310	-1.305210
0.004080	0.808730	-0.438320	0.112320	0.645200	-0.181980	0.211630	0.110100	-0.667290
0.004100	0.318970	-0.209530	0.273450	0.352380	-0.277960	0.395480	-0.664110	0.301310
0.004120	-0.795130	0.136590	0.240020	-0.089500	-0.227800	0.273880	-1.079450	1.176080
0.004140	-1.565910	0.406110	0.113760	-0.437680	-0.110160	0.039670	-0.962620	1.484630
0.004160	-0.447150	0.386350	-0.109280	-0.452390	0.093230	-0.075000	-0.465890	1.094750
0.004180	1.647170	0.034520	-0.238860	-0.190450	0.297240	-0.035990	0.054400	0.296380
0.004200	2.238240	-0.365680	-0.076510	0.046510	0.292940	0.084220	0.339070	-0.497930
0.004220	0.890230	-0.506470	0.151670	0.139790	0.133440	0.154240	0.298280	-0.934440
0.004240	-0.908650	-0.211100	0.197840	0.141360	-0.082770	0.065040	0.066380	-0.842240
0.004260	-1.870340	0.418670	0.037750	0.072960	-0.378030	-0.083450	-0.099450	-0.387500
0.004280	-1.451050	0.803990	-0.310360	0.013550	-0.546160	-0.089920	-0.113830	0.091240
0.004300	-0.099020	0.560250	-0.585460	0.072570	-0.432330	0.055390	-0.049520	0.363600
0.004320	0.730560	0.017220	-0.448740	0.183120	-0.189130	0.231830	-0.005360	0.371380
0.004340	0.617890	-0.357620	0.041990	0.189140	0.109410	0.316960	-0.068070	0.208330
0.004360	0.463560	-0.411570	0.602300	0.031030	0.362310	0.160950	-0.207730	0.045080
0.004380	0.325650	-0.196790	0.924040	-0.247910	0.363160	-0.192760	-0.259640	-0.013900
0.004400	-0.124710	0.076720	0.748860	-0.475690	0.222320	-0.481050	-0.122830	-0.002330
0.004420	-0.212160	0.196910	0.179620	-0.427200	0.109710	-0.523820	0.114770	0.001720
0.004440	0.294130	0.123560	-0.398170	-0.077420	-0.060590	-0.289050	0.310090	-0.025810
0.004460	0.225280	-0.149710	-0.626110	0.386700	-0.234330	0.113780	0.315480	-0.065260
0.004480	-0.592420	-0.470380	-0.339000	0.691560	-0.285010	0.445050	0.077400	-0.047550
0.004500	-0.797260	-0.430430	0.213400	0.594160	-0.316650	0.531600	-0.205310	0.087610
0.004520	-0.358730	0.013600	0.534840	0.145170	-0.296370	0.367520	-0.321100	0.255700
0.004540	-0.258950	0.368900	0.420560	-0.332960	-0.100530	0.061630	-0.217420	0.309830
0.004560	-0.160280	0.289300	0.021630	-0.566800	0.110820	-0.197110	0.067640	0.205910
0.004580	0.132380	-0.071410	-0.373870	-0.422710	0.230460	-0.260190	0.343680	-0.017800
0.004600	-0.061640	-0.362190	-0.468370	0.027620	0.269460	-0.161960	0.417310	-0.238110
0.004620	-0.148100	-0.357070	-0.193370	0.444240	0.119620	-0.015110	0.262160	-0.282940
0.004640	0.382150	-0.056320	0.181190	0.517940	-0.125900	0.114770	-0.043330	-0.116510
0.004660	0.507580	0.297840	0.357630	0.240600	-0.209370	0.148320	-0.315180	0.141950
0.004680	-0.017950	0.450970	0.228090	-0.172650	-0.148860	0.071440	-0.370400	0.347040
0.004700	-0.483610	0.340780	-0.122690	-0.426820	-0.044680	-0.023700	-0.208960	0.383280
0.004720	-0.545910	-0.010090	-0.384420	-0.350060	0.106920	-0.098640	0.039890	0.232260
0.004740	-0.060230	-0.422220	-0.288900	-0.069020	0.204450	-0.127780	0.236730	-0.006860
0.004760	0.707270	-0.624900	0.044900	0.158130	0.192030	-0.063620	0.278980	-0.198840
0.004780	0.959760	-0.530910	0.358740	0.199530	0.150660	0.040080	0.147210	-0.234520
0.004800	0.538120	-0.210800	0.517150	0.038120	0.057550	0.097620	-0.056290	-0.099450
0.004820	-0.012610	0.116810	0.382270	-0.190800	-0.096720	0.121920	-0.202900	0.109500
0.004840	-0.553060	0.229840	-0.019290	-0.248160	-0.201840	0.141970	-0.235540	0.257660
0.004860	-0.811290	0.195830	-0.378270	-0.087740	-0.237910	0.152110	-0.146330	0.253630
0.004880	-0.271730	0.146400	-0.529620	0.154300	-0.230370	0.154690	-0.024590	0.125160
0.004900	0.717580	0.088200	-0.466300	0.336170	-0.147020	0.116260	-0.004160	-0.016740
0.004920	1.207640	0.068490	-0.147290	0.333590	-0.026960	-0.000700	-0.087010	-0.080370
0.004940	0.461460	0.094620	0.216630	0.133730	0.086220	-0.146950	-0.175290	-0.047280
0.004960	-0.782160	0.082690	0.360960	-0.122390	0.186710	-0.251520	-0.192450	0.018280
0.004980	-0.938160	0.019710	0.354050	-0.298910	0.178230	-0.276540	-0.118370	0.042630
0.005000	-0.115030	-0.039210	0.247270	-0.331710	0.055910	-0.194290	-0.001900	0.009580
0.005020	0.555970	-0.126690	0.047520	-0.191480	-0.013730	-0.032640	0.069880	-0.040890
0.005040	0.684010	-0.221100	-0.027120	0.026630	-0.023650	0.116360	0.044680	-0.037960
0.005060	-0.107220	-0.163450	0.080890	0.145840	-0.060270	0.185460	-0.047800	0.056020
0.005080	-1.190640	-0.003340	0.175080	0.137120	-0.052370	0.152010	-0.139550	0.207830
0.005100	-0.735790	0.101510	0.202780	0.073260	-0.036560	0.044970	-0.164400	0.311770
0.005120	0.534780	0.150250	0.174440	-0.007770	-0.095890	-0.038160	-0.082680	0.286610
0.005140	0.559570	0.093360	0.057180	-0.054130	-0.078010	-0.052880	0.060320	0.156890
0.005160	0.157400	-0.043790	-0.039770	-0.039350	0.005120	-0.035970	0.183260	-0.012220
0.005180	0.341840	-0.088940	-0.058170	0.016040	0.008130	0.002010	0.226320	-0.138160
0.005200	-0.019470	-0.049240	-0.073230	0.087960	0.056060	0.013590	0.154960	-0.159330
0.005220	-0.805840	-0.032360	-0.056000	0.114430	0.139390	-0.060920	0.026100	-0.101330
0.005240	-0.494290	0.019460	-0.032000	0.060980	0.081360	-0.134420	-0.055330	-0.024920
0.005260	0.428210	0.074500	-0.100790	0.001190	-0.003570	-0.110370	-0.073150	0.021160
0.005280	0.502050	-0.041920	-0.151570	-0.024080	-0.023220	-0.032390	-0.047300	0.014930
0.005300	0.204890	-0.278830	-0.089520	-0.050900	-0.058940	0.067790	0.017340	-0.011730
0.005320	0.311180	-0.431210	0.000830	-0.062460	-0.030340	0.163950	0.051180	-0.013890
0.005340	0.229210	-0.354060	0.123440	-0.058070	0.079710	0.151480	0.019380	0.023270
0.005360	-0.139770	-0.063210	0.212420	-0.105710	0.123110	0.022540	0.000210	0.083360
0.005380	-0.093090	0.187910	0.110620	-0.168830	0.150640	-0.119590	0.025100	0.121080
0.005400	0.153670	0.251050	-0.040300	-0.145100	0.203240	-0.208790	0.068920	0.096410
0.005420	-0.074160	0.183740	-0.117330	-0.042940	0.141890	-0.193100	0.137020	0.010140
0.005440	-0.325640	0.037990	-0.235260	0.085740	0.015890	-0.071020	0.180920	-0.097360
0.005460	-0.037060	-0.131140	-0.277780	0.192690	-0.075660	0.048940	0.144590	-0.179120
0.005480	0.207680	-0.241770	-0.101980	0.186220	-0.181230	0.110900	0.059330	-0.213150
0.005500	0.278050	-0.212950	0.075360	0.054960	-0.189740	0.142540	-0.042760	-0.189810
0.005520	0.716690	-0.039940	0.130220	-0.095260	-0.023460	0.108600	-0.129680	-0.101770
0.005540	0.779030	0.158850	0.139100	-0.204940	0.116370	0.011540	-0.154100	0.001970
0.005560	-0.234460	0.232850	0.067420	-0.240350	0.171450	-0.059480	-0.124830	0.052540
0.005580	-1.054040	0.179530	-0.045230	-0.167590	0.205390	-0.097430	-0.070460	0.051650
0.005600	-0.602590	0.188530	-0.059610	-0.055400	0.119640	-0.114690	-0.000060	0.012880
0.005620	0.018320	0.284350	-0.031360	0.031510	-0.022270	-0.080290	0.048150	-0.056720
0.005640	-0.223370	0.270350	-0.009330	0.078640	-0.060660	-0.051890	0.035030	-0.092210
0.005660	-0.321040	0.138440	0.065990	0.043130	-0.065470	-0.061160	-0.002460	-0.071410
0.005680	0.313510	0.008930	0.149830	-0.047170	-0.027980	-0.044970	-0.012340	-0.050970
0.005700	0.614980	-0.172160	0.195870	-0.101340	0.083270	-0.030360	-0.002800	-0.043140
0.005720	0.398770	-0.370040	0.238030	-0.092960	0.083930	-0.039650	0.020270	-0.034400
0.005740	0.254770	-0.367770	0.242760	-0.039320	-0.007390	-0.004790	0.064990	-0.046060
0.005760	-0.131380	-0.182760	0.153190	0.040660	-0.020970	0.051870	0.097830	-0.075850
0.005780	-0.480110	0.012820	-0.009540	0.106160	-0.032380	0.081570	0.100020	-0.092860
0.005800	0.053770	0.141160	-0.198270	0.131890	-0.075240	0.098870	0.083050	-0.087400
0.005820	0.743170	0.134800	-0.322200	0.120180	-0.030610	0.068390	0.047480	-0.061600
0.005840	0.399970	0.073200	-0.273200	0.062730	0.028390	-0.018960	0.015900	-0.028220
0.005860	-0.407060	0.088010	-0.145200	-0.017790	0.026980	-0.084490	0.018080	-0.006650
0.005880	-0.565070	0.073260	-0.059710	-0.073010	0.068610	-0.107100	0.043610	0.004350
0.005900	-0.383930	-0.004010	0.036800	-0.118630	0.113030	-0.103340	0.079420	0.006830
0.005920	-0.359240	-0.043110	0.071260	-0.155740	0.095450	-0.057040	0.107800	-0.028530
0.005940	-0.004670	-0.030060	-0.034580	-0.126110	0.105200	-0.007850	0.106060	-0.105830
0.005960	0.397170	0.071710	-0.111790	-0.044000	0.098760	-0.005160	0.104190	-0.182870
0.005980	0.084940	0.178460	-0.105210	0.025810	0.023730	-0.015850	0.126810	-0.230420
0.006000	-0.308160	0.088040	-0.079190	0.074340	-0.005250	-0.016250	0.124050	-0.235000
0.006020	-0.150040	-0.091310	0.032790	0.087090	-0.005500	-0.009630	0.091510	-0.179660
0.006040	-0.026420	-0.157650	0.183460	0.025890	-0.043590	0.021520	0.069410	-0.078460
0.006060	-0.022670	-0.161480	0.217860	-0.074420	-0.025230	0.056280	0.034280	0.026710
0.006080	0.286720	-0.141530	0.164950	-0.157720	0.044060	0.048200	-0.012570	0.080320
0.006100	0.382900	-0.010970	0.085320	-0.216950	0.085050	0.004250	-0.038790	0.042580
0.006120	0.054440	0.177280	-0.040210	-0.200690	0.144680	-0.055040	-0.057810	-0.051930
0.006140	-0.072990	0.262970	-0.170440	-0.071870	0.163190	-0.113150	-0.061690	-0.131120
0.006160	-0.291940	0.242250	-0.250580	0.090170	0.041560	-0.118810	-0.046860	-0.162250
0.006180	-0.600020	0.160960	-0.265900	0.201500	-0.090360	-0.053790	-0.050970	-0.148850
0.006200	-0.413900	0.040010	-0.190500	0.223840	-0.168840	0.034220	-0.066340	-0.113820
0.006220	-0.275930	0.008810	-0.051170	0.148260	-0.245920	0.111880	-0.073270	-0.089570
0.006240	0.002760	0.033580	0.066400	0.039440	-0.191100	0.147500	-0.087250	-0.074980
0.006260	0.896740	-0.040650	0.153910	-0.066240	0.014230	0.086450	-0.094050	-0.054750
0.006280	1.029540	-0.128810	0.213480	-0.174050	0.161250	-0.041960	-0.068040	-0.029630
0.006300	-0.186440	-0.148820	0.191390	-0.206460	0.233370	-0.150240	-0.023090	0.010670
0.006320	-1.073800	-0.128560	0.112780	-0.128550	0.241400	-0.212640	0.023660	0.059670
0.006340	-0.454100	-0.010990	0.002790	-0.021480	0.095840	-0.196810	0.064390	0.082960
0.006360	0.493760	0.132010	-0.147470	0.088320	-0.057170	-0.076460	0.070260	0.078950
0.006380	0.359260	0.144460	-0.240920	0.172620	-0.092690	0.058660	0.030650	0.058670
0.006400	-0.227350	0.105310	-0.234470	0.151260	-0.108390	0.149760	-0.007240	0.025200
0.006420	-0.507920	0.133200	-0.184560	0.062610	-0.089690	0.195480	-0.025750	0.005070
0.006440	-0.494780	0.128010	-0.073060	-0.015700	-0.014130	0.139620	-0.030450	0.022190
0.006460	0.188190	0.033530	0.069630	-0.086310	0.014030	0.028530	0.011610	0.053700
0.006480	0.555360	-0.013160	0.124880	-0.127080	0.031260	-0.018650	0.080340	0.064970
0.006500	-0.539030	0.040330	0.115120	-0.101930	0.067540	-0.015750	0.119270	0.048510
0.006520	-1.196950	0.124600	0.093130	-0.042660	0.018670	-0.006480	0.125790	0.005050
0.006540	-0.214060	0.176100	0.023180	0.011130	-0.054330	0.014930	0.086890	-0.050480
0.006560	0.580350	0.108250	-0.012900	0.048710	-0.058660	0.012960	0.015430	-0.066400
0.006580	0.401900	0.001480	0.037770	0.045260	-0.073370	-0.033170	-0.018960	-0.012520
0.006600	0.178910	0.065360	0.028330	0.012460	-0.077540	-0.067800	-0.010670	0.076520
0.006620	0.052730	0.236180	-0.023040	-0.009120	-0.017280	-0.073540	-0.002590	0.152630
0.006640	-0.160470	0.248730	0.018320	-0.037690	0.007300	-0.068160	0.014140	0.185410
0.006660	-0.249390	0.067030	0.063230	-0.061900	-0.003430	-0.044360	0.052060	0.162470
0.006680	-0.252330	-0.111760	0.021390	-0.019810	0.007740	-0.019090	0.087900	0.096350
0.006700	-0.193780	-0.123100	-0.013850	0.054470	-0.034590	-0.006890	0.105290	0.009600
0.006720	0.122910	-0.026000	-0.034830	0.089650	-0.099150	0.006940	0.107910	-0.057950
0.006740	0.309510	0.007370	-0.056700	0.084260	-0.094060	0.012020	0.096810	-0.049900
0.006760	-0.118910	0.008610	0.009900	0.046980	-0.097820	0.018470	0.073270	0.036860
0.006780	-0.463760	0.068550	0.076770	-0.003210	-0.115580	0.044680	0.037650	0.131730
0.006800	-0.203480	0.107690	0.021000	-0.020760	-0.057440	0.046660	0.002330	0.160300
0.006820	-0.014170	0.083390	-0.021520	-0.000250	0.009810	0.009510	-0.002670	0.115040
0.006840	0.082300	-0.012220	-0.004630	0.019010	0.046690	-0.030500	0.023210	0.028600
0.006860	0.440410	-0.151900	-0.043800	0.047650	0.096080	-0.073350	0.043670	-0.056590
0.006880	0.508730	-0.134890	-0.086800	0.102600	0.084370	-0.111070	0.060810	-0.092010
0.006900	0.036520	0.034520	-0.083450	0.128780	0.003400	-0.094520	0.071700	-0.068130
0.006920	-0.507380	0.073470	-0.096550	0.088780	-0.030760	-0.037190	0.046370	-0.010330
0.006940	-0.677640	0.000800	-0.067120	0.030220	-0.044810	0.017280	0.012670	0.062320
0.006960	-0.101750	0.025630	0.024520	-0.009410	-0.076580	0.071070	-0.012870	0.114280
0.006980	0.778060	0.074340	0.056700	-0.032130	-0.031090	0.108210	-0.054850	0.115230
0.007000	0.670070	0.055460	0.040690	-0.026110	0.034210	0.101510	-0.083040	0.089690
0.007020	-0.445500	0.017360	0.053480	-0.016730	0.032400	0.074960	-0.072670	0.070840
0.007040	-0.830100	-0.019580	0.054500	-0.034360	0.045180	0.045240	-0.057640	0.050170
0.007060	0.052390	-0.010690	0.023070	-0.045820	0.030050	0.001870	-0.043360	0.016070
0.007080	0.555700	0.039560	-0.003460	-0.025120	-0.067440	-0.020910	-0.030680	-0.020380
0.007100	-0.042580	0.030080	-0.013980	0.021290	-0.078560	-0.003750	-0.049440	-0.046140
0.007120	-0.362030	0.004950	-0.016290	0.070360	-0.012850	0.014490	-0.083000	-0.048830
0.007140	0.134450	0.059130	-0.052710	0.086140	-0.022780	0.033590	-0.102140	-0.028380
0.007160	0.093410	0.059100	-0.128920	0.073730	-0.033980	0.056390	-0.133960	0.007190
0.007180	-0.806150	-0.065140	-0.155770	0.049740	-0.024820	0.034930	-0.164410	0.058160
0.007200	-1.012600	-0.103000	-0.092390	0.001290	-0.071170	-0.015210	-0.140910	0.104350
0.007220	-0.032380	-0.000760	0.010790	-0.037360	-0.064780	-0.033330	-0.088490	0.121780
0.007240	1.140500	0.064920	0.093710	-0.047820	0.010070	-0.029640	-0.059150	0.114260
0.007260	1.580830	0.044740	0.111400	-0.062650	0.009850	-0.018160	-0.042990	0.073870
0.007280	0.452120	0.004690	0.065060	-0.060030	-0.004610	0.010120	-0.033010	0.001030
0.007300	-1.127650	0.011340	-0.005670	-0.027020	0.029460	0.017870	-0.038140	-0.057800
0.007320	-0.669440	0.102680	-0.083810	0.001510	0.003120	0.001610	-0.026310	-0.075350
0.007340	0.621840	0.129910	-0.135900	0.034010	-0.055410	0.000770	-0.000600	-0.064550
0.007360	0.405480	-0.003590	-0.077460	0.060130	-0.072190	0.001820	0.000910	-0.036240
0.007380	-0.077920	-0.083720	0.038260	0.048760	-0.088800	0.007850	-0.003150	-0.016700
0.007400	0.114640	-0.009310	0.061040	0.049500	-0.078140	0.036180	0.003450	-0.025350
0.007420	0.146420	0.007220	0.049040	0.076450	-0.021500	0.042590	0.000920	-0.044250
0.007440	0.070540	-0.135870	0.072960	0.065210	0.003140	0.022140	-0.002870	-0.054580
0.007460	0.140970	-0.243930	0.034450	0.031890	0.014980	0.009210	0.000540	-0.048170
0.007480	0.210300	-0.107600	-0.015570	0.019740	0.045090	-0.010670	0.002540	-0.023240
0.007500	0.126650	0.135280	0.005790	0.000820	0.029900	-0.024620	0.013770	0.010220
0.007520	-0.177200	0.177960	-0.002230	-0.030040	-0.005380	0.002040	0.020180	0.035720
0.007540	-0.234080	0.024200	0.008780	-0.043400	-0.000160	0.031150	0.003330	0.029640
0.007560	-0.057140	-0.084970	0.099740	-0.039390	0.003800	0.039130	-0.009940	-0.017350
0.007580	-0.212430	-0.072480	0.076780	-0.014170	0.002150	0.050080	-0.007960	-0.071460
0.007600	-0.537950	-0.044970	-0.032820	0.027870	0.002640	0.052070	-0.003260	-0.094920
0.007620	-0.378340	-0.062160	-0.014310	0.036520	-0.040220	0.042250	0.015830	-0.095000
0.007640	0.254690	-0.094940	0.037030	0.015690	-0.057720	0.033630	0.044070	-0.085730
0.007660	0.308930	-0.114590	-0.007650	0.025080	-0.003420	0.009160	0.044690	-0.056120
0.007680	-0.336440	-0.087670	-0.049390	0.052480	0.005580	-0.016480	0.017340	-0.017820
0.007700	-0.215540	-0.040750	-0.062430	0.062220	-0.013520	-0.011220	-0.012240	0.016080
0.007720	0.428930	-0.042910	-0.076460	0.050130	0.045220	0.006810	-0.038460	0.047830
0.007740	-0.097370	-0.051860	-0.058690	0.006420	0.079460	0.031770	-0.059930	0.060820
0.007760	-0.848940	-0.015920	-0.051550	-0.048520	0.048440	0.072730	-0.074360	0.051340
0.007780	-0.069070	0.006900	-0.074930	-0.081670	0.048270	0.079020	-0.082510	0.029170
0.007800	0.926110	0.014650	-0.038960	-0.098770	0.035870	0.033250	-0.082100	-0.007880
0.007820	0.691490	0.035470	0.012820	-0.103900	0.020630	-0.007320	-0.073090	-0.051880
0.007840	0.020910	0.032590	-0.014640	-0.076090	0.076040	-0.027170	-0.053370	-0.086810
0.007860	-0.245420	0.057150	-0.050020	-0.032660	0.069180	-0.026060	-0.024730	-0.108230
0.007880	-0.096610	0.108460	-0.049530	0.010090	-0.028950	0.019960	-0.016980	-0.108610
0.007900	0.221630	0.009300	-0.055270	0.068270	-0.054700	0.061760	-0.041730	-0.089240
0.007920	0.463720	-0.180610	-0.015690	0.094480	-0.057890	0.058890	-0.064720	-0.067050
0.007940	0.392330	-0.209180	0.063690	0.043420	-0.117600	0.056770	-0.074280	-0.036520
0.007960	0.312450	-0.093770	0.084960	-0.016970	-0.117580	0.047390	-0.081890	0.010870
0.007980	0.550330	0.022570	0.063910	-0.042030	-0.045970	0.011940	-0.079090	0.054220
0.008000	0.134390	0.057480	0.048610	-0.076020	0.034970	0.005500	-0.076010	0.073300
0.008020	-0.838440	-0.011580	0.029480	-0.105810	0.130310	0.016900	-0.092720	0.065760
0.008040	-0.555250	-0.037980	0.006100	-0.099340	0.158710	0.006300	-0.102620	0.044290
0.008060	0.262590	0.084860	-0.028900	-0.082250	0.082050	0.012910	-0.098080	0.032550
0.008080	-0.156560	0.133900	-0.038440	-0.047880	0.026760	0.033380	-0.115450	0.037490
0.008100	-0.362080	-0.020510	0.024800	-0.001880	-0.007320	0.035950	-0.119160	0.044030
0.008120	0.626840	-0.097100	0.075850	0.011760	-0.085350	0.054260	-0.072840	0.040870
0.008140	0.890330	-0.003520	0.040940	0.031780	-0.104420	0.081960	-0.039280	0.036620
0.008160	0.125690	0.005130	0.000940	0.057870	-0.053670	0.065420	-0.028490	0.031420
0.008180	-0.133920	-0.098250	0.007560	0.025160	-0.048760	0.022150	0.004030	0.023880
0.008200	-0.230310	-0.133530	0.040730	-0.015310	-0.026720	-0.016590	0.037400	0.042410
0.008220	-0.696880	-0.064300	0.087460	-0.021210	0.039960	-0.049910	0.048620	0.089800
0.008240	-0.389870	0.025450	0.069340	-0.025940	0.042860	-0.046470	0.038220	0.118670
0.008260	0.533700	0.067820	-0.008970	-0.027930	0.033900	-0.006060	0.006450	0.115000
0.008280	0.445770	0.049210	-0.024370	-0.042820	0.058780	0.015140	-0.029340	0.108750
0.008300	-0.345250	0.054150	-0.037400	-0.075050	0.049010	0.018440	-0.055400	0.105080
0.008320	-0.469410	0.128550	-0.116610	-0.064540	0.037640	0.035670	-0.069340	0.086950
0.008340	-0.341710	0.161760	-0.091800	-0.015080	0.037000	0.035560	-0.059950	0.055330
0.008360	-0.357890	0.071640	0.019730	0.012030	-0.003490	0.017990	-0.019300	0.028580
0.008380	0.438090	-0.068090	-0.001020	0.000490	-0.019010	0.011440	0.024870	0.013540
0.008400	1.252130	-0.103140	-0.053790	-0.024990	0.010120	-0.006530	0.046250	0.011340
0.008420	0.188570	0.003330	0.017140	-0.043920	-0.010090	-0.023300	0.064280	0.014950
0.008440	-1.298000	0.045550	0.072040	-0.044480	-0.032900	-0.018700	0.072680	0.016030
0.008460	-0.647960	-0.026550	0.077110	-0.023790	0.003110	-0.010770	0.043230	0.035220
0.008480	0.817070	-0.027700	0.115720	-0.008680	0.012590	0.007020	0.009920	0.077050
0.008500	0.616130	-0.018640	0.095520	-0.019660	-0.005160	0.025470	-0.006600	0.101950
0.008520	-0.515580	-0.081770	0.018900	-0.046570	-0.009690	0.019510	-0.033370	0.095140
0.008540	-0.789460	-0.023110	0.013920	-0.070110	-0.020720	0.002680	-0.056030	0.081200
0.008560	-0.265450	0.117000	0.009800	-0.061190	0.017790	-0.017240	-0.057990	0.059590
0.008580	0.191020	0.091790	-0.055630	-0.022630	0.063290	-0.043010	-0.051890	0.030060
0.008600	0.136080	0.000140	-0.076430	0.004900	0.008700	-0.055680	-0.031140	0.022520
0.008620	-0.333650	0.031890	-0.036470	0.014730	-0.027350	-0.043450	-0.012880	0.039210
0.008640	-0.807160	0.082840	0.001390	0.018800	0.010480	-0.009220	-0.010930	0.063920
0.008660	-0.896350	0.045020	0.024220	0.011970	-0.018410	0.030690	0.002760	0.091480
0.008680	-0.348590	-0.033880	0.051480	0.006050	-0.058690	0.042630	0.020000	0.117110
0.008700	0.447200	-0.094640	0.111880	0.001420	-0.003280	0.017750	0.012920	0.134940
0.008720	0.786270	-0.064540	0.140310	-0.026330	0.029500	-0.007850	0.006100	0.128020
0.008740	0.573180	0.046340	0.076180	-0.055330	0.023460	-0.019380	0.015440	0.097780
0.008760	0.225530	0.054310	0.018290	-0.050780	0.060540	-0.051210	0.031140	0.074230
0.008780	-0.149960	-0.031120	0.027620	-0.032120	0.051640	-0.092260	0.050730	0.067950
0.008800	-0.496430	0.014230	0.020450	0.007810	0.002240	-0.081570	0.049320	0.061160
0.008820	-0.236880	0.134840	-0.034500	0.074740	0.025640	-0.041580	0.025720	0.043450
0.008840	0.298270	0.147280	-0.083530	0.083560	0.019500	-0.022730	0.025140	0.035280
0.008860	0.373320	0.105380	-0.095620	0.013770	-0.060480	0.004650	0.033160	0.052350
0.008880	0.340000	0.072940	-0.065560	-0.042270	-0.059390	0.034070	0.021810	0.063940
0.008900	0.179270	0.058800	-0.002570	-0.052930	0.000320	0.027010	0.041070	0.047950
0.008920	-0.246780	0.062740	0.030990	-0.040720	0.024790	0.009850	0.091570	0.033380
0.008940	-0.306330	-0.000590	0.030670	-0.014150	0.048870	-0.007630	0.097730	0.042340
0.008960	0.173790	-0.055740	0.054930	-0.007330	0.047630	-0.037500	0.069580	0.049970
0.008980	0.596640	-0.005890	0.048360	-0.022760	0.006350	-0.040740	0.062580	0.028890
0.009000	0.505750	0.015250	0.006490	-0.014180	-0.008790	-0.019520	0.051810	0.003010
0.009020	0.284300	-0.015880	0.016560	0.013300	-0.025200	-0.021320	0.026930	-0.004470
0.009040	0.358260	-0.005030	0.024950	0.028920	-0.052190	-0.037780	0.015510	-0.010660
0.009060	0.277020	0.002730	0.001610	0.038050	-0.010370	-0.051370	0.005850	-0.017790
0.009080	-0.221270	-0.004820	-0.001260	0.029120	0.043970	-0.066520	0.005150	-0.013790
0.009100	-0.594890	0.053060	0.004240	-0.008940	0.035470	-0.066640	0.023670	-0.004350
0.009120	-0.287030	0.106090	0.005890	-0.032600	0.029600	-0.049240	0.034190	-0.002430
0.009140	0.307440	0.055380	0.013040	-0.034930	0.037090	-0.035450	0.046270	-0.013800
0.009160	0.160290	0.017320	0.009040	-0.042640	0.018290	-0.015090	0.065060	-0.038430
0.009180	-0.316020	0.029690	-0.004980	-0.037200	0.011260	0.010320	0.059670	-0.065190
0.009200	-0.075440	0.027960	0.005870	-0.009770	-0.012690	0.013110	0.042500	-0.076030
0.009220	-0.006320	0.058800	0.008180	0.018770	-0.073170	0.008660	0.031430	-0.075220
0.009240	-0.562990	0.066460	-0.025210	0.048860	-0.063290	0.008900	0.023000	-0.077490
0.009260	-0.166380	0.001740	-0.007020	0.068390	-0.004410	-0.014220	0.035730	-0.084070
0.009280	1.081670	-0.007450	0.035520	0.056140	-0.002880	-0.042550	0.064700	-0.095870
0.009300	1.048220	0.022310	0.002260	0.044200	0.004760	-0.051750	0.066860	-0.099350
0.009320	-0.424860	-0.025980	-0.030950	0.027900	0.057360	-0.067940	0.045430	-0.101350
0.009340	-1.109390	-0.065170	-0.004110	-0.019950	0.071600	-0.078210	0.045540	-0.121700
0.009360	-0.126420	-0.000070	0.004890	-0.038790	0.071690	-0.056920	0.065150	-0.120040
0.009380	0.634810	0.058930	-0.020710	-0.007010	0.081590	-0.036480	0.072750	-0.090440
0.009400	0.124830	0.039310	-0.059440	0.010310	0.038210	-0.017120	0.070490	-0.083960
0.009420	-0.382890	0.006060	-0.097680	0.017090	-0.012770	0.020970	0.066460	-0.098260
0.009440	-0.335780	0.008320	-0.061640	0.033950	-0.024970	0.041190	0.062530	-0.105330
0.009460	-0.156740	0.024690	0.009720	0.029650	-0.033700	0.038670	0.063960	-0.106270
0.009480	-0.097880	-0.015800	0.001930	0.016950	-0.012610	0.037250	0.057240	-0.118850
0.009500	-0.432430	-0.107330	-0.018350	0.010500	0.022810	0.011450	0.040310	-0.145460
0.009520	-0.349330	-0.087850	0.010170	-0.014580	0.015210	-0.033110	0.036770	-0.159620
0.009540	0.611230	0.053530	-0.009360	-0.015990	0.026360	-0.045020	0.033930	-0.143050
0.009560	1.007720	0.080600	-0.055710	0.037350	0.054180	-0.031780	0.014600	-0.111250
0.009580	0.290260	-0.056850	-0.026710	0.070110	0.011170	-0.021980	0.005930	-0.086480
0.009600	-0.432610	-0.135040	-0.015940	0.051390	-0.024900	-0.004640	0.004890	-0.067280
0.009620	-0.589170	-0.036390	-0.071860	0.029830	0.011410	0.010110	-0.011790	-0.050190
0.009640	-0.210750	0.097470	-0.065350	0.002230	0.022760	0.012380	-0.025880	-0.043370
0.009660	0.575170	0.068570	-0.009750	-0.039780	0.010260	0.006120	-0.027410	-0.048590
0.009680	0.647230	-0.037480	0.028650	-0.053400	0.025760	-0.013640	-0.030000	-0.057080
0.009700	-0.280270	0.022370	0.055680	-0.033400	0.021750	-0.016240	-0.021980	-0.063780
0.009720	-0.602510	0.162360	0.021410	-0.009920	0.015180	0.000730	0.000190	-0.068150
0.009740	-0.118310	0.127220	-0.050980	0.011160	0.031550	-0.005760	0.003220	-0.078090
0.009760	-0.076760	0.004720	-0.042150	0.003150	-0.008450	-0.015420	-0.012690	-0.095200
0.009780	-0.441190	-0.021270	-0.003280	-0.024220	-0.069500	0.005630	-0.014300	-0.100720
0.009800	-0.514330	0.018420	-0.038170	-0.009450	-0.052200	0.023650	-0.012230	-0.083960
0.009820	-0.148010	0.083220	-0.060360	0.021340	-0.029770	0.027420	-0.016050	-0.062600
0.009840	0.373710	0.077200	-0.012040	0.012620	-0.032980	0.038910	-0.015410	-0.040990
0.009860	0.372340	-0.082340	0.007980	-0.011040	0.018910	0.029400	-0.016790	-0.010110
0.009880	-0.209830	-0.155560	-0.016520	-0.018040	0.054200	-0.003610	-0.014700	0.011750
0.009900	-0.479350	-0.025900	-0.039190	-0.008310	0.022420	-0.004290	-0.000960	0.009660
0.009920	-0.161720	0.039020	-0.056630	0.016940	0.016680	0.010810	0.008540	0.006470
0.009940	0.217900	-0.006690	-0.026520	0.026830	0.012770	0.000560	0.014520	0.007250
0.009960	0.287570	0.000540	0.026610	0.008480	-0.019100	0.010280	0.014110	-0.003440
0.009980	0.091960	0.021550	-0.001650	0.000410	-0.005150	0.038060	-0.007610	-0.009520
0.010000	0.073840	0.029050	-0.049150	0.005210	0.000010	0.024180	-0.022040	0.002780
0.010020	0.221760	0.027470	-0.030190	0.000220	-0.043320	0.004890	-0.015960	0.024820
0.010040	0.179600	-0.057340	0.000040	-0.008600	-0.021900	0.024070	-0.024430	0.056290
0.010060	0.185530	-0.110110	0.028950	-0.010640	0.021550	0.041680	-0.028510	0.079610
0.010080	0.060360	-0.013880	0.034610	-0.013290	-0.007750	0.046150	-0.005930	0.067050
0.010100	-0.298850	0.042130	-0.023160	-0.012140	-0.008090	0.041310	-0.006160	0.048590
0.010120	0.027250	-0.060210	-0.043480	-0.006230	0.019090	0.012820	-0.028980	0.059900
0.010140	0.689110	-0.139510	0.011440	-0.015740	-0.027190	0.003150	-0.023600	0.075410
0.010160	0.515750	-0.100420	0.042450	-0.011220	-0.057400	0.021470	-0.012100	0.077870
0.010180	0.142590	-0.016250	0.040730	0.029370	-0.032070	0.016140	-0.027350	0.091030
0.010200	0.159910	0.059350	0.035250	0.031760	-0.035730	0.010440	-0.044800	0.108950
0.010220	-0.140560	0.040790	0.017560	-0.026130	-0.020790	0.032130	-0.055510	0.102790