0.000000	0.213250	-0.160250	-0.041310	0.060660	-0.014290	-0.017460	0.142620	0.034780
0.000020	0.191480	-0.126870	-0.037410	0.052150	-0.009790	-0.019840	0.133200	0.023630
0.000040	0.094580	0.022380	-0.017150	-0.010230	0.012330	-0.005970	0.095170	-0.083220
0.000060	-0.051210	0.230050	0.012010	-0.104150	0.043580	0.015370	0.026910	-0.261480
0.000080	-0.108290	0.246180	-0.001320	-0.111010	0.042150	0.006870	-0.018220	-0.309370
0.000100	-0.093680	0.136670	-0.044960	-0.064220	0.008390	-0.008690	-0.026700	-0.208650
0.000120	-0.104350	0.150760	-0.032450	-0.105340	-0.003340	0.025130	-0.050060	-0.165350
0.000140	-0.107950	0.137960	-0.017790	-0.134000	0.015050	0.057060	-0.078970	-0.162690
0.000160	-0.130640	0.063280	-0.032670	-0.063280	0.012560	0.034550	-0.078420	-0.109480
0.000180	-0.132580	0.112640	0.022870	-0.048820	-0.004720	0.024510	-0.072280	-0.082620
0.000200	-0.082800	0.132860	0.061250	-0.070260	0.005280	0.029460	-0.082340	-0.081890
0.000220	-0.121790	0.070620	0.015840	-0.044380	0.004890	0.006870	-0.084810	-0.058890
0.000240	-0.181640	0.085010	0.011950	-0.072760	-0.017120	0.008600	-0.076390	-0.046040
0.000260	-0.127680	0.054100	0.017510	-0.098570	-0.005410	0.035500	-0.074750	-0.035490
0.000280	-0.106330	-0.021120	-0.007880	-0.035960	0.014390	0.028690	-0.067080	-0.001240
0.000300	-0.116830	0.050430	0.035880	-0.018010	0.002210	0.025140	-0.061160	0.017160
0.000320	-0.088200	0.108660	0.077750	-0.040680	-0.000680	0.037060	-0.073380	0.008640
0.000340	-0.122510	0.043230	0.041280	-0.009740	-0.009200	0.030590	-0.074560	0.008610
0.000360	-0.153080	0.042000	0.032710	-0.022830	-0.030150	0.035890	-0.066140	0.010770
0.000380	-0.073180	0.052540	0.031120	-0.066750	-0.014280	0.055590	-0.067570	0.004060
0.000400	-0.054910	-0.019750	0.003400	-0.043590	0.003040	0.048790	-0.056720	-0.003140
0.000420	-0.106720	0.009790	0.047170	-0.032070	-0.013400	0.039610	-0.044320	-0.021280
0.000440	-0.062700	0.071790	0.094220	-0.034290	-0.009240	0.039760	-0.057570	-0.049400
0.000460	-0.030940	0.013940	0.061530	0.004900	0.004920	0.024410	-0.054750	-0.065780
0.000480	-0.080100	0.019810	0.044720	-0.010210	-0.014310	0.020140	-0.032250	-0.074920
0.000500	-0.087080	0.052470	0.023340	-0.050510	-0.024250	0.033160	-0.035640	-0.072470
0.000520	-0.064450	-0.038300	-0.036430	-0.012700	-0.019640	0.031620	-0.043800	-0.056020
0.000540	-0.067960	-0.033050	0.008350	0.002760	-0.023380	0.031380	-0.035390	-0.051150
0.000560	-0.039310	0.073670	0.084110	-0.009260	-0.004760	0.032640	-0.036480	-0.048690
0.000580	-0.020440	0.047530	0.039590	0.031350	0.021110	0.015700	-0.037170	-0.031070
0.000600	-0.058080	0.011030	0.005410	0.016050	0.018600	0.024940	-0.022300	-0.016860
0.000620	-0.062460	0.036500	0.017960	-0.041550	0.017980	0.053610	-0.016550	-0.003990
0.000640	-0.049330	-0.009800	-0.006780	-0.005580	0.028410	0.035760	-0.016090	0.010070
0.000660	-0.054550	-0.026420	0.029120	0.029300	0.015290	0.009660	-0.007030	0.012580
0.000680	-0.017680	0.036150	0.083030	-0.006070	0.003530	0.024750	-0.009250	0.018810
0.000700	-0.018100	0.036860	0.024140	-0.002430	0.016030	0.025440	-0.016850	0.039040
0.000720	-0.092220	0.029880	-0.013210	-0.004700	0.011650	0.010870	-0.009890	0.049450
0.000740	-0.083410	0.038030	0.011850	-0.043950	0.001830	0.022600	-0.010630	0.046700
0.000760	-0.030130	-0.040840	-0.017550	0.003660	0.013750	0.018120	-0.010190	0.050260
0.000780	-0.046640	-0.057110	-0.012800	0.059170	0.004760	-0.003540	0.011110	0.054000
0.000800	-0.020700	0.043100	0.055550	0.012450	0.000410	0.003140	0.010690	0.037690
0.000820	0.020500	0.044610	0.054550	-0.007070	0.027210	0.000460	-0.014530	0.014370
0.000840	-0.036370	0.002330	0.012450	0.007660	0.017350	-0.013390	-0.013860	0.008460
0.000860	-0.062780	0.034740	-0.013340	-0.021560	0.006750	-0.006490	-0.002540	0.005890
0.000880	-0.015110	-0.015990	-0.050770	-0.000100	0.036970	-0.003070	-0.007610	-0.001660
0.000900	-0.002710	-0.082950	-0.032870	0.054880	0.022840	-0.005150	-0.011520	-0.003570
0.000920	0.022090	0.003930	0.027390	0.043910	-0.006880	0.009850	-0.021410	-0.012720
0.000940	0.037790	0.053070	0.008920	0.023730	0.018020	0.009590	-0.031650	-0.035290
0.000960	-0.028500	0.011190	-0.026560	0.004640	0.020220	-0.005430	-0.020030	-0.054970
0.000980	-0.053680	0.018640	-0.016070	-0.036420	0.012150	0.003040	-0.017970	-0.063220
0.001000	0.006230	-0.025070	-0.054570	-0.018400	0.040820	0.003990	-0.022700	-0.056230
0.001020	0.031520	-0.063190	-0.080380	0.024760	0.027840	-0.011040	-0.000210	-0.044110
0.001040	0.025130	0.046990	-0.025160	0.015140	-0.008450	-0.006330	0.015540	-0.042290
0.001060	-0.007810	0.066650	-0.016910	0.021870	0.003820	-0.024780	0.007550	-0.032210
0.001080	-0.052590	-0.036970	-0.036620	0.021490	0.013410	-0.055240	0.015650	-0.001600
0.001100	-0.002310	-0.052120	-0.013090	-0.043580	-0.005130	-0.032310	0.020670	0.019740
0.001120	0.048940	-0.047490	-0.056060	-0.042940	-0.012180	-0.019050	-0.000060	0.027910
0.001140	-0.067930	-0.030410	-0.113810	0.030900	-0.013900	-0.053370	0.005990	0.047280
0.001160	-0.195420	0.071770	-0.063110	0.014500	-0.002440	-0.056350	0.035370	0.071360
0.001180	-0.189540	0.068640	-0.010400	-0.021460	0.031830	-0.027780	0.027130	0.091290
0.001200	-0.150980	-0.054250	0.001270	0.011310	0.029380	-0.017600	0.006030	0.108410
0.001220	-0.050300	-0.114810	0.007990	0.013130	-0.000880	-0.012720	0.008820	0.109610
0.001240	0.123120	-0.191680	-0.037370	0.019210	0.007870	-0.024550	0.022360	0.101610
0.001260	0.145230	-0.244850	-0.085200	0.058950	0.024640	-0.059020	0.042250	0.098740
0.001280	0.120830	-0.109850	-0.057080	0.004640	0.015200	-0.061740	0.046010	0.101010
0.001300	0.301100	-0.018300	-0.052590	-0.042600	0.018430	-0.032100	0.019190	0.101660
0.001320	0.523340	-0.054310	-0.135270	0.018980	0.005300	-0.013980	0.004640	0.089960
0.001340	0.634240	0.067140	-0.205980	0.027250	-0.036790	-0.013950	0.016050	0.068040
0.001360	0.680540	0.263110	-0.230220	-0.011980	-0.022500	-0.044160	0.029360	0.053220
0.001380	0.577800	0.315140	-0.171810	-0.035210	0.031730	-0.091190	0.035730	0.051450
0.001400	0.330100	0.386300	0.029230	-0.121350	0.018010	-0.073280	0.023290	0.052770
0.001420	0.017790	0.482610	0.187620	-0.172080	-0.028840	-0.015210	-0.002630	0.040700
0.001440	-0.435350	0.458280	0.203640	-0.100230	-0.059340	-0.016040	-0.000910	0.008180
0.001460	-0.848950	0.402470	0.269200	-0.041880	-0.085670	-0.032410	0.023900	-0.025420
0.001480	-0.895140	0.222520	0.370270	0.013140	-0.100570	-0.032640	0.026390	-0.028820
0.001500	-0.568440	-0.196140	0.357200	0.164510	-0.133190	-0.051430	0.016660	-0.000170
0.001520	0.035750	-0.551360	0.319000	0.318260	-0.151180	-0.069900	0.011750	0.018830
0.001540	0.644540	-0.686720	0.247980	0.402890	-0.074800	-0.118950	0.013120	0.007390
0.001560	0.758000	-0.686250	0.013070	0.422290	0.061510	-0.211000	0.035720	-0.008200
0.001580	0.379690	-0.442600	-0.260220	0.303860	0.189370	-0.224470	0.035330	-0.003570
0.001600	-0.071200	0.000220	-0.456330	0.134810	0.305880	-0.128840	-0.026960	0.026150
0.001620	-0.401300	0.356690	-0.561150	0.076940	0.354540	-0.025280	-0.091160	0.050230
0.001640	-0.484550	0.503040	-0.471290	-0.000630	0.300460	0.078330	-0.104770	0.038690
0.001660	-0.193940	0.339720	-0.260830	-0.176970	0.241810	0.182190	-0.084350	0.024300
0.001680	0.270660	-0.049920	-0.034440	-0.287370	0.172150	0.240990	-0.037330	0.024420
0.001700	0.553940	-0.279930	0.213800	-0.349970	0.049070	0.280440	0.024530	-0.012220
0.001720	0.466490	-0.348290	0.251580	-0.385970	-0.081390	0.273680	0.099560	-0.076790
0.001740	-0.070890	-0.343200	0.035750	-0.221470	-0.216700	0.171340	0.211620	-0.099670
0.001760	-0.825190	-0.049040	-0.030480	0.041970	-0.328950	0.048930	0.290960	-0.048840
0.001780	-1.086920	0.280940	-0.038010	0.125460	-0.354580	-0.023510	0.276950	0.065480
0.001800	-0.522600	0.172910	-0.233380	0.089250	-0.305400	-0.106890	0.223440	0.185310
0.001820	0.478830	-0.252210	-0.183540	0.098790	-0.188370	-0.209330	0.159600	0.255180
0.001840	1.405170	-0.659760	0.109670	0.096550	-0.015390	-0.268560	0.078070	0.282540
0.001860	1.701310	-0.807930	0.091560	0.011610	0.071880	-0.328240	0.001440	0.291550
0.001880	1.326600	-0.418830	-0.105760	-0.059520	0.055170	-0.336100	-0.069390	0.274320
0.001900	0.591190	0.368890	-0.259640	-0.006770	0.099490	-0.176350	-0.157140	0.226050
0.001920	-0.608930	1.104690	-0.477280	0.047780	0.127270	-0.006600	-0.245750	0.132870
0.001940	-1.529580	1.585490	-0.494160	-0.087130	0.027540	0.044750	-0.286260	0.010900
0.001960	-1.247680	1.409410	-0.161990	-0.273880	-0.014230	0.115320	-0.250620	-0.069110
0.001980	-0.561260	0.271040	0.313230	-0.308870	0.014430	0.197780	-0.172670	-0.138040
0.002000	-0.095060	-1.060920	0.917030	-0.278070	-0.049480	0.123710	-0.101260	-0.241560
0.002020	0.593620	-1.544760	1.384150	-0.222770	-0.155330	0.025670	-0.026470	-0.335050
0.002040	1.144730	-1.127660	1.196380	-0.018710	-0.253980	0.021870	0.083290	-0.380610
0.002060	0.851390	-0.410200	0.377690	0.322770	-0.349790	-0.060830	0.170640	-0.319580
0.002080	-0.038850	0.248840	-0.589180	0.668650	-0.345620	-0.194820	0.113490	-0.173940
0.002100	-0.622360	0.519300	-1.184040	0.875570	-0.221930	-0.234000	-0.023900	-0.026100
0.002120	-0.240360	0.167050	-1.083220	0.755290	0.012040	-0.231580	-0.068310	0.125930
0.002140	0.134270	-0.161190	-0.353560	0.242880	0.384320	-0.229740	-0.096810	0.197140
0.002160	-1.016840	0.033940	0.494230	-0.378070	0.733230	-0.219040	-0.197710	0.125390
0.002180	-1.821220	0.143930	0.821020	-0.689170	0.760220	-0.156510	-0.204340	0.034160
0.002200	-0.439610	-0.202100	0.539640	-0.533010	0.443780	0.083340	-0.135250	-0.023980
0.002220	0.389660	-0.153220	-0.010390	-0.122910	0.008470	0.447510	-0.166390	-0.076780
0.002240	0.271430	0.458240	-0.502560	0.161150	-0.399950	0.674350	-0.202570	-0.100110
0.002260	1.656880	-0.190540	-0.614160	0.237150	-0.572580	0.676520	-0.136380	-0.095000
0.002280	2.747170	-2.055980	-0.247060	0.285730	-0.321670	0.494830	0.029390	-0.076130
0.002300	1.499160	-2.176660	0.352090	0.187120	0.097580	0.077160	0.300110	-0.090600
0.002320	-0.566780	-0.316830	0.573870	-0.109390	0.321560	-0.402700	0.485400	-0.171550
0.002340	-1.480600	1.436760	-0.024590	-0.293190	0.293640	-0.582260	0.459300	-0.179310
0.002360	-1.215960	2.874070	-0.945980	-0.329520	0.075580	-0.412380	0.335840	-0.000680
0.002380	-0.744420	3.425210	-1.364980	-0.313090	-0.127640	-0.049460	0.090500	0.245360
0.002400	0.384220	1.901490	-1.070060	-0.086480	-0.116870	0.335300	-0.252440	0.415630
0.002420	1.720570	-0.535960	-0.183060	0.179700	-0.043350	0.489010	-0.422970	0.493440
0.002440	1.412640	-2.152830	1.310530	-0.094690	0.007070	0.348690	-0.393630	0.460710
0.002460	-0.279890	-2.743220	2.842690	-0.797160	0.044410	0.116970	-0.308900	0.264510
0.002480	-2.123880	-2.110990	3.053610	-0.981130	-0.046530	-0.101180	-0.107120	-0.027970
0.002500	-3.289470	0.245390	1.282250	-0.214300	-0.227720	-0.268500	0.122450	-0.259780
0.002520	-2.581860	2.560460	-1.262670	0.835290	-0.404690	-0.240220	0.156270	-0.357560
0.002540	-0.091980	2.661320	-2.674860	1.332690	-0.511050	-0.023700	0.087600	-0.302960
0.002560	2.599900	0.983490	-2.633230	1.365920	-0.464840	0.143530	0.042900	-0.118930
0.002580	4.155390	-1.443710	-1.508530	1.265170	-0.289540	0.117160	-0.042130	0.047220
0.002600	3.422270	-3.491250	0.682950	0.252500	0.201920	-0.074690	-0.089450	0.074470
0.002620	0.671120	-3.442900	2.612160	-1.569170	1.013510	-0.338620	0.015590	0.028770
0.002640	-1.941250	-0.753250	2.867160	-2.207450	1.231790	-0.443190	0.172490	-0.017870
0.002660	-3.254400	2.823200	1.443510	-1.611090	0.545530	-0.071020	0.288380	-0.089600
0.002680	-3.482770	4.640710	-0.916730	-0.909190	-0.075250	0.679170	0.288160	-0.141580
0.002700	-2.533410	3.644170	-2.729780	0.516310	-0.608400	1.051000	0.126510	-0.098560
0.002720	-0.368050	0.374110	-2.830760	2.093160	-1.323790	0.741580	0.023720	-0.013750
0.002740	1.779090	-3.206740	-0.789350	2.114840	-1.233370	0.433480	0.197400	0.019350
0.002760	2.384570	-4.638010	2.261750	0.879560	-0.627060	0.245140	0.546900	-0.022150
0.002780	1.672670	-3.722860	3.701150	-0.360880	-0.457590	-0.400760	0.831580	-0.124410
0.002800	0.830470	-1.578910	2.584960	-1.139560	0.115650	-1.080640	0.879240	-0.220120
0.002820	0.419130	1.120310	-0.121890	-1.528720	1.155920	-1.026130	0.583120	-0.149720
0.002840	0.338690	3.081040	-2.873460	-0.963540	1.415570	-0.531460	0.011620	0.162820
0.002860	0.106330	3.062300	-3.938960	0.715380	0.946680	-0.189640	-0.397080	0.495970
0.002880	-0.688560	1.594740	-2.895210	1.809030	0.666700	-0.038980	-0.372580	0.559190
0.002900	-1.809040	0.121380	-0.734000	1.417420	0.428440	0.290650	-0.341620	0.353820
0.002920	-2.288200	-0.397390	1.530550	0.230040	-0.444380	0.782980	-0.566090	0.017610
0.002940	-1.538750	-0.130370	3.017210	-1.337120	-1.154500	1.051770	-0.579350	-0.383340
0.002960	-0.131020	-0.098100	2.812400	-2.408330	-0.812160	1.163020	-0.303270	-0.726300
0.002980	1.221010	-0.558870	1.202550	-2.043620	-0.016550	1.009740	-0.339740	-0.786780
0.003000	2.212030	-1.142090	-0.306080	-0.741390	0.619270	0.277240	-0.514420	-0.509350
0.003020	2.401750	-1.823320	-0.851620	0.811370	0.826140	-0.776350	-0.137150	-0.197450
0.003040	1.443110	-1.948320	-0.804200	2.135150	0.443090	-1.575510	0.366210	-0.066610
0.003060	-0.537040	-0.748280	-0.728500	2.309940	-0.450050	-1.583770	0.403210	0.040090
0.003080	-2.561290	1.269100	-0.723300	1.329220	-1.367170	-0.735660	0.265920	0.108490
0.003100	-3.024660	2.978620	-0.813450	0.152190	-1.448930	0.406880	-0.164480	0.073430
0.003120	-1.541250	3.436190	-0.914660	-0.856150	-0.545940	1.222840	-1.124400	0.272220
0.003140	0.513800	2.244770	-0.737240	-1.491700	0.749970	1.334470	-1.797990	0.665250
0.003160	1.883570	-0.209570	-0.038560	-1.472890	1.724470	0.576270	-1.561290	0.769710
0.003180	2.172000	-2.872500	1.208900	-1.020570	1.886580	-0.604520	-0.830100	0.614710
0.003200	1.197490	-4.063590	2.359560	-0.422850	1.204560	-1.307520	0.097210	0.250550
0.003220	-0.512570	-2.829300	2.679250	0.093700	-0.210600	-1.089120	1.090180	-0.497420
0.003240	-1.580660	-0.152140	1.738560	0.411240	-1.708320	0.014400	1.474770	-1.136050
0.003260	-1.376180	2.329850	-0.527560	0.736660	-2.295190	1.406300	0.920640	-1.119940
0.003280	-0.396900	3.370190	-2.908400	1.132320	-1.831710	1.973800	0.013540	-0.646370
0.003300	0.702010	2.283000	-3.749050	1.316710	-0.708080	1.256110	-0.627920	0.059150
0.003320	1.101270	-0.085840	-2.525100	1.118740	0.654000	-0.295980	-0.780410	0.881090
0.003340	0.335930	-1.872260	-0.104230	0.525110	1.637070	-1.896660	-0.273280	1.355780
0.003360	-0.690410	-2.109360	2.167420	-0.585710	1.834640	-2.593900	0.838540	1.098120
0.003380	-0.900450	-0.959060	3.251930	-1.847390	1.367590	-1.875810	1.707490	0.339070
0.003400	-0.298670	0.774770	2.382860	-2.351760	0.486930	-0.278310	1.432860	-0.417180
0.003420	0.544600	1.792230	0.086160	-1.679180	-0.430870	1.341010	0.222740	-0.915240
0.003440	0.922370	1.236860	-1.859120	-0.122080	-0.848950	2.396730	-1.106530	-0.920200
0.003460	0.408420	-0.305850	-2.328680	1.564800	-0.858410	2.360380	-1.811510	-0.250520
0.003480	-0.479610	-1.304430	-1.307120	2.513050	-0.853130	1.206940	-1.364450	0.583740
0.003500	-0.878690	-0.968400	0.314300	2.081480	-0.739540	-0.322860	-0.087780	0.812410
0.003520	-0.640250	0.156460	1.271440	0.384490	-0.490810	-1.402430	1.190390	0.323150
0.003540	0.059300	1.064980	1.038380	-1.288370	-0.109600	-1.691510	1.965100	-0.516650
0.003560	0.964300	0.967070	0.063520	-1.915990	0.543950	-1.332910	1.873560	-1.209240
0.003580	1.258050	-0.074090	-0.716560	-1.611810	1.202370	-0.646510	0.936100	-1.179480
0.003600	0.558340	-0.974610	-0.647300	-0.595390	1.384850	-0.029970	-0.252880	-0.348440
0.003620	-0.459520	-1.052730	0.072520	0.728460	0.856390	0.247880	-1.135600	0.705190
0.003640	-1.128420	-0.443520	0.663560	1.457250	-0.146650	0.388910	-1.369910	1.444840
0.003660	-1.089930	0.669600	0.548650	1.165690	-1.117730	0.685450	-1.008620	1.552760
0.003680	-0.312650	1.497210	-0.200600	0.348440	-1.742590	0.999550	-0.481470	0.976880
0.003700	0.594100	1.159620	-0.941270	-0.332680	-1.651880	1.097300	-0.029070	0.079810
0.003720	0.988280	0.095300	-0.967390	-0.626660	-0.541600	0.810730	0.303130	-0.786920
0.003740	0.803010	-0.874230	-0.285840	-0.499430	0.979250	-0.047420	0.488580	-1.331330
0.003760	0.261080	-1.286870	0.573410	-0.121620	1.834840	-1.236520	0.646900	-1.269020
0.003780	-0.385730	-0.826740	1.080890	0.111800	1.657580	-2.118690	0.860900	-0.763450
0.003800	-0.761920	0.077910	0.796480	0.144890	0.722800	-2.100080	0.934610	-0.173320
0.003820	-0.645260	0.718990	-0.051850	0.170030	-0.489530	-0.904820	0.669310	0.388830
0.003840	-0.212950	0.894440	-0.680680	0.121760	-1.345490	0.927190	0.105430	0.813080
0.003860	0.329700	0.506720	-0.777160	0.028350	-1.354670	2.271970	-0.631700	0.961380
0.003880	0.689200	-0.281570	-0.474950	0.091490	-0.573190	2.354090	-1.318630	0.881390
0.003900	0.523570	-0.789640	0.067120	0.169000	0.423560	1.175820	-1.528090	0.627230
0.003920	0.047500	-0.693890	0.513160	0.130690	0.999630	-0.560170	-0.931690	0.185720
0.003940	-0.300270	-0.268850	0.545240	0.110720	0.880800	-1.864550	0.258650	-0.351850
0.003960	-0.363610	0.349060	0.198020	-0.025730	0.258370	-2.033430	1.370690	-0.858800
0.003980	-0.078360	0.882920	-0.303860	-0.286420	-0.367450	-1.099780	1.778790	-1.207420
0.004000	0.328720	0.785360	-0.688110	-0.265610	-0.582260	0.216510	1.211590	-1.212580
0.004020	0.428630	0.155740	-0.698450	0.030560	-0.358290	1.110850	-0.066980	-0.741520
0.004040	0.148750	-0.447540	-0.298340	0.309870	0.045260	1.137990	-1.269630	0.121690
0.004060	-0.289660	-0.717470	0.285110	0.464880	0.251960	0.441680	-1.662560	1.014460
0.004080	-0.587930	-0.489960	0.714160	0.293930	0.082250	-0.318350	-1.121750	1.500490
0.004100	-0.369800	0.116410	0.668380	-0.208420	-0.163550	-0.602030	-0.085350	1.298910
0.004120	0.311420	0.517180	0.133830	-0.617710	-0.143760	-0.366540	0.834610	0.425390
0.004140	0.870870	0.366080	-0.439520	-0.650870	0.071100	0.110300	1.128980	-0.661110
0.004160	0.881190	-0.088280	-0.616390	-0.300810	0.319190	0.378540	0.674800	-1.342670
0.004180	0.367760	-0.492920	-0.342450	0.303490	0.456780	0.141880	-0.061710	-1.310950
0.004200	-0.308300	-0.529060	0.235110	0.741130	0.268490	-0.304880	-0.516600	-0.673940
0.004220	-0.662770	-0.034300	0.638610	0.660170	-0.180200	-0.455410	-0.522690	0.174510
0.004240	-0.525180	0.585740	0.322470	0.243570	-0.546730	-0.242770	-0.200040	0.797140
0.004260	-0.122580	0.819050	-0.412600	-0.192720	-0.618280	0.137200	0.124480	0.914350
0.004280	0.242710	0.521000	-0.787350	-0.445600	-0.333170	0.460820	0.144780	0.548800
0.004300	0.316370	-0.204650	-0.559300	-0.306070	0.165540	0.431400	-0.041800	0.031570
0.004320	0.031680	-0.839960	0.108040	0.055780	0.495670	0.020240	-0.138050	-0.316400
0.004340	-0.281220	-0.811480	0.871710	0.175230	0.475490	-0.435000	-0.041040	-0.408960
0.004360	-0.278090	-0.276010	1.079130	0.059290	0.224060	-0.637660	0.168830	-0.339820
0.004380	0.004180	0.248620	0.468900	-0.036720	-0.132600	-0.477530	0.359830	-0.246930
0.004400	0.352000	0.500970	-0.423560	-0.089210	-0.376630	-0.003280	0.355540	-0.166440
0.004420	0.496400	0.324320	-0.990760	-0.021060	-0.309680	0.490540	0.097750	-0.046390
0.004440	0.233550	-0.125550	-0.898780	0.180050	-0.046400	0.644080	-0.207960	0.120980
0.004460	-0.146850	-0.349850	-0.133600	0.259000	0.235820	0.403880	-0.352080	0.264200
0.004480	-0.261930	-0.212660	0.707700	0.131180	0.445620	-0.055210	-0.293600	0.295560
0.004500	-0.161770	0.056570	0.944700	-0.059230	0.402620	-0.517330	-0.060430	0.173690
0.004520	0.043410	0.235670	0.521700	-0.229990	0.078560	-0.680630	0.228230	-0.059680
0.004540	0.248020	0.125940	-0.180690	-0.251640	-0.281650	-0.401590	0.391330	-0.272640
0.004560	0.211900	-0.187510	-0.638780	-0.055250	-0.476250	0.109580	0.335330	-0.348890
0.004580	-0.035050	-0.314230	-0.490440	0.169160	-0.435710	0.537210	0.094380	-0.270890
0.004600	-0.265540	-0.187090	0.015500	0.276820	-0.176020	0.636270	-0.214960	-0.089460
0.004620	-0.356620	-0.000130	0.344640	0.255270	0.119970	0.337190	-0.415450	0.104500
0.004640	-0.198670	0.219290	0.329240	0.071580	0.258820	-0.132130	-0.369010	0.198860
0.004660	0.105220	0.336040	0.036670	-0.145500	0.233290	-0.455370	-0.104520	0.130900
0.004680	0.253310	0.187470	-0.350940	-0.220110	0.120230	-0.473970	0.231090	-0.046560
0.004700	0.167020	-0.055220	-0.453760	-0.213340	0.052650	-0.201160	0.447610	-0.217600
0.004720	0.005340	-0.221480	-0.180750	-0.168550	0.142870	0.155840	0.380070	-0.305920
0.004740	-0.112520	-0.261480	0.191020	-0.073180	0.281000	0.318710	0.074870	-0.253170
0.004760	-0.135160	-0.154220	0.484570	-0.032290	0.283260	0.235550	-0.245440	-0.048410
0.004780	-0.060930	-0.074050	0.568500	-0.038850	0.102250	0.042140	-0.395020	0.209710
0.004800	0.013770	-0.133560	0.335220	0.004630	-0.206090	-0.086710	-0.276150	0.397440
0.004820	0.054750	-0.177550	-0.030140	0.032660	-0.476720	0.005810	0.012500	0.413730
0.004840	0.092000	-0.109220	-0.309400	0.026540	-0.517140	0.242120	0.191750	0.231810
0.004860	0.027660	0.002200	-0.426090	0.096840	-0.308580	0.334790	0.147330	-0.036940
0.004880	-0.117770	0.131570	-0.298520	0.160130	0.000340	0.158910	-0.000160	-0.239000
0.004900	-0.143300	0.239960	-0.023130	0.088580	0.238130	-0.180300	-0.108230	-0.255060
0.004920	-0.037820	0.221820	0.176350	-0.024160	0.288760	-0.493970	-0.083950	-0.086100
0.004940	0.118980	0.143780	0.256750	-0.123670	0.154500	-0.548980	0.048100	0.095810
0.004960	0.292690	0.076880	0.219370	-0.222060	0.005890	-0.252300	0.129110	0.160000
0.004980	0.288700	-0.058660	0.047250	-0.208170	-0.026870	0.175820	0.052110	0.125140
0.005000	0.032510	-0.160400	-0.121150	-0.086290	-0.009090	0.441880	-0.129990	0.055190
0.005020	-0.206670	-0.113250	-0.123010	0.017150	0.026410	0.443080	-0.280960	0.023960
0.005040	-0.285260	-0.034150	0.053120	0.069760	0.069130	0.232920	-0.271580	0.067760
0.005060	-0.252180	0.068710	0.303090	0.034630	0.026290	-0.034290	-0.077720	0.108580
0.005080	-0.053710	0.189900	0.407490	-0.060100	-0.057080	-0.168350	0.184150	0.056350
0.005100	0.193350	0.135470	0.217830	-0.087390	-0.065130	-0.128500	0.352450	-0.070000
0.005120	0.260410	-0.055060	-0.083400	-0.044740	-0.039940	-0.015750	0.330400	-0.195390
0.005140	0.129270	-0.169450	-0.251430	0.020190	-0.019670	0.061520	0.135820	-0.238640
0.005160	-0.123060	-0.206800	-0.237210	0.093660	-0.010560	0.046750	-0.092880	-0.133530
0.005180	-0.352960	-0.136510	-0.009710	0.086330	-0.045510	-0.013670	-0.201420	0.058440
0.005200	-0.340330	0.070390	0.290760	-0.037890	-0.064990	-0.032680	-0.170890	0.171380
0.005220	-0.108600	0.177670	0.322590	-0.147750	-0.006200	0.005310	-0.081670	0.130900
0.005240	0.101410	0.110850	0.074450	-0.167140	0.058860	0.080910	-0.001920	-0.016980
0.005260	0.162380	-0.027240	-0.169970	-0.097590	0.060450	0.158010	0.013830	-0.183300
0.005280	0.044640	-0.229550	-0.296570	0.064550	0.017200	0.150910	-0.030590	-0.254920
0.005300	-0.173630	-0.311520	-0.240810	0.171920	-0.058660	0.041410	-0.049950	-0.170120
0.005320	-0.255010	-0.117380	0.028780	0.084710	-0.128010	-0.065710	-0.025730	-0.003380
0.005340	-0.147120	0.125810	0.272960	-0.081090	-0.095670	-0.106050	-0.013500	0.120580
0.005360	-0.000900	0.216990	0.280140	-0.215830	0.033370	-0.093060	0.001190	0.151380
0.005380	0.149330	0.134610	0.098790	-0.266400	0.152410	-0.027540	0.022030	0.122310
0.005400	0.262950	-0.102520	-0.129890	-0.128410	0.175250	0.052900	0.001260	0.091350
0.005420	0.208520	-0.282010	-0.239620	0.099200	0.066100	0.084870	-0.045950	0.079600
0.005440	0.070400	-0.212200	-0.145480	0.185320	-0.095990	0.076610	-0.093010	0.068940
0.005460	-0.011110	-0.016880	0.023250	0.132310	-0.162790	0.054330	-0.137750	0.068180
0.005480	-0.057530	0.164290	0.121030	0.023410	-0.116210	0.024260	-0.137950	0.080840
0.005500	-0.025170	0.281090	0.140640	-0.135970	-0.010260	-0.002500	-0.094800	0.068150
0.005520	0.081450	0.225070	0.064740	-0.205870	0.120060	-0.023230	-0.059980	0.031620
0.005540	0.041570	0.052010	-0.051220	-0.109200	0.163590	-0.024230	-0.050590	0.007160
0.005560	-0.107120	-0.004650	-0.056720	0.011320	0.065180	0.006490	-0.075440	-0.012160
0.005580	-0.148700	0.041190	-0.012520	0.093320	-0.059390	0.022320	-0.129890	-0.038060
0.005600	-0.137570	0.077180	-0.020420	0.117940	-0.137630	0.003000	-0.171200	-0.042580
0.005620	-0.094450	0.149250	0.008210	0.021470	-0.143010	-0.006920	-0.176140	-0.027020
0.005640	0.054740	0.144530	0.067810	-0.097010	-0.039350	-0.001210	-0.138600	-0.015530
0.005660	0.191700	-0.043760	0.098620	-0.136820	0.093670	0.004680	-0.054060	0.010450
0.005680	0.218270	-0.191330	0.150900	-0.146420	0.156300	0.032180	0.034290	0.048280
0.005700	0.158350	-0.207790	0.155740	-0.091510	0.151910	0.050940	0.052140	0.048270
0.005720	0.002680	-0.165940	0.053420	0.037700	0.085900	0.005080	-0.005360	0.017340
0.005740	-0.179310	-0.001670	-0.034140	0.107560	-0.039150	-0.039160	-0.070200	-0.002590
0.005760	-0.243970	0.173820	-0.089500	0.109290	-0.158810	-0.027060	-0.091420	0.008190
0.005780	-0.164020	0.174950	-0.143600	0.099950	-0.224250	0.004710	-0.053320	0.051910
0.005800	-0.004550	0.100040	-0.084470	0.030660	-0.208580	0.051130	0.016920	0.091130
0.005820	0.169870	0.018480	0.033560	-0.041830	-0.083290	0.079070	0.037350	0.100760
0.005840	0.244830	-0.111090	0.054220	-0.009550	0.060000	0.029180	-0.007820	0.096900
0.005860	0.168400	-0.161710	0.038680	0.032700	0.098880	-0.046060	-0.045600	0.078670
0.005880	0.044310	-0.081380	0.025790	0.027100	0.037550	-0.085720	-0.037630	0.052750
0.005900	-0.076150	0.032830	-0.052820	0.051030	-0.062320	-0.097460	0.023480	0.041720
0.005920	-0.159040	0.177090	-0.120320	0.047400	-0.127940	-0.054580	0.114700	0.041520
0.005940	-0.103120	0.267370	-0.119320	-0.012670	-0.072420	0.047610	0.162190	0.035660
0.005960	0.001980	0.174620	-0.120040	-0.010880	0.070080	0.107100	0.128180	0.031790
0.005980	0.015200	0.011400	-0.089400	0.004690	0.159810	0.066110	0.053800	0.045440
0.006000	0.010210	-0.116220	0.009040	-0.022950	0.156220	-0.023940	-0.001140	0.084370
0.006020	0.002020	-0.226560	0.084200	-0.006830	0.097800	-0.102620	-0.005490	0.137860
0.006040	-0.030790	-0.190030	0.143610	-0.004120	-0.004770	-0.106050	0.026390	0.149800
0.006060	0.047380	-0.001570	0.187130	-0.064510	-0.072040	-0.018930	0.055440	0.100150
0.006080	0.173650	0.078060	0.090100	-0.060520	-0.028640	0.061190	0.045960	0.035060
0.006100	0.192880	0.037330	-0.074310	0.012940	0.043280	0.092250	-0.017250	-0.026990
0.006120	0.158250	0.041050	-0.157740	0.085990	0.078410	0.090780	-0.093690	-0.067520
0.006140	0.050100	0.040290	-0.197820	0.183090	0.056510	0.022690	-0.115170	-0.058450
0.006160	-0.151910	0.047430	-0.181310	0.236060	-0.069640	-0.055740	-0.075440	-0.027170
0.006180	-0.211280	0.135050	-0.089570	0.164940	-0.199200	-0.044230	-0.023530	-0.015150
0.006200	-0.093440	0.148560	-0.032560	0.049320	-0.177450	0.000340	0.004360	-0.020720
0.006220	0.004420	0.063420	-0.007060	-0.064170	-0.039810	0.012160	-0.001430	-0.033940
0.006240	0.088710	-0.024660	0.049030	-0.165610	0.120960	0.000990	-0.042560	-0.036080
0.006260	0.153910	-0.165490	0.065110	-0.157480	0.237220	-0.050570	-0.080140	-0.002700
0.006280	0.101740	-0.228840	0.053760	-0.044920	0.219800	-0.110780	-0.058420	0.042290
0.006300	0.024790	-0.071090	0.061060	0.070270	0.079670	-0.111170	-0.011600	0.048240
0.006320	-0.003550	0.087880	-0.018510	0.177970	-0.071480	-0.060260	0.007760	0.014840
0.006340	-0.016560	0.133180	-0.157750	0.219090	-0.166840	0.024420	0.018650	-0.018710
0.006360	0.033520	0.147520	-0.213230	0.127070	-0.170830	0.131880	0.013570	-0.026320
0.006380	0.120690	0.067170	-0.188200	0.027160	-0.073640	0.171990	-0.012470	0.006070
0.006400	0.117630	-0.070490	-0.081320	-0.002040	0.063990	0.081200	-0.001250	0.076030
0.006420	0.068280	-0.088150	0.084910	-0.055490	0.169150	-0.053900	0.044640	0.126170
0.006440	0.036770	-0.031610	0.139460	-0.092680	0.182970	-0.128160	0.080380	0.106640
0.006460	-0.052690	0.012360	0.072040	-0.041060	0.075470	-0.125500	0.111150	0.045650
0.006480	-0.129080	0.084880	-0.002860	0.006050	-0.072840	-0.052120	0.111330	-0.024280
0.006500	-0.087620	0.105620	-0.103900	0.064770	-0.158520	0.054810	0.056620	-0.084320
0.006520	-0.052500	0.038650	-0.165580	0.160450	-0.174200	0.114830	0.001290	-0.104830
0.006540	-0.019100	0.018510	-0.073650	0.145620	-0.132460	0.105630	-0.026120	-0.076810
0.006560	0.063640	0.002070	0.030190	0.059270	-0.031790	0.033150	-0.040120	-0.026180
0.006580	0.047190	-0.079560	0.041580	0.020280	0.049750	-0.099510	-0.011570	0.003760
0.006600	-0.034090	-0.093460	0.050830	-0.032730	0.068230	-0.189460	0.075630	-0.009760
0.006620	-0.033330	-0.034520	0.015740	-0.051540	0.059030	-0.155630	0.152350	-0.055320
0.006640	-0.042870	-0.009430	-0.080640	0.008100	0.010140	-0.058110	0.169110	-0.112780
0.006660	-0.061880	0.035360	-0.102370	0.025240	-0.037430	0.046840	0.144240	-0.155720
0.006680	0.005040	0.069910	-0.079970	0.024370	-0.004830	0.110850	0.085360	-0.151370
0.006700	0.018560	0.022910	-0.083300	0.059130	0.043600	0.083960	0.018860	-0.090690
0.006720	-0.054730	-0.007070	-0.034440	0.037650	0.047710	0.029970	-0.006210	-0.003120
0.006740	-0.070200	-0.027090	0.041100	0.000240	0.030040	-0.005580	0.013980	0.063510
0.006760	-0.045700	-0.080590	0.065480	0.026080	-0.030260	-0.037650	0.059260	0.077600
0.006780	-0.039390	-0.055200	0.095620	0.026820	-0.110000	-0.014040	0.098840	0.016480
0.006800	-0.001320	-0.019980	0.099510	0.015100	-0.109680	0.045130	0.101570	-0.099260
0.006820	0.057630	-0.076080	0.005460	0.060080	-0.024590	0.038060	0.087960	-0.187690
0.006840	0.078920	-0.076820	-0.096720	0.081810	0.057990	-0.013270	0.083410	-0.192300
0.006860	0.040210	-0.027470	-0.149770	0.073190	0.090070	-0.059930	0.079910	-0.121890
0.006880	-0.055990	-0.015750	-0.166810	0.102920	0.068960	-0.102090	0.086590	-0.015560
0.006900	-0.127290	0.046820	-0.098510	0.100280	0.012080	-0.082670	0.098900	0.069240
0.006920	-0.091550	0.110060	-0.003810	0.014320	-0.027150	0.008320	0.065020	0.085550
0.006940	-0.023970	0.061540	0.017920	-0.065190	-0.017210	0.080800	-0.004550	0.044710
0.006960	-0.002580	-0.002310	0.026320	-0.107800	0.029250	0.106090	-0.047330	-0.013460
0.006980	0.013570	-0.052920	0.038410	-0.119400	0.086010	0.092010	-0.061890	-0.049720
0.007000	0.013500	-0.132030	0.002310	-0.055240	0.106240	0.016650	-0.040650	-0.035220
0.007020	-0.034310	-0.113020	-0.004600	0.025740	0.047750	-0.065260	0.024920	-0.010000
0.007040	-0.060800	0.020500	0.045880	0.041740	-0.036060	-0.073880	0.069210	-0.023240
0.007060	-0.077340	0.083300	0.039320	0.045720	-0.090130	-0.045380	0.054750	-0.051300
0.007080	-0.124240	0.050170	-0.008910	0.029160	-0.114310	-0.014000	0.010300	-0.072780
0.007100	-0.108470	0.016670	-0.026010	-0.021140	-0.068290	0.029600	-0.043640	-0.075030
0.007120	-0.036540	-0.032970	-0.054480	-0.010310	0.017330	0.036420	-0.075230	-0.043010
0.007140	-0.011340	-0.053750	-0.068560	0.014190	0.033490	-0.010330	-0.054710	-0.002930
0.007160	0.026200	0.012430	-0.015180	-0.019100	-0.006040	-0.057690	-0.017780	0.001470
0.007180	0.086590	0.035930	0.040050	-0.022390	-0.034020	-0.086030	-0.001080	-0.033350
0.007200	0.068050	-0.007690	0.070110	-0.023770	-0.054110	-0.078210	-0.000940	-0.079410
0.007220	-0.003050	-0.007330	0.076340	-0.088500	-0.048750	-0.023320	-0.021160	-0.111060
0.007240	-0.065880	-0.009250	0.021550	-0.102480	-0.010440	0.039290	-0.052100	-0.108830
0.007260	-0.127960	0.007330	-0.021990	-0.058400	0.011480	0.072460	-0.057270	-0.065080
0.007280	-0.123410	0.114160	0.008850	-0.042160	0.007430	0.066420	-0.027770	-0.004840
0.007300	-0.046270	0.143860	0.012370	-0.003830	0.000130	0.015990	0.012410	0.048930
0.007320	-0.009840	0.080670	-0.009330	0.034280	-0.025560	-0.038580	0.052810	0.090300
0.007340	-0.007680	0.047220	0.036070	0.011260	-0.056170	-0.047580	0.086610	0.101910
0.007360	0.018260	-0.044240	0.071520	0.001690	-0.047390	-0.036280	0.104630	0.086160
0.007380	0.038880	-0.129020	0.059800	0.008940	-0.010030	-0.020630	0.109840	0.066670
0.007400	0.052190	-0.056940	0.058020	-0.027880	0.019780	0.018880	0.092650	0.044160
0.007420	0.032120	0.011310	0.028330	-0.039730	0.040410	0.041170	0.045960	0.025710
0.007440	-0.063790	0.002850	-0.009550	-0.010530	0.048220	0.011020	0.003610	0.034980
0.007460	-0.136420	0.025350	0.004190	-0.020340	0.029560	-0.013300	-0.010080	0.068070
0.007480	-0.120200	0.031690	0.017340	-0.026350	-0.002040	0.001430	-0.007420	0.108440
0.007500	-0.111140	0.023890	0.028870	-0.008040	-0.022040	0.018210	-0.000440	0.126040
0.007520	-0.076770	0.077150	0.076920	-0.049970	-0.025940	0.033380	0.002730	0.087270
0.007540	0.010460	0.079730	0.076060	-0.084520	0.002710	0.043290	-0.001650	0.009760
0.007560	0.002580	0.003360	0.013130	-0.051300	0.039310	0.015190	0.004750	-0.055820
0.007580	-0.074270	-0.030540	0.002280	-0.044160	0.036660	-0.025740	0.021380	-0.083410
0.007600	-0.068370	-0.070660	0.018970	-0.025790	0.013540	-0.045750	0.030780	-0.072600
0.007620	-0.033990	-0.121210	0.009910	0.036580	-0.015720	-0.063630	0.035900	-0.039920
0.007640	-0.009010	-0.051270	0.036320	0.031670	-0.052040	-0.051880	0.020160	-0.006460
0.007660	0.055040	0.016360	0.059550	-0.002350	-0.050700	0.001900	-0.032550	0.010380
0.007680	0.075000	-0.034340	0.024370	0.007370	-0.014080	0.037620	-0.089480	0.007860
0.007700	0.030880	-0.031650	-0.006980	-0.017390	0.022740	0.047460	-0.117860	0.000030
0.007720	0.013630	0.032770	-0.025140	-0.059570	0.058030	0.045860	-0.110210	-0.002370
0.007740	-0.012770	0.017640	-0.029430	-0.056160	0.076770	0.008150	-0.083870	0.006530
0.007760	-0.047850	0.024000	0.036350	-0.077200	0.076850	-0.036450	-0.064020	0.018300
0.007780	-0.003230	0.060390	0.099140	-0.094750	0.071620	-0.050060	-0.053440	0.012390
0.007800	0.036470	0.022670	0.071410	-0.038110	0.045700	-0.056320	-0.049760	-0.000550
0.007820	-0.000630	0.021180	0.032350	-0.014020	0.007160	-0.036460	-0.061910	0.009890
0.007840	-0.044520	0.043290	-0.011840	-0.033340	-0.022290	0.018500	-0.076760	0.034020
0.007860	-0.071790	-0.014520	-0.089430	0.006250	-0.064450	0.053930	-0.068690	0.050240
0.007880	-0.057830	-0.012400	-0.066180	0.042160	-0.100200	0.062670	-0.048550	0.070220
0.007900	0.028300	0.049050	0.034490	0.022570	-0.078380	0.045180	-0.053660	0.092060
0.007920	0.080460	0.007890	0.076760	0.006890	-0.016980	-0.016600	-0.070620	0.103750
0.007940	0.068730	-0.038650	0.099990	-0.032410	0.051170	-0.070300	-0.068050	0.114860
0.007960	0.090300	-0.006770	0.112290	-0.099880	0.116410	-0.074050	-0.067750	0.124090
0.007980	0.082010	0.019710	0.055440	-0.098690	0.145700	-0.053210	-0.077820	0.126180
0.008000	-0.008930	0.059670	0.001960	-0.067720	0.120950	-0.019310	-0.082380	0.117640
0.008020	-0.049180	0.103070	-0.005020	-0.071500	0.081650	0.029190	-0.096180	0.099770
0.008040	-0.028950	0.072910	-0.030990	-0.024260	0.030230	0.063040	-0.117980	0.086750
0.008060	-0.026690	0.029270	-0.025750	0.034430	-0.046820	0.072350	-0.115870	0.069740
0.008080	0.015620	0.000360	0.033130	0.028410	-0.080700	0.063550	-0.084910	0.044190
0.008100	0.081880	-0.073000	0.024260	0.044280	-0.049880	0.027220	-0.028740	0.030460
0.008120	0.075340	-0.087660	0.002120	0.056520	-0.027950	-0.014790	0.045390	0.015760
0.008140	0.064130	-0.004170	0.052390	-0.005580	-0.009390	-0.035750	0.096850	-0.019520
0.008160	0.060070	0.002300	0.065820	-0.044170	0.037180	-0.056160	0.103020	-0.043800
0.008180	-0.001810	-0.045130	0.036180	-0.040430	0.057270	-0.058730	0.084470	-0.028740
0.008200	-0.024060	-0.019600	0.028100	-0.051330	0.051100	-0.015820	0.047810	0.001660
0.008220	0.021390	-0.005090	-0.010070	-0.025460	0.048840	0.024860	0.005960	0.031480
0.008240	0.040470	-0.005210	-0.040520	0.015150	0.028410	0.045770	-0.006680	0.055870
0.008260	0.068970	0.048270	-0.017950	0.013700	0.006530	0.069590	0.002880	0.049610
0.008280	0.084340	0.051090	-0.027200	0.030930	0.006570	0.052810	0.014740	0.019680
0.008300	0.033110	0.002390	-0.039330	0.032730	0.001920	0.004880	0.043350	-0.005960
0.008320	0.004030	-0.028870	-0.004260	-0.022500	0.016090	-0.009420	0.089460	-0.028080
0.008340	0.020850	-0.090150	-0.011800	-0.020850	0.050970	-0.024210	0.134340	-0.040770
0.008360	0.025650	-0.101810	-0.012850	0.030210	0.033830	-0.052510	0.165750	-0.041100
0.008380	0.033940	-0.015320	0.052460	0.023120	-0.009030	-0.036250	0.158890	-0.034740
0.008400	0.038540	0.008260	0.054730	0.009560	-0.015960	-0.005490	0.106040	-0.012360
0.008420	0.015620	-0.005360	-0.005600	0.014920	-0.026780	0.002210	0.060990	0.020730
0.008440	0.000280	0.026370	-0.029100	-0.021150	-0.038260	0.030280	0.035530	0.032620
0.008460	0.002550	0.000090	-0.044420	-0.031130	-0.012860	0.049740	-0.001350	0.012850
0.008480	0.011050	-0.048370	-0.038590	0.015880	0.014740	0.014320	-0.021160	-0.015130
0.008500	0.058800	-0.023710	0.012970	0.010070	0.039760	-0.014090	-0.018550	-0.053170
0.008520	0.119940	-0.015280	0.014230	-0.017050	0.076830	-0.012950	-0.027890	-0.110120
0.008540	0.101680	-0.031780	-0.030180	0.012270	0.066690	-0.022940	-0.028910	-0.145690
0.008560	0.045310	-0.004520	-0.039410	0.033140	0.018860	-0.017790	-0.018530	-0.133010
0.008580	0.040750	0.006620	-0.054850	0.043440	0.005810	0.019760	-0.023970	-0.096590
0.008600	0.026190	-0.000990	-0.086300	0.064900	-0.002490	0.045970	-0.024110	-0.064980
0.008620	0.021650	0.038950	-0.063040	0.039080	-0.027150	0.062030	-0.020650	-0.056720
0.008640	0.070870	0.041270	-0.014190	0.008790	-0.012260	0.067780	-0.047560	-0.063130
0.008660	0.061870	-0.020170	0.016590	0.012570	0.019720	0.039130	-0.073120	-0.068260
0.008680	0.019080	-0.041110	0.038970	-0.026380	0.027040	0.002290	-0.065770	-0.083090
0.008700	0.042690	-0.055680	0.012300	-0.056750	0.035200	-0.025800	-0.045910	-0.106800
0.008720	0.046470	-0.098750	-0.042340	-0.018170	0.035370	-0.042850	-0.014400	-0.120900
0.008740	0.014070	-0.043500	-0.028500	0.004790	0.006410	-0.026310	0.015270	-0.129820
0.008760	0.037640	0.019800	0.008630	0.030860	-0.014830	-0.005750	0.003410	-0.139270
0.008780	0.065260	-0.049820	-0.017880	0.090700	-0.018600	-0.012910	-0.024000	-0.131120
0.008800	0.050520	-0.078740	-0.071610	0.083040	-0.022420	0.004070	-0.025330	-0.110010
0.008820	0.025890	-0.025480	-0.107380	0.027930	-0.020810	0.047180	-0.008910	-0.090120
0.008840	-0.014240	-0.031830	-0.106360	0.015070	-0.020350	0.049140	0.021690	-0.058920
0.008860	-0.041930	-0.022610	-0.045000	0.001990	-0.020110	0.022710	0.049650	-0.036530
0.008880	-0.003690	0.017440	0.010250	-0.006070	-0.005450	0.000690	0.042800	-0.044610
0.008900	0.045570	-0.014750	0.014150	0.019550	0.004750	-0.030500	0.030000	-0.055370
0.008920	0.050530	-0.042810	0.027660	0.003850	-0.004320	-0.044980	0.031200	-0.063260
0.008940	0.046260	-0.056330	0.031010	-0.021710	-0.013860	-0.027120	0.012060	-0.069910
0.008960	0.026750	-0.094710	-0.019060	0.031740	-0.026510	-0.012960	-0.012610	-0.060840
0.008980	-0.011340	-0.046960	-0.036770	0.079160	-0.047140	-0.005740	-0.009160	-0.046970
0.009000	-0.012070	0.044160	-0.021020	0.065800	-0.050230	0.002870	0.002630	-0.040520
0.009020	-0.019840	0.034230	-0.037790	0.068830	-0.044250	-0.010400	0.013140	-0.040460
0.009040	-0.049780	0.000450	-0.038160	0.047560	-0.035540	-0.026480	0.034320	-0.048280
0.009060	-0.006610	-0.003850	-0.013190	-0.016050	-0.003950	-0.021620	0.057600	-0.050820
0.009080	0.044540	-0.050590	-0.011080	-0.018440	0.025460	-0.022900	0.077840	-0.031550
0.009100	0.004430	-0.067930	0.001860	-0.008370	0.014380	-0.027690	0.082170	-0.002450
0.009120	-0.031790	-0.010910	0.027340	-0.041330	0.003200	-0.006300	0.053540	0.014970
0.009140	-0.022660	0.016560	0.013680	-0.012360	0.005160	0.015980	0.019750	0.027110
0.009160	-0.029650	0.030890	0.004660	0.041930	-0.033060	0.021860	0.001440	0.036300
0.009180	-0.025760	0.055370	0.017990	0.038290	-0.072330	0.036360	-0.014340	0.028030
0.009200	-0.005040	0.000560	-0.010620	0.048490	-0.067820	0.044550	-0.016740	0.011800
0.009220	-0.018730	-0.050430	-0.023900	0.058090	-0.061860	0.024250	-0.001720	-0.007920
0.009240	-0.012210	0.001440	0.019060	0.037250	-0.049560	-0.005570	0.012830	-0.031560
0.009260	0.011600	0.018900	0.018680	0.046550	-0.017090	-0.046350	0.036290	-0.034440
0.009280	-0.025860	-0.033520	-0.025360	0.033050	-0.014410	-0.068400	0.067220	-0.008640
0.009300	-0.060680	-0.038220	-0.039250	-0.026020	-0.021130	-0.040460	0.083420	0.021230
0.009320	-0.032090	-0.029300	-0.037800	-0.026220	-0.010920	-0.014540	0.080450	0.048790
0.009340	-0.001640	-0.023630	-0.011440	0.006550	-0.023580	0.000420	0.061150	0.081820
0.009360	0.024810	0.036370	0.053670	0.003810	-0.044440	0.037680	0.034660	0.104770
0.009380	0.027230	0.042290	0.057730	0.014830	-0.039370	0.040480	0.017080	0.102520
0.009400	-0.030280	-0.017960	-0.006730	0.027190	-0.035930	0.000110	0.009940	0.087760
0.009420	-0.059630	-0.010350	-0.025240	0.002610	-0.034930	-0.018220	0.002700	0.069460
0.009440	-0.035430	0.010050	-0.017700	0.001290	-0.021340	-0.032170	-0.000860	0.051960
0.009460	-0.043430	-0.003220	-0.011900	0.028100	-0.014730	-0.050070	0.014250	0.050930
0.009480	-0.049310	0.036670	0.037350	0.017910	-0.011020	-0.035770	0.029010	0.059720
0.009500	-0.016970	0.069380	0.045630	0.004820	-0.000200	-0.014680	0.010600	0.073710
0.009520	-0.018190	0.055000	-0.014690	0.014470	0.000580	-0.008990	-0.013360	0.103320
0.009540	-0.037810	0.059710	-0.033180	0.000680	-0.002920	-0.004730	-0.025520	0.131020
0.009560	-0.021690	0.029030	-0.033580	-0.004370	-0.003280	-0.006930	-0.043190	0.140360
0.009580	-0.029120	-0.017950	-0.038180	0.032930	-0.015280	-0.010110	-0.049490	0.134670
0.009600	-0.037680	0.021310	0.018250	0.037940	-0.018410	0.000620	-0.038980	0.114570
0.009620	-0.004000	0.049280	0.062970	0.005300	-0.000120	0.005140	-0.033610	0.089960
0.009640	-0.025840	0.019980	0.043270	-0.020410	-0.004760	-0.016220	-0.033300	0.060730
0.009660	-0.079830	0.033320	0.028910	-0.061030	-0.022790	-0.043310	-0.037110	0.017110
0.009680	-0.061390	0.034950	0.000940	-0.067080	-0.005070	-0.055710	-0.044980	-0.008010
0.009700	-0.051860	-0.007820	-0.040020	-0.010790	0.013970	-0.047240	-0.050860	0.002410
0.009720	-0.064100	0.046070	-0.023380	0.010750	-0.006170	-0.012780	-0.061920	0.013550
0.009740	-0.029180	0.116080	0.008860	0.000650	-0.024710	0.018470	-0.074850	0.019540
0.009760	-0.029380	0.064170	0.019030	0.010030	-0.029340	0.028500	-0.074850	0.037530
0.009780	-0.056830	0.032130	0.030990	-0.015970	-0.029950	0.048100	-0.067420	0.052710
0.009800	-0.008840	0.040450	0.008880	-0.039280	-0.003400	0.064850	-0.060090	0.054190
0.009820	0.032450	-0.019650	-0.018700	-0.004830	0.018860	0.033570	-0.047030	0.058510
0.009840	0.002940	-0.025370	0.033100	-0.003950	0.008350	-0.017570	-0.041000	0.066220
0.009860	-0.014740	0.020180	0.072940	-0.011250	0.008250	-0.042070	-0.050340	0.062760
0.009880	-0.037910	-0.008330	0.034890	0.031780	0.018920	-0.057190	-0.052500	0.057980
0.009900	-0.071780	0.001430	0.018520	0.015330	0.009620	-0.060070	-0.053300	0.058650
0.009920	-0.065890	0.053000	0.008670	-0.035060	0.003260	-0.030320	-0.067050	0.058160
0.009940	-0.070170	0.041950	-0.027790	-0.008890	0.005470	-0.007280	-0.073100	0.058600
0.009960	-0.074320	0.059570	0.007740	0.009630	0.001840	-0.003340	-0.064380	0.061840
0.009980	-0.019180	0.087820	0.044440	-0.014550	0.014200	0.011920	-0.060090	0.064240
0.010000	-0.000720	0.030920	0.001920	0.000390	0.033130	0.011680	-0.055200	0.069930
0.010020	-0.043450	-0.000940	-0.001780	-0.007570	0.028120	-0.002850	-0.027510	0.078270
0.010040	-0.025390	0.006890	0.014490	-0.060220	0.022790	0.010680	0.005000	0.067750
0.010060	0.010780	-0.041820	-0.023320	-0.030120	0.032160	0.016600	0.011960	0.044870
0.010080	0.002730	-0.057530	-0.016500	0.027520	0.024280	-0.004960	0.009140	0.038670
0.010100	0.026000	-0.007490	0.020510	0.008370	0.010040	-0.001200	0.004800	0.034900
0.010120	0.027690	-0.009060	-0.011840	0.002810	0.008990	0.011680	-0.011030	0.015400
0.010140	-0.042520	-0.018370	-0.030800	0.013210	-0.001050	0.006850	-0.012810	-0.009860
0.010160	-0.041650	-0.001440	-0.002290	-0.012560	0.000810	0.008190	0.002940	-0.032220
0.010180	0.020170	-0.045320	-0.020140	-0.005560	0.028290	0.005900	0.010980	-0.047070
0.010200	0.029130	-0.060080	-0.037730	0.005360	0.038680	0.005140	0.017170	-0.066240
0.010220	0.050470	0.007650	0.001800	-0.030700	0.034730	0.027490	0.021280	-0.097270