{
	"info": {
		"_postman_id": "7371ffce-e2c9-4726-861f-6914b47b633f",
		"name": "SCP OAuth",
		"schema": "https://schema.getpostman.com/json/collection/v2.1.0/collection.json"
	},
	"item": [
		{
			"name": "https://oauthasservices-p539123trial.hanatrial.ondemand.com/oauth2/api/v1/token",
			"request": {
				"auth": {
					"type": "oauth2",
					"oauth2": [
						{
							"key": "accessToken",
							"value": "b8600fa20577be33e9724eb52412ad",
							"type": "string"
						},
						{
							"key": "tokenType",
							"value": "Bearer",
							"type": "string"
						},
						{
							"key": "addTokenTo",
							"value": "header",
							"type": "string"
						}
					]
				},
				"method": "GET",
				"header": [],
				"url": {
					"raw": "https://oauthasservices-p539123trial.hanatrial.ondemand.com/oauth2/api/v1/token",
					"protocol": "https",
					"host": [
						"oauthasservices-p539123trial",
						"hanatrial",
						"ondemand",
						"com"
					],
					"path": [
						"oauth2",
						"api",
						"v1",
						"token"
					]
				}
			},
			"response": []
		}
	],
	"auth": {
		"type": "oauth2",
		"oauth2": [
			{
				"key": "accessToken",
				"value": "2773626cfb7d98dc458d163b6891948f",
				"type": "string"
			},
			{
				"key": "tokenType",
				"value": "Bearer",
				"type": "string"
			},
			{
				"key": "addTokenTo",
				"value": "header",
				"type": "string"
			}
		]
	},
	"event": [
		{
			"listen": "prerequest",
			"script": {
				"id": "eee2c505-1aaf-4708-a929-b7b1f8391191",
				"type": "text/javascript",
				"exec": [
					""
				]
			}
		},
		{
			"listen": "test",
			"script": {
				"id": "dde6f257-6fb6-4342-b308-d28fdfd4d857",
				"type": "text/javascript",
				"exec": [
					""
				]
			}
		}
	],
	"protocolProfileBehavior": {}
}