{
	"info": {
		"_postman_id": "a7bd095a-f6b5-4a4b-a377-bc5f53f09390",
		"name": "OAuth 2.0 with Keycloak and SAP Gateway",
		"schema": "https://schema.getpostman.com/json/collection/v2.1.0/collection.json"
	},
	"item": [
		{
			"name": "Keycloak logout",
			"event": [
				{
					"listen": "prerequest",
					"script": {
						"id": "51f2e6f9-7d1e-4221-8837-30e2772171b3",
						"exec": [
							"pm.globals.set(\"keycloak_protocol\", \"http\");",
							"pm.globals.set(\"keycloak_server\", \"localhost\");",
							"pm.globals.set(\"keycloak_port\", \"8080\");",
							"pm.globals.set(\"keycloak_realm\", \"master\");",
							"pm.globals.set(\"user_name\", \"yourusername\");",
							"pm.globals.set(\"user_password\", \"insertyourpassword\");",
							"pm.globals.set(\"grant_type\", \"urn:ietf:params:oauth:grant-type:saml2-bearer\");",
							"pm.globals.set(\"client_id\", \"OIDCLIENT\");",
							"pm.globals.set(\"client_password\", \"Initpass01\");",
							"pm.globals.set(\"scope\", \"ZDEMO_CDS_SALESORDERITEM_CDS_0001\");",
							"pm.globals.set(\"gateway_protocol\", \"https\");",
							"pm.globals.set(\"gateway_server\", \"vhcalnplci\");",
							"pm.globals.set(\"gateway_port\", \"44300\");",
							"pm.globals.set(\"gateway_odata_path\", \"sap/opu/odata/sap/\");",
							"pm.globals.set(\"gateway_service\", \"ZDEMO_CDS_SALESORDERITEM_CDS\");",
							"pm.globals.set(\"gateway_service_params\", \"?$format=json\");",
							"",
							"var SAMLRequest = \"fZHNasMwEIRfxejuSkqaxFliQ2goGNIQmtJDb4q8IQJZcrVyf96%2BskNLemivw858M9KKVGs7WPfx7B7xtUeKWb0p2UEUQkwWi0UubhfzXGKj8kJqkS%2BPONPT4xxFU7DsGQMZ70o2uREsq4l6rB1F5WKShFzmUuZy%2BiQlCAGz4oVlm0QwTsXRdY6xA86t18qePUUoEparVIYHVLYl3iqKGHgXfPTaWz7UZdm9DxrHziU7KUs4sPeKyLzhj%2FLRWkcw7itZHxx4RYbAqRYJoobD%2BmELqTd8h7NqNVzDOCNc%2Bf%2B3JyyGYQ%2BrdvutEHLFr2IumR3skq%2Fe7L01%2BnPo36r4d6y8kaNimvw0nkLvqENtTgYblq2t9e936YViWhtDj4xXF%2Bjvn6y%2BAA%3D%3D&RelayState=oucqyqqsxxxoquxworedaoyrcqozbevctbweqdy&SigAlg=http%3A%2F%2Fwww.w3.org%2F2000%2F09%2Fxmldsig%23rsa-sha1&Signature=LPIE3a5TWxycz5PUToEx3RjqcCUAvqwdS0oVKmZZmzrYwADAgvS%2F5vSx3NujwF5q7O6BzU9mAl2tOaGjgCHFqcuxeApeDNUlwT3Y352%2BvKZuzFhMxXcV2njB4srwHBlOhCyr1bri9ZPyadF08W0bGyoYBZyghDhHO0oWIiIQN1ab7Z6Z00JVpGtQqaWHJGUogdy%2FCKTBl8bu5AUTd%2BXY%2F9MGoSyZvcjXC8n6hJ6Ahpwg9HFGtzigKn7M1zs5KP9ymx7jOKa36UMehHw%2FB%2F%2BlTdavkzMWcAyaL6O%2BsySCYsAi5XG2KtOPipv0E0bbDu32fl4Cge4f4Px2P4MLaee4Iw%3D%3D\"",
							"",
							"pm.globals.set(\"SAMLRequest\", SAMLRequest);"
						],
						"type": "text/javascript"
					}
				}
			],
			"request": {
				"method": "POST",
				"header": [],
				"url": {
					"raw": "{{keycloak_protocol}}://{{keycloak_server}}:{{keycloak_port}}/auth/realms/{{keycloak_realm}}/protocol/saml",
					"protocol": "{{keycloak_protocol}}",
					"host": [
						"{{keycloak_server}}"
					],
					"port": "{{keycloak_port}}",
					"path": [
						"auth",
						"realms",
						"{{keycloak_realm}}",
						"protocol",
						"saml"
					]
				}
			},
			"response": []
		},
		{
			"name": "Login Keycloak IdP SAML 2.0 Request",
			"event": [
				{
					"listen": "test",
					"script": {
						"id": "9f2d6fd8-4990-44d2-ba9b-15205c796c57",
						"exec": [
							"const $ = cheerio.load(pm.response.text())",
							"",
							"var keycloakloginurl = $('form').attr('action')",
							"pm.globals.set(\"keycloakloginurl\", keycloakloginurl);",
							"",
							"pm.test(\"Status code is 200\", function () {",
							"    pm.response.to.have.status(200);",
							"});"
						],
						"type": "text/javascript"
					}
				}
			],
			"protocolProfileBehavior": {
				"disableBodyPruning": true
			},
			"request": {
				"auth": {
					"type": "noauth"
				},
				"method": "GET",
				"header": [],
				"body": {
					"mode": "raw",
					"raw": ""
				},
				"url": {
					"raw": "{{keycloak_protocol}}://{{keycloak_server}}:{{keycloak_port}}/auth/realms/{{keycloak_realm}}/protocol/saml?SAMLRequest={{SAMLRequest}}",
					"protocol": "{{keycloak_protocol}}",
					"host": [
						"{{keycloak_server}}"
					],
					"port": "{{keycloak_port}}",
					"path": [
						"auth",
						"realms",
						"{{keycloak_realm}}",
						"protocol",
						"saml"
					],
					"query": [
						{
							"key": "SAMLRequest",
							"value": "{{SAMLRequest}}"
						}
					]
				}
			},
			"response": []
		},
		{
			"name": "Login to Keycloak",
			"event": [
				{
					"listen": "test",
					"script": {
						"id": "05cc706c-b2ea-48cc-a50a-4e845777ff59",
						"exec": [
							"const $ = cheerio.load(pm.response.text())",
							"",
							"pm.test(\"Status code is 200\", function () {",
							"    pm.response.to.have.status(200);",
							"});",
							"",
							"var keycloakSAMLResponse = $('input').attr('value')",
							"",
							"var samlResponse = atob(keycloakSAMLResponse);",
							"var sStart = \"<saml:Assertion\"",
							"var sStop  = \"</samlp:Response>\"",
							"var iStart = samlResponse.indexOf(sStart);",
							"var iStop  = samlResponse.indexOf(sStop);",
							"",
							"var sAssertion = samlResponse.substring(iStart, iStop);",
							"",
							"var sXml = \"<?xml version='1.0' encoding='UTF-8'?>\"",
							"sAssertion = sXml + sAssertion;",
							"",
							"var sPrefixAssertion = sAssertion.replace('<saml:Assertion xmlns', '<saml:Assertion xmlns:saml')",
							"",
							"var samlAssertionBase64 = btoa(sPrefixAssertion)",
							"pm.globals.set(\"keycloakSAMLResponse\", samlAssertionBase64);",
							""
						],
						"type": "text/javascript"
					}
				}
			],
			"request": {
				"method": "POST",
				"header": [
					{
						"key": "Content-Type",
						"name": "Content-Type",
						"value": "application/x-www-form-urlencoded",
						"type": "text"
					}
				],
				"body": {
					"mode": "raw",
					"raw": "password={{user_password}}&username={{user_name}}"
				},
				"url": {
					"raw": "{{keycloakloginurl}}",
					"host": [
						"{{keycloakloginurl}}"
					]
				}
			},
			"response": []
		},
		{
			"name": "Get SAP Gateway Access Token",
			"event": [
				{
					"listen": "test",
					"script": {
						"id": "8ecf9ea9-1087-485e-81c9-0cdc009e51a8",
						"exec": [
							"var jsonData = pm.response.json();",
							"",
							"pm.test(\"Access Token Expire time\", function () {",
							"    pm.expect(jsonData.expires_in).to.eql(\"3600\");",
							"});",
							"pm.test(\"Access token type\", function () {",
							"    pm.expect(jsonData.token_type).to.eql(\"Bearer\");",
							"});",
							"",
							"pm.globals.set(\"access_token\", jsonData.access_token);",
							"pm.globals.set(\"refresh_token\", jsonData.refresh_token);",
							""
						],
						"type": "text/javascript"
					}
				}
			],
			"request": {
				"auth": {
					"type": "basic",
					"basic": [
						{
							"key": "password",
							"value": "{{client_password}}",
							"type": "string"
						},
						{
							"key": "username",
							"value": "{{client_id}}",
							"type": "string"
						}
					]
				},
				"method": "POST",
				"header": [
					{
						"key": "Content-Type",
						"name": "Content-Type",
						"value": "application/x-www-form-urlencoded",
						"type": "text"
					}
				],
				"body": {
					"mode": "urlencoded",
					"urlencoded": [
						{
							"key": "grant_type",
							"value": "{{grant_type}}",
							"type": "text"
						},
						{
							"key": "client_id",
							"value": "{{client_id}}",
							"type": "text"
						},
						{
							"key": "scope",
							"value": "{{scope}}",
							"type": "text"
						},
						{
							"key": "assertion",
							"value": "{{keycloakSAMLResponse}}",
							"type": "text"
						}
					]
				},
				"url": {
					"raw": "https://vhcalnplci:44300/sap/bc/sec/oauth2/token",
					"protocol": "https",
					"host": [
						"vhcalnplci"
					],
					"port": "44300",
					"path": [
						"sap",
						"bc",
						"sec",
						"oauth2",
						"token"
					]
				}
			},
			"response": []
		},
		{
			"name": "Call SAP Gateway OData Service OAuth",
			"request": {
				"auth": {
					"type": "bearer",
					"bearer": [
						{
							"key": "token",
							"value": "{{access_token}}",
							"type": "string"
						}
					]
				},
				"method": "GET",
				"header": [],
				"url": {
					"raw": "{{gateway_protocol}}://{{gateway_server}}:{{gateway_port}}/{{gateway_odata_path}}{{gateway_service}}{{gateway_service_params}}",
					"protocol": "{{gateway_protocol}}",
					"host": [
						"{{gateway_server}}"
					],
					"port": "{{gateway_port}}",
					"path": [
						"{{gateway_odata_path}}{{gateway_service}}{{gateway_service_params}}"
					]
				}
			},
			"response": []
		}
	],
	"protocolProfileBehavior": {}
}