{
  "$schema": "node_modules/lerna/schemas/lerna-schema.json",
  "useNx": true,
  "version": "1.6.14",
  "npmClient": "yarn",
  "useWorkspaces": true,
  "command": {
    "publish": {
      "registry": "https://gitlab.com/api/v4/projects/39140170/packages/npm/"
    }
  }
}
