{
    "@context": "https://www.w3.org/2018/credentials/v1",
    "type": "VerifiablePresentation",
    "verifiableCredential": [
        {
            "@context": [
                "https://www.w3.org/2018/credentials/v1",
                "https://registry.lab.gaia-x.eu/development/api/trusted-shape-registry/v1/shapes/jsonld/trustframework#"
            ],
            "type": "VerifiableCredential",
            "id": "did:web:abc-federation.gaia-x.community",
            "issuer": "did:web:abc-federation.gaia-x.community",
            "issuanceDate": "2023-03-09T13:26:22.009Z",
            "credentialSubject": {
                "id": "ex:myService",
                "type": "gx:ServiceOffering",
                "gx:providedBy": {
                    "id": "did:web:raw.githubusercontent.com:egavard:payload-sign:master"
                },
                "gx:policy": "",
                "gx:termsAndConditions": {
                    "gx:URL": "http://termsandconds.com",
                    "gx:hash": "fdqsdqzdqz"
                },
                "gx:dataAccountExport": {
                    "gx:requestType": "API",
                    "gx:accessType": "digital",
                    "gx:formatType": "application/json"
                }
            },
            "proof": {
                "type": "JsonWebSignature2020",
                "created": "2023-02-09T16:00:15.219Z",
                "proofPurpose": "assertionMethod",
                "verificationMethod": "did:web:raw.githubusercontent.com:egavard:payload-sign:master",
                "jws": "eyJhbGciOiJQUzI1NiIsImI2NCI6ZmFsc2UsImNyaXQiOlsiYjY0Il19..IDp06aOCzKmOn98GG5kM_Cup1VgDtuRuPDvdcPXodo-DkiR06qR8Vpyasyuqp61Bjn-g53s97lNgnS44010oCwBt6-fXKCu_5QP365uXHr3IYo1i1qpbPFhz-eP1QZDiNl4micDxQ8Zy2ib2ZTKGpN7IhfwK9H5K1dpmVy1c_QPr0S9vMb1nCclNsTMWfjCxCL3XmmFWogZs9au5SGZixIcH_llUA5HnLMOWRp97HXEkozYKu52oZX2YndLfI3T2gUgcTAqA63m47HfSEAJKOMUy45A_0O2SX50WSOaVS8M2epLhVyAVOsXVz1Va-qrR2kmx_okR3qCNTlFa1lzNyg"
            }
        },
        {
            "@context": [
                "https://www.w3.org/2018/credentials/v1",
                "https://registry.lab.gaia-x.eu/development/api/trusted-shape-registry/v1/shapes/jsonld/trustframework#"
            ],
            "type": [
                "VerifiableCredential"
            ],
            "id": "did:web:raw.githubusercontent.com:egavard:payload-sign:master",
            "issuer": "did:web:raw.githubusercontent.com:egavard:payload-sign:master",
            "issuanceDate": "2023-03-21T12:00:00.148Z",
            "credentialSubject": {
                "id": "did:web:raw.githubusercontent.com:egavard:payload-sign:master",
                "type": "gx:LegalParticipant",
                "gx:legalName": "Gaia-X European Association for Data and Cloud AISBL",
                "gx:legalRegistrationNumber": {
                    "gx:vatID": "FR0762747721"
                },
                "gx:headquarterAddress": {
                    "gx:countrySubdivisionCode": "BE-BRU"
                },
                "gx:legalAddress": {
                    "gx:countrySubdivisionCode": "BE-BRU"
                },
                "gx-terms-and-conditions:gaiaxTermsAndConditions": "70c1d713215f95191a11d38fe2341faed27d19e083917bc8732ca4fea4976700"
            },
            "proof": {
                "type": "JsonWebSignature2020",
                "created": "2023-02-09T16:00:15.219Z",
                "proofPurpose": "assertionMethod",
                "verificationMethod": "did:web:raw.githubusercontent.com:egavard:payload-sign:master",
                "jws": "eyJhbGciOiJQUzI1NiIsImI2NCI6ZmFsc2UsImNyaXQiOlsiYjY0Il19..AjgH3DJmFwgEDIOQ2ewCLqeWDN3hiAId9z5zAhk8_Vfb8rSvihyNv-cxdl-lcrel_IByZcJEvd5UOYCS8a0vnEC5TozDpcWK8zTpdCbHrF_iLSI_eN-glncgIlMDj5c730g3MCLyr9bCUOBLZAZBCP4dGTzIauvmHTlfLY7nZSxe6UUEsYUNN2v1EX44fFZuWSBIwk5nmwytrsDqrsyxQgDF7Yf8suXtw88TfVF4oxQ4cQA8JoZ2cU6sjXZUPrQ9xGfYG_30yBotMD09ly_gnDCksEXQnRnPmRb0iXrqheXvoaeU153fU2tOh0v7g3Ze79ADxyf86ZhKkaFNvxzQBQ"
            }
        }
    ]
}