{
  "$schema": "http://json-schema.org/draft-07/schema#",
  "title": "ODRL Offer",
  "type": "object",
  "$ref": "https://w3id.org/dspace/2024/1/negotiation/contract-schema.json#/definitions/MessageOffer"
}
